{"text_format":"3","workbook":"xlsx","n_sheets":14,"sheets":["Application guide","1 Survey","2 Indicators","3 Report","4 Adequacy plan","Plan1","Sheet3","Sheet4","Sheet5","Sheet6","Relatório de Assist (2)","Formulas","Data base","SQI1"],"not_rendered":{"charts":6,"images":56,"defined_names":42,"comments":1},"read":"whole","date_system":"1900"}

{"sheet":"Application guide","index":0,"n_rows":303,"n_cols":6,"rows_kept":303,"merged":[[0,1,1,2],[2,1,2,2],[13,1,13,12],[15,1,15,12],[17,1,17,12],[19,1,19,12],[21,1,22,12],[24,1,24,12],[26,1,26,12],[28,0,34,0],[28,1,34,12],[36,0,37,0],[36,1,37,12],[39,0,41,0],[39,1,41,12],[45,1,45,12],[46,1,55,12],[57,1,57,12],[58,1,64,12],[66,1,66,12],[67,1,72,12],[74,1,74,12],[75,1,75,12],[76,1,88,12],[90,1,90,12],[91,1,97,12],[99,1,99,12],[100,1,105,12],[107,1,107,12],[108,1,116,12],[118,1,118,12],[119,1,128,12],[130,1,130,12],[131,1,142,12],[144,1,144,12],[145,1,156,12],[158,1,158,12],[159,1,167,12],[169,1,169,6],[170,3,170,4],[170,5,170,6],[171,3,171,4],[171,5,171,6],[172,3,172,4],[172,5,172,6],[173,3,173,4],[173,5,173,6],[175,1,179,12],[183,1,183,12],[184,1,200,12],[202,1,202,12],[203,1,220,12],[223,1,223,12],[224,1,234,12],[236,1,240,12],[242,1,247,12],[249,1,264,12],[267,1,267,12],[268,1,277,12],[281,1,285,12],[287,1,287,12],[288,1,299,12],[301,1,301,12],[302,1,307,12]]}
[null,"ISA"]
[{"$nulls":3},"APPLICATION GUIDE"]
[null,"ISBN 978-85-99764-26-8"]
[null,"Agroecosystems Sustainability Assessment (ISA)"]
[null,"ISA consists of 7 sections:"]
[null,"1. Application guide"]
[null,"2. Survey"]
[null,"3. Indicators"]
[null,"4. Report"]
[null,"5. Adequacy plan"]
[null,"6. Formulas "]
[null,"7. Data base"]
[null,"Complementary tab - Soil Quality Index (production system scale)"]
[null,"The ISA tool was designed to assess the environmental, social, and economic performance of agroecosystems at the farm scale, as well as to identify limitations, critical points, potentialities, and capabilities across various production systems and occupations. For each indicator, an index raging from 0 to 1 is calculated by comparing on-farm measurements with reference values and applying weghting factors to the corresponding parameters. A baseline value of 0.7 is standardized as the sustainability threshold. A Final Index (Report Tab) is generated based on the average of 17 sustainability indicators. The Soil Quality Index (SQI) tab was developed to assess soil quality at the field-site level and can be replicated for multiple plots or production systems."]
[]
[null,"Applying the ISA \t\t\t\t\t\t\t\t\t"]
[]
[null,"1 - Create a sketch of the farm, starting with the perimeter, using Google Earth or a similar program.\t\t\t\t\t\t\t\t\t\t"]
[]
[null,"2 - Identify in the sketch the various land uses and occupations, including annual crops, perennial crops, pastures, forests, natural habitats, water bodies, springs, dams, and lakes. Specify the locations to be visited for assessing soil, water, and biodiversity conservation practices, road maintenance, and soil sample collection, if necessary. Additionally, identify sites for water quality evaluation, if applicable.\t\t\t\t\t\t\t\t\t"]
[]
[null,"3 - Interview with the Farmer: The information required in the spreadsheet serves as a reference to guide the technician. Based on this information, the technician can explore the subject further to gain a deeper understanding of the farm and the people responsible for it.\t\t\t\t\t\t\t\t\n\t\t\t\t\t\t\t\t\t\t\t"]
[]
[]
[null,"Worksheet data"]
[null,"1. SURVEY"]
[1,"Paste the farm sketch generated in Google Earth or a similar program, including soil use identification"]
[]
[6,"Land ownership refers to the relationship between the farmer and the rural property: Owner - An individual or legal entity that holds full ownership of the rural property, with real estate registration in their name. They possess both direct ownership rights (the right to transfer or sell the property) and beneficial ownership rights (the right to use or enjoy the property); Possessor - Someone who exercises possession rights through a transfer of ownership documented in an agreement. This occurs when the property title has not yet been registered in the real estate records; Tenant - An individual who leases the rural property for agricultural or livestock purposes under conditions of regular use; Sharecropper - Someone who cultivates the land, wholly or partially, under a written or verbal agricultural contract, compensating the owner or beneficial owner with a percentage of the production; Settler - An individual or family included in an agrarian reform project; User - A person who uses the land as a usufructuary, usually with a family connection, but without possession or ownership rights."]
{"$rows_empty":7}
[7,"The ISA is designed to be applied to a single farm. If the farmer has other non-contiguous areas or farms that contribute to their income, they will be described in the table at the end of this section."]
[]
[]
[8,"Identify the production plots for annual crops, perennial crops, pastures, and planted forests, as well as non-agricultural areas (e.g., buildings, roads), reservoirs, lakes, ponds, watercourses, and native vegetation (natural habitats). Also, identify unsuitable areas, such as severely eroded or collapsed areas and other lands that, at the time of evaluation, are unfit for economic activities. The total of all areas listed in this section must correspond to the total area calculated in Item 7. Note: Land use and occupation refer only to the property under analysis and do not include other non-contiguous properties."]
[]
[]
[]
[null,"2 INDICATORS"]
[]
[1,"PRODUCTIVITY AND SALES PRICES"]
[null,"OBJECTIVE\nAssess the farm's annual gross income from agricultural activities, evaluate the productivity and sales value of the most valuable product(s), and compare them with the average productivity and sales values in the municipality or region. Additionally, this indicator examines the relative contribution of each activity to the farm’s total gross income.\nAPPLICATION\n1st STAGE  - Identify the main sources of income from farming activities and list them in descending order based on their estimated annual gross income (Item 1.1): the first row should list the activity generating the highest gross income; the second row should list the activity generating the second-highest gross income;  The remaining activities should be grouped in the third row.                                                                                                                                                                                                     2nd STAGE -  Record the main farming activities and select the unit of measurement for evaluating their productivity. The unit of measurement can be modified in the Formulas Tab.\n3rd STAGE - Input the productivity indices: for perennial crops, consider the average yield over the last two harvests; for annual crops, consider the average yield of the last harvest; for livestock, consider the average production over the past year.\n4th STAGE - Enter the average sales price from the most recent harvest or the previous year. For installment sales, calculate the average price.\n5th STAGE - Record the average productivity and sales prices of products in the region or municipality. Use data from official annual reports, cooperatives, associations, or farmers recognized as benchmarks in the region. The spreadsheet will automatically calculate: a partial result based on productivity factors and sales prices; a final result, separate from the average indicators generated for each business activity. After completing and analyzing the data, analyze the factors influencing agricultural productivity, such as: How was this productivity achieved? How are the activities managed? What is the productive capacity of the soil in agricultural areas? What inputs are used, and in what quantities? What are the criteria for applying these inputs? Is machinery and equipment available, or are services outsourced? Is qualified labor available in the region? What are the strategies for purchasing inputs? Is there post-harvest infrastructure, or does it rely on third-party services? How is the production marketed and transported? By addressing these and other relevant questions, it is possible to understand how the indicator was formed. Based on this analysis, assess whether the indicator is appropriate and identify opportunities for improvement. OBS.  If the average income calculated in the Report Tab is less than USD 50/ha/year—considering the estimated gross income and the total surveyed area—the final score of this indicator will be reduced by 30%."]
{"$rows_empty":10}
[2,"INCOME DIVERSITY\t\t\t\t\t\t\t\t\t\t\t"]
[null,"OBJECTIVE\nEstimate the annual income profile generated by family members directly involved in productive activities on the farm. This includes the proportion of annual income derived from agricultural, livestock, and forestry activities on the farm (Indicator 1), as well as other activities and income sources generated on the farm (e.g., tourism, handicrafts, food processing; Item 2.1) and income generated off the farm (e.g., professional activities, equipment rentals, retirement pensions, scholarships; Item 2.2). The analysis also examines the concentration of gross annual income in a single agricultural activity (Item 2.3).                                                                                                         APPLICATION\nEstimate the income sources generated on the farm (Item 2.1) and off the farm (including agricultural and other activities conducted outside the farm, as well as pensions, retirement benefits, scholarships, and other financial aid—Item 2.2). The percentages for each income source are automatically calculated, along with the assessment of income concentration in a single agricultural activity (above 80%, Item 2.3)."]
{"$rows_empty":7}
[3,"ASSET DEVELOPMENT AND CURRENT INDEBTEDNESS"]
[null,"OBJECTIVE\nThis indicator aims to estimate the asset value of farms by assessing the value invested in improvements, machinery, livestock, and grain stock, whether existing or acquired during the evaluated period. It estimates the farm’s asset value and analyzes the evolution or regression of assets over a defined period. Additionally, it surveys any renovations, current and recently acquired equipment, machinery, and livestock, and describes any increase or loss of productive agricultural land, including irrigated areas. From the established temporal reference point, the spreadsheet compares the sample period (the period being analyzed by the field technician) with the historical period.   This indicator also evaluates the degree of debt by comparing the total value of loans to the total value of the farm. \nAPPLICATION\n1st STAGE - (item 3.1) - Define the period of asset evolution, either 1 year or since the last ISA application.                                                                                                   2nd STAGE - (item 3.2) - Enter the estimated value of recently completed facilities, improvements, or renovations (during the period defined in Item 3.1), as well as the estimated value of facilities and improvements existing before this period (either enter the value or use the value from the last ISA application). Enter the estimated value of newly acquired machines and equipment (during the period defined in the first step, Item 3.1) and the estimated value of existing machinery and equipment before the period (Item 3.2).\n3rd STAGE  - (item 3.3) - Enter the number of animals and agricultural stock, along with their estimated sales value for each category. For the historical value of livestock, check the number of animals and the estimated value of each category. This assessment of structures and stock can be used to update the farmer's profile with the bank.                                                                                                                                                                                                                                                         4th STAGE  - (item 3.4) - Survey the area of irrigated agriculture on the farm. Verify whether there has been any change in the irrigated area in the \"Historical use\" column.\n5th STAGE  - (item 3.5) - Check for any changes in the history of land use and occupation compared to the current occupation described in the survey.                              6th STAGE  - (item 3.6) - Enter the current and historical land price values.                                                                                                                                                       7th STAGE  - (item 3.7) - Sum all short- and long-term loans taken out by the farmer up to the present. \n"]
{"$rows_empty":7}
[4,"ACCESS TO PUBLIC SERVICES"]
[null,"OBJECTIVE\nThis social indicator assesses the availability of certain basic services on rural properties under analysis. Data is collected through interviews with the farmer, considering his perspective on the services available. The evaluation focuses on the quality and quantity of available water, electricity, farm access, health services, school transport, security, internet, and public waste collection. For small farms (Survey Item 7), check the availability of food (vegetables, fruits, tubers, and sources of animal protein) produced on the farm (also checking the areas surrounding the residences) and determine whether it is sufficient to complement the food supply for all people involved in the farm's activities.\nAPPLICATION - Basic services\n1st STAGE  - Check how many residences on the farm are regularly occupied.\n2nd STAGE - For each residence, check the availability of the listed services. To complete this indicator, enter: 1 (satisfactory), 0.5 (partial), or 0 (absent).                    \nAPPLICATION - Domestic food production (small farms)\n1st STAGE - Check how many residences on the farm are regularly occupied.\n2nd STAGE - For each residence, or set of residences, check the production of vegetables, fruits, and animals for domestic consumption.\nOBS: The values for this item are: 1 (present), 2 (partial), or 3 (absent). \"Partial\" means the item is present but insufficient for the family’s consumption. The reference values for a family of 5, assuming an average of 2,630 kcal per day (according to EMATER, MG research), are: 4 citrus trees; 13 papaya trees; 18 banana trees; 2 milking cows; 4 pigs per year; 100 chickens for meat per year; 50 chickens for eggs; 3 cockerels; 200 kg of manioc; 600 kg of vegetables per year (leaves, roots, fruits).                                                                                                                                       \n"]
{"$rows_empty":13}
[5,"EDUCATION AND TRAINING COURSES "]
[null,"OBJECTIVE\nThis social indicator evaluates the educational level of the farmer, their family members directly involved in farm activities, and permanent workers. It also assesses participation in short- and medium-term courses and workshops. The goal is to verify schooling levels and participation in training courses related to the farm’s agricultural activities.\nAPPLICATION\n1st STAGE - Identify the number of adults directly involved in production and the number of permanent employees. Determine the number of school-age dependents residing on the farm.\n2nd STAGE - For each member, record their level of education and participation in courses related to key farm activities. Additionally, verify whether all school-age children are attending school.\n"]
{"$rows_empty":7}
[6,"EMPLOYMENT QUALITY"]
[null,"OBJECTIVE\nVerify compliance with labor legislation and adherence to a series of recommendations and requirements for both permanent and temporary employees.\nAPPLICATION\n1st STAGE - Identify the number of permanent and temporary employees (Item 6.1).\n2nd STAGE - Among the permanent and temporary employees, determine how many meet the requirements of labor legislation (Item 7.1) and comply with the recommendations and determinations of federal government (Item 6.2)."]
[]
[]
[]
[]
[]
[]
[7,"BUSINESS MANAGEMENT"]
[null,"OBJECTIVE\nThis mangement indicator evaluates farm administration practices, the farmer's understanding of these processes, and the management tools they are familiar with and use. It also assesses their awareness of these tools' importance, access to regular technical assistance (not necessarily monthly), participation in cooperatives and/or associations, compliance with environmental regulations, and access to credit. For this indicator, use 1 (satisfactory), 0.5 (partial), or 0 (absent).\nAPPLICATION\n1st STAGE - Verify whether any form of cash-flow management is used.\n2nd STAGE - Determine if production cost records are maintained.\n3rd STAGE - Confirm whether the farmer has access to technical assistance (excluding assistance from salespeople or commercial vendors).\n4th STAGE - Check if the farmer participates in any organization, such as cooperatives, unions, or associations.\n5th STAGE - Assess whether the farmer complies with environmental regulations.\n6th STAGE - Verify if the farmer has access to any form of financial credit."]
{"$rows_empty":9}
[8,"COMMERCIALIZATION AND INNOVATION"]
[null,"OBJECTIVE\nThis management indicator analyzes how the farmer manages the commercialization of their products, the value added through certifications (such as organic products or origin certifications), and production diversification by targeting institutional markets. Regarding innovation, the indicator considers the region where the farmer operates, assessing how he adopts innovative techniques compared to regional standards. It acknowledges that a technique considered outdated in one context might be innovative in another. The evaluation includes whether the farmer seeks market information, accesses value-added markets (certified products or those offering quality-based price differentials), or participates in institutional markets (e.g., government programs facilitating direct farmer-to-consumer sales). It also examines the use of management tools focused on key factors in primary activities, the adoption of innovative and environmentally sustainable techniques, and the farmer’s overall capacity for innovation. This indicator provides insights into how the farmer markets their products, their perspective on innovation, and their openness to new technologies.\nAPPLICATION\n1st STAGE -  Assess how the farmer commercializes their products and obtains market information (e.g., through websites, associations). Determine whether they have certified products or participate in institutional markets (e.g., organic certification, specialty coffee, government programs).\n2nd STAGE - During the farm visit, ask about the main challenges he faces and what measures he has taken to address them. Identify recent technological innovations in the region and whether the farmer has adopted them. Evaluate his innovation capacity, leadership role in the community, and willingness to embrace new techniques. Optionally, assess the adoption of practices promoting permanent and diversified soil coverage.\n"]
{"$rows_empty":10}
[9,"WASTE RESIDUES MANAGEMENT"]
[null,"OBJECTIVE\nThis management indicator evaluates the disposal of sewage and waste generated on the farm, as well as the management and/or reuse of organic solid waste and the treatment of liquid and gaseous effluents. The assessment is based on interviews with the farmer and field analysis. It examines the disposal methods for domestic sewage, the treatment and disposal of farm-generated waste (both recyclable and non-recyclable), the destination of organic solid residues, and the level of treatment and disposal of liquid and gaseous waste produced on-site.\nAPPLICATION\n1st STAGE - Assess the destination of domestic sewage for all site residences (item 9.1).\n2nd STAGE - Examine the disposal methods for domestic and production waste, including recyclable materials (e.g., packaging, plastic, paper, cans) and non-recyclable waste (item 9.2).\n3rd STAGE - Estimate with the farmer the percentage of total organic residues that are composted or reused in production (e.g., manure, chicken bedding).\n4th STAGE - Check whether wastewater is generated from facilities such as stables, animal sheds, or compost units, and estimate the proportion of wastewater that receives adequate treatment and disposal.\n5th STAGE - Determine whether the farm generates waste gases (e.g., from boilers, charcoal production, or digesters) and estimate the proportion of these gases that undergo proper treatment before release into the atmosphere.\n6th STAGE - Identify any critical waste and effluent management issues on the farm, such as: dry (black) septic tanks located near a watercourse or artesian well; untreated effluents (domestic or livestock) discharged into water bodies; open sewage; burning of plastic waste, batteries, or other synthetic materials on the farm."]
{"$rows_empty":12}
[10,"SOIL FERTILITY"]
[null,"OBJECTIVE\nEvaluate soil fertility and biological activity using ten parameters related to the chemical and physical properties of the soil, along with two soil enzymes (Arylsulfatase and Betaglucosidase) associated with biological activity. These parameters were selected specifically for tropical soils. The data used for analyzing soil biology reference the BioAS technology developed by Embrapa (this analysis is optional). The area analyzed should be either the most representative area or the area where interventions will be implemented based on the technical recommendations provided by the ISA diagnosis. Care must be taken to ensure consistency with the units used in the spreadsheet, as some Fertility Reports may use different units. If necessary, convert the report’s units to those required by the ISA spreadsheet.\nAPPLICATION\n1st STAGE - Identify the most representative agricultural production area (either in spatial extent or income generation). Check whether recent soil fertility analyses, including soil texture assessments, have been conducted.\n2nd STAGE - Based on the collected information, determine whether new soil samples need to be taken for laboratory analysis. If required, collect samples while avoiding areas that have been recently fertilized, are near swamps, houses, sheds, or ant nests, or have severe erosion. Samples should be taken at a depth of 0–20 cm. Once collected, mix the soil well to obtain a representative sample, separate approximately 300 g, and place it in a clean plastic bag labeled with the area name, date, and property code before sending it to a soil laboratory. For soil biology analyses, follow the same procedure but collect samples at a depth of 0–10 cm.\n3rd STAGE -  When entering soil analysis data, first describe the plot and the laboratory analysis date. Interpretations of organic matter and phosphorus levels should account for soil texture. Data on soil biological activity involving BioAS can be included (optional). Interpretations are based on the Embrapa system (Mendes et al., 2019).\n"]
{"$rows_empty":12}
[11,"SOIL EROSION AND ROAD MAINTENANCE"]
[null,"OBJECTIVE\nThis environmental indicator aims to map areas or plots within the farm where soils are undergoing degradation. It assesses the stage of the degradation process, the size of the degraded area (in hectares), and the trend of the degradation process (decreasing, unchanged, or intensifying). This indicator also evaluates the presence of drainage structures and rainwater runoff systems, as well as the condition and conservation status of the roads. The assessment is conducted through field analysis, observing the condition of the roads, the presence or absence of drainage and runoff structures, and determining whether there is a need for them. It also evaluates the presence of holes and erosion furrows. The conservation of both internal roads and roads that intersect or border the farm is checked. \nAPPLICATION\n1st STAGE - Identify any areas with soil degradation.\n2nd STAGE - Once identified, determine which area exhibits the greatest intensity and/or most severe stage of degradation. Estimates can be made with the farmer onsite or with the assistance of satellite images. Only one area will be recorded in the spreadsheet, selecting one category (Initial, Intermediate, or Advanced stage).\n3rd STAGE - Indicate the trend of degradation by selecting one of the following options: Reduction, Unaltered, or Intensifying. \n4th STAGE - Go through the access roads that intersect or border the farm, as well as the internal roads, checking their state of conservation and any conservation measures taken.\n5th STAGE - Estimate the degree (%) of conservation measures implemented (item 11.1) and the presence (%) of potholes and erosion grooves (item 11.2).                                 6th STAGE  - Check if there are any critical points on the site that could interfere with access and/or cause runoff of agricultural inputs (item 11.3)."]
{"$rows_empty":9}
[null,"Intensity of the degradation stage"]
[null,null,"Initial","Intermediate",null,"Advanced"]
[null,"Laminar erosion","Reduction of water infiltration, Exposed roots","Removal of the surface soil horizon"]
[null,"Erosion in furrows",null,"Presence of localized shallow furrows",null,"Deep, widespread furrows throughout the area"]
[null,"Erosion in pits",{"$nulls":3},"Presence of pits, mass movement (displacement of large volumes of soil)"]
[]
[null,"ROAD MAITENANCE AND CONSERVATION                                                                                                                                                                                 TRANSVERSAL SLOPE / DECLINE - An inclined cross-section of a road designed to direct runoff into trenches along the roadside.\nFLOOD CONTROL MOUNDS - Raised cross-cutting elevations along the road edges, guiding surface water to areas that can absorb or contain it, such as terraces or retention pits.\nCAPTURE PITS / MINI DAMS - Structures designed to control water flow by capturing runoff in high-volume or erosion-prone areas, preventing and mitigating erosive effects.\nINFILTRATION BASINS  - Constructed depressions, typically at the road edges, that reduce flow volume and promote groundwater recharge.\n"]
{"$rows_empty":7}
[12,"WATER QUALITY "]
[null,"SUPERFICIAL WATER - OBJECTIVE\nAn environmental indicator that assesses the quality of water used on the farm, including both surface water (lakes, ponds, streams, rivers) and groundwater (springs). It also evaluates how the farmer manages the quality of water entering (upstream) and leaving (downstream) the property. When a watercourse is present on the farm, its aquatic ecosystems should be evaluated at two segments (upstream and downstream) using a rapid assessment protocol for aquatic ecosystems (item 12.1). Complementary analyses may be conducted using pH, nitrate, and coliform test strips, as well as turbidity analysis equipment (item 12.2).\nAPPLICATION\n1st STAGE -  Identify watercourses that pass through the farm. Based on this information, choose the most representative or most important watercourse for the farmer (e.g., for water supply or irrigation).\n2nd STAGE - Once the watercourse is defined, identify upstream and downstream sampling locations: upstream – the point where the watercourse enters the farm or a spring; downstream – the point where the watercourse exits the farm or the next location where it merges with another body of water.\n3rd STAGE -  (item 12.1) - Apply the rapid aquatic ecosystem evaluation to each of the chosen sampling locations. The assessment can be completed onsite using a printed checklist, tablet, or notebook.\n4th STAGE (optional) - (item 12.2) -If test strips are used for pH and nitrate readings, record the results immediately. For microbiological analysis using coliform detection strips, incubate for 15 hours before reading. Do not touch the strip, allow excess water to drain, and store it in aluminum foil until incubation. After incubation, count the blue coliform colonies and multiply each by 60 to record on the worksheet. Turbidity assessment can be conducted onsite using portable equipment.\n\nUNDERGROUND WATER - OBJECTIVE\nEvaluate subterranean water quality when present (e.g., water table well, groundwater well, artesian well, or aquifer beneath an impermeable layer).\nAPPLICATION\n1st STAGE (optional) -  Identify wells or other access points to subterranean water (including springs) or sources of water used for human consumption.\n2nd STAGE (optional) - Collect samples for onsite analysis.\n"]
{"$rows_empty":17}
[13,"WATER CONTAMINATION AND PESTICIDE MANAGEMENT"]
[null,"OBJECTIVE\nAssess water contamination by agrochemicals based on the association between the contamination potential of the products used and the vulnerability of the applied area. Vulnerability is determined by soil texture, proximity to watercourses, and land management practices. Contamination potential is evaluated based on the persistence of active ingredients in the environment, their mobility in the soil profile, and their toxicity. This indicator also evaluates the proper use of pesticides, as well as compliance with all legal requirements for their application. The assessment includes determining whether the farmer uses pesticides, identifying the number of people who handle or are exposed to them, and verifying whether they use personal protective equipment. Additionally, it examines the storage conditions and disposal methods for product packaging. (It is also recommended to follow this procedure for veterinary products, particularly those used for parasite control and vaccinations.).\nAPPLICATION\n1st STAGE - Select the primary active ingredient of the products used for pest, disease, and weed control in agricultural systems, pastures, and commercial forests from the provided list (click on the header and select the product – item 13.1).\n2nd STAGE - For each pesticide product, identify the crop, the application area (ha), and the applied volume (L or kg/ha). It is recommended to group pesticides by crop (e.g., coffee, corn, soy), even if a product is used across multiple crops, as application rates may differ.\n3rd STAGE -  The toxicity data, environmental mobility (Koc coefficient, representing the pesticide’s absorption in soil organic matter), and product persistence (t1/2, in-situ half-life in days) are automatically completed. Additional information on active ingredients not listed is available at Herts Pesticide Properties Database. Data on contamination risks for rural workers, consumers, and the environment (Cornell University IEQ index) are also included, along with details on pesticides banned in the European Union.                                                                                                                                                                                                                                                 4th STAGE -  For each pesticide, identify the characteristics of the application area, considering: Clay content (1, 2, or 3, based on item 14.5); Distance to the nearest watercourse (1, 2, or 3, based on item 13.6); Soil management type (1, 2, or 3, based on item 13.7).This step aims to determine the vulnerability of these areas concerning water contamination.\n5th STAGE - The risk of contamination is calculated automatically for each product. To generate a final risk score, enter in item 13.3 the identified crops, their respective area, and for each crop, the highest verified contamination risk (1, 2, or 3, where 3 is the highest). For example, if five pesticide products were applied to a maize crop, with the following contamination risks:Two products rated 1; Two products rated 2; One product rated 3. The recorded value in the indicator will be 3, as it represents the highest contamination risk. The final result considers the maximum risk and the equivalent area of each crop on the farm.                                                                            6th STAGE - Determine whether pesticides are used on any part of the farm, the number of people handling them, and how many use personal protective equipment.\n7th STAGE - Verify whether the storage of pesticides and veterinary products is adequate and whether the farmer disposes of packaging in compliance with local laws.\n"]
{"$rows_empty":19}
[14,"SOIL AND WATER CONSERVATION PRACTICES"]
[null,"OBJECTIVE\nEvaluate the degree of adoption of soil and water conservation measures across all production systems on the farm. Verification is conducted on all crop fields and pastures. Additionally, assess the strategies adopted by the farmer for managing drought or water stress and for conserving and reserving water on the farm.\nAPPLICATION\n1st STAGE - Assess the adoption of soil conservation measures across all production systems identified in the questionnaire (item 8). See below for examples.\n2nd STAGE - After evaluating the degree of adoption of conservation practices—considering the topography, vegetation cover, and, for permanent crops and planted forests, their stage of development—record the respective areas of each plot and pasture according to the following categories: Sufficient – Conservation measures are adequate; Insufficient – Measures are present but inadequate to fully prevent erosion, including low-intensity sheet erosion; Inadequate – Severe lack of soil conservation practices and/or the presence of high-intensity erosion processes.                                                                                                                                                                                                                         3rd STAGE - Discuss with the farmer the degree of adoption of water conservation and reservation strategies across the entire farm. Select one of the following categories: Sufficient; Insufficient; Inadequate or highly fragile situation (item 14.2).\n"]
{"$rows_empty":11}
[null,"SOIL CONSERVATION PRACTICES (ADOPTION INTENSITY)\nHIGH  - Terracing, straw mulching, crop rotations, no-till systems, and permanent, diversified soil cover.                                                                                                 MODERATE - Partial adoption of soil conservation practices, soils without good structure.\nINCIPIENT - Unprotected soil, sowing without following contour lines, or intensive plowing.\nCRITICAL SITUATION - Extreme lack of soil conservation practices, severe erosion processes, compacted soils, use of harrows and plowing, presence of fire, monocultures without crop rotation, no strategies for maintaining soil cover, etc."]
[]
[]
[]
[]
[]
[null,"WATER CONSERVATION AND RESERVATION (REFERENCES)\nSUFFICIENT - Practices adopted are sufficient to guarantee water supply (for drinking and/or irrigated agricultural activities); implementation of structures to minimize the erosive power of surface runoff (primarily runoff) on plots and roads; adoption of strategies to maintain or increase soil organic matter and activate soil biology to stabilize aggregates and improve infiltration and water retention capacity.\nINSUFFICIENT - Practices adopted are not sufficient to ensure water supply for drinking, irrigation, or agricultural activities, nor to prevent erosion processes.\nCRITICAL SITUATION- Scarcity of water for human consumption; for animal consumption; absence of practices for coping with drought; recent erosion."]
[]
[]
[]
[]
[]
[]
[null,"SOIL AND WATER CONSERVATION PRACTICES                                                                                                                                                                                PLANTING ON LEVEL CURVES - Soil preparation is carried out in accordance with the direction of the level curves of the landscape. For areas with low declivity, flood barriers are created to help reduce erosive processes and promote water infiltration.                                                                                                                              PREPARATION WITH MINIMAL TILLAGE - A single hole is created for both seeds and fertilizer, eliminating the need for conventional plowing and harrowing. This method preserves soil quality, preventing erosion and the compaction of deeper soil layers caused by heavy machinery.                                                                                            NO TILLAGE - Planting without plowing the soil, using specific machinery to create a small groove or pit of sufficient depth to ensure proper seed-to-soil contact and adequate cover.\nYEAR-ROUND SOIL PROTECTION - Continuous maintenance of vegetation from previous harvests or the use of cover crops to prevent soil exposure. This reduces evaporation and raindrop impact, as well as surface water flow and erosion. Soil cover also helps reduce invasive plants, enhances soil flora and fauna balance, supports integrated pest and disease management, stabilizes nutrient recycling rates, and promotes biological soil activity.\nWINDBREAKS - Planting trees at regular intervals around crops, perpendicular to prevailing winds, to provide partial shade and reduce wind velocity. These structures can alters microclimates. The shade helps retain soil moisture, while the trees mitigate wind erosion and can attract other wildlife, including birds.\nALTERNATING NATURAL VEGETATION  - Applicable in new areas, where partial deforestation allows alternate rows of permanent native vegetation to remain between cultivated crops. This native vegetation serves as windbreaks and provides a refuge for natural pest predators. Similar to windbreaks, the rows should be planted perpendicular to the prevailing wind.\nINTERCROPPING - Planting species of different sizes, cycles, and behaviors enhances biodiversity and allows for better nutrient absorption across various soil layers.\nTERRACING -   Terraces can be level, off-level, or mixed. Level terraces have blocked extremities to accumulate and infiltrate water and are recommended for areas with good permeability and a slope of up to 12%. Off-level terraces have a gentle gradient and are ideal for directing water to areas with low permeability or slopes greater than 12%. Mixed terraces serve both to accumulate and guide water, holding it until excess water is carried down the sides. On slopes or hills with high water volume and velocity, off-level terracing is recommended. Terrace placement, design, and construction should be carried out by qualified professionals.\n\n\n"]
{"$rows_empty":17}
[15,"BIODIVERSITY CONSERVATION PRACTICES"]
[null,"OBJECTIVE\nAssess the diversity within individual crops and fields, as well as the overall diversity at the farm scale.\nAPPLICATION\n1st STAGE - Evaluate the degree of adoption of practices that promote agrobiodiversity in each plot. These practices include intercropping, consortia, crop-livestock integration, polycultures, agroforestry, green manure, plant barriers, ecological corridors, crop rotation, soil biology activation, and the reduction of disturbances to biological activity (e.g., indiscriminate pesticide use, high-solubility fertilizers, intense mechanization, and monoculture pressure). Item 15.1 can be completed similarly to item 14.1 of Indicator 14 (degree of adoption of conservation practices).\n2nd STAGE - The degree of diversity at the farm scale is measured automatically by evaluating the diversity of phytophysiognomies of the natural habitats (native vegetation) and soil use, using the Shannon-Wiener index.\n3rd STAGE - The diversity of border areas and the farm’s land use is assessed based on the proportion of crops and similar land uses along border areas (e.g., grazing pastures, soybean fields, coffee plantations). This helps determine whether monoculture pressure is present. If more than 70% of the bordering areas share the same land use, mark \"yes\" in item 15.3.\n"]
{"$rows_empty":12}
[null,"BIODIVERSITY CONSERVATION PRACTICES (ADOPTION INTENSITY)\nHIGH  - Intercropping, diversification of cultivated and non cultivated species, use of mixed cover crops, permanent soill cover, minimal or no use of pesticides and soluble fertilizers, use of bio-inputs, and the use of green barriers or strips of perenial species that enhance ecossystems services, such as providing refuge to polynators and natural enemies .                                                                                                                                                                                                                                                                MODERATE - Partial adoption of biodiversity conservation practices. \nINCIPIENT - Low adoption of biodiversity conservation practices (e.g. crop rotation limited to two or three species; use of cover crops with one specie, parcial soil cover throughout the year, incipient use of biological inputs)\nCRITICAL SITUATION - Bare soil, use of fire, monocropping systems without rotation or diversification "]
[]
[]
[]
[]
[]
[16,"NATURAL HABITATS STATUS"]
[null,"OBJECTIVE\nEvaluate the conservation status of remaining native vegetation areas and the number of fragments in which these remnants are distributed on the rural property. Additionally, assess whether these fragments are connected to those on neighboring rural properties, forming ecological corridors. Identify the phytophysiognomy and conservation status with reference to the successional stages of the principal biomes.\nAPPLICATION\n1st STAGE - Identify the different types of native vegetation (select the phytophysiognomy in the header of the indicator table by clicking on the header and choosing from the seven types).\n2nd STAGE - Estimate the area corresponding to each native vegetation fragment and identify its successional stage.\n3rd STAGE  - Check the number of fragments within the farm using field observations and satellite images (item 18.2).\n4th STAGE - Determine whether any fragment is connected to one on neighboring properties (mark with an \"X\" if present) (item 18.3).                                                     5th STAGE - Verify whether all native vegetation fragments are protected from grazing (with sufficient fencing) and fire (presence of firebreaks with annual maintenance). If present, mark with an \"X\" (item 18.4).\n "]
{"$rows_empty":12}
[17,"PRESERVATION AND CONSERVATION RESERVE AREAS "]
[null,"OBJECTIVE\nAssess the use and occupation of land and the conservation status of Preservation Areas (PAs) surrounding springs and water bodies. This evaluation helps determine the overall conservation status of the PAs. Evaluate also whether the remaining native vegetation areas are sufficient to constitute the Conservation Reserve Areas (CRA).\nAPPLICATION\n1st STAGE - Data for item 17.1 is completed automatically, except for the identification of soil use types in PAs (refer to item 9 - Survey).\n2nd STAGE - Verify, both onsite and through satellite imagery, the percentage of PAs that are effectively protected and in good conservation status (item 17.2).               3rd STAGE - Compliance with the CRA is determined automatically for small farms. Otherwise, complete item 17.3: CRA outside the farm – When the CRA, or part of it, is located outside the farm; CRA requiring restoration – When the CRA within the farm requires restoration."]

{"sheet":"1 Survey","index":1,"n_rows":202,"n_cols":10,"rows_kept":202,"merged":[[0,1,1,2],[31,1,31,3],[71,1,71,2],[73,1,73,2],[73,4,73,5],[75,1,75,8],[80,1,80,6],[82,1,82,2],[82,4,82,6],[83,1,83,2],[84,1,84,2],[85,1,85,2],[86,1,86,2],[87,1,87,2],[88,1,88,2],[89,1,89,2],[90,1,90,2],[91,1,91,2],[92,1,92,6],[93,1,93,8],[94,1,94,8],[95,1,95,2],[95,4,95,6],[96,1,96,2],[97,1,97,2],[98,1,98,2],[98,5,98,6],[100,1,100,8],[105,1,105,6],[107,1,107,3],[108,1,108,3],[109,1,109,3],[110,1,110,3],[113,1,113,3],[113,5,113,6],[114,1,114,3],[114,5,114,6],[115,1,115,5],[117,1,117,3],[117,5,117,6],[118,1,118,5],[121,1,121,6],[123,5,123,6],[125,5,125,6],[128,1,128,8],[175,1,175,6],[180,1,180,5],[181,1,181,5],[183,1,184,5],[183,6,184,6],[186,1,186,6],[198,1,198,7],[201,1,201,7]]}
[null,"ISA",null,"SURVEY"]
[]
[1,"FARM'S SKETCH / SATELLITE IMAGE"]
{"$rows_empty":28}
[null,"Fill in all the fields in yellow\t\t"]
[]
[2,"DATE "]
[]
[3,"INTERVIEWER"]
[]
[null,"Name"]
[]
[null,"ID "]
[]
[4,"FARMER"]
[]
[null,"Name"]
[]
[null,"ID "]
[]
[null,"Age (years)"]
[]
[5,"FARM LOCATION"]
[]
[null,"Geolocation* "]
[null,"*Coordinates of decimal degrees"]
[null,"Municipality "]
[]
[null,"State"]
[]
[null,"Watershed*"]
[null,"*the main water course identification"]
[6,"OWNERSHIP"]
[]
[null,"Ownership",null,null,"Choose an option by clicking on the field beside",{"$nulls":3},"Owner "]
[{"$nulls":8},"Sharecropper"]
[null,"Succession process ",null,null,"Choose an option",{"$nulls":3},"Settler"]
[{"$nulls":8},"Tenant"]
[null,"Woman participation (management)",null,null,"Choose an option",{"$nulls":3},"Partner"]
[{"$nulls":8},"User"]
[7,"FARM DESCRIPTION",{"$nulls":6},"Yes"]
[]
[null,"Farm identification",{"$nulls":6},"No"]
[]
[null,"Area - hectares (ha)"]
[]
[null,"Small scale agriculture",null,null,"Choose an option"]
[]
[null,"Other non-contiguous areas and/or rental areas that contribute to the farmer's income"]
[null,"Site identification"]
[]
[null,"Area (ha)"]
[]
[8,"LAND USE AND COVER"]
[]
[null,"Description\t",null,"Current use Area (ha) ","Proportion in relation to total area %\t\t",{"$nulls":4},"                 "]
[null,"Permanent crops\t",null,null,{"$f":"(D84/'3 Report'!$H$5)","v":{"$error":"#DIV/0!"}}]
[null,"Annual crops\t",null,null,{"$f":"(D85/'3 Report'!$H$5)","v":{"$error":"#DIV/0!"}}]
[null,"Pastures\t",null,null,{"$f":"(D86/'3 Report'!$H$5)","v":{"$error":"#DIV/0!"}}]
[null,"Forestry\t",null,null,{"$f":"(D87/'3 Report'!$H$5)","v":{"$error":"#DIV/0!"}}]
[null,"Non-agricultural area\t",null,null,{"$f":"(D88/'3 Report'!$H$5)","v":{"$error":"#DIV/0!"}},{"$nulls":3},{"$f":"SUM(D84:D88,D92)","v":{"v":0,"d":"0.0"}}]
[null,"Fallow\t",null,null,{"$f":"(D89/'3 Report'!$H$5)","v":{"$error":"#DIV/0!"}},"Verification",null,null,{"$f":"D89","v":{"v":0,"d":"0.0"}}]
[null,"Water courses\t",null,null,{"$f":"(D90/'3 Report'!$H$5)","v":{"$error":"#DIV/0!"}},{"$nulls":3},{"$f":"D90","v":{"v":0,"d":"0.0"}}]
[null,"Native vegetation\t",null,null,{"$f":"(D91/'3 Report'!$H$5)","v":{"$error":"#DIV/0!"}},{"$nulls":3},{"$f":"D91","v":{"v":0,"d":"0.0"}}]
[null,"Unsuitable areas*\t",null,null,{"$f":"(D92/'3 Report'!$H$5)","v":{"$error":"#DIV/0!"}},{"$f":"IF(H92>0,(H92/'3 Report'!$H$5),\"\")","v":""},"Total (ha)",{"$f":"SUM(D84:D92)","v":{"v":0,"d":"0.0"}},{"$f":"SUM(I88:I91)","v":{"v":0,"d":"0.0"}}]
[null,"*Areas with intense erosion and other areas that at the time of the evaluation are unusable for economic activities\t\t\t\t\t",{"$nulls":6},{"$f":"SUM(I88:I91)","v":{"v":0,"d":"0.0"}}]
[9,"PRESERVATION AREAS (PAs) (buffer zones along water bodies like rivers, streams, and wetlands)\t"]
[null,"The PPA preservation aims to prevent soil erosion processes, filter runoff, and provide habitats for aquatic and terrestrial species."]
[{"$nulls":3},"Area (ha) ","Proportion in relation to total area (%)\t\t",null,null,0.1]
[null,"PA - Total area estimated\t",null,null,{"$f":"IF(D97>0,D97/I92,0)","v":{"v":0,"d":"0.0%"}},null,null,0.2,{"$f":"D97-D98","v":{"v":0,"d":"0.00"}},{"$f":"IF(I97>0,I97/'1 Survey'!$I$93,\"\")","v":""}]
[null,"PA - area to be recovered*\t",null,null,{"$f":"IF(D98>0,D98/I92,0)","v":{"v":0,"d":"0.0%"}},null,null,0.3]
[{"$nulls":7},0.8]
[10,"CONSERVATION RESERVE AREA (CRA)"]
[null,"Portions of farms are set aside as protected areas where native vegetation and wildlife can thrive. The proportion of these areas depends on farm size, regional biodiversity goals, and regulatory requirements. The exploitation of natural resources within these areas if allowed is limited and requires appropriate licenses. Conservation reserve areas can be part of legal or voluntary programs aimed at improving water quality, preventing soil erosion, and supporting wildlife habitats. Preservation areas can be integrated into conservation reserve areas.\n"]
[]
[null,"Conservation Reserve Area (% of the farm area)",{"$nulls":3},"Set-Asides range"]
[null,"Area with native vegetation exceeding CRA (ha)",null,null,{"$f":"IF(I91>'2 Indicators'!D450,'1 Survey'!I91-'2 Indicators'!D450,0)","v":{"v":0,"d":"0.00"}}]
[]
[11,"WATER RESOURCES (farm level)"]
[{"$nulls":4},"Quantity"]
[null,"Water courses"]
[null,"Springs"]
[null,"Natural lakes and ponds\t\t"]
[null,"Dams"]
[]
[null,"Water source used in the farm:"]
[null,"Superficial",{"$nulls":3},"Choose an option"]
[null,"Underground*\t\t",{"$nulls":3},"Choose an option"]
[null,"*Springs, cisterns, tubular well"]
[]
[null,"Problems with water* ",{"$nulls":3},"Choose an option"]
[null,"*Quality and availability for human consumption and rural activities"]
[null,"Specify (description of the problem)"]
[]
[12,"ENVIRONMENTAL REGULARIZATION"]
[]
[null,"Regularization of water use ",{"$nulls":3},"Choose an option"]
[null,"Issuance or registration of insignificant use."]
[null,"Environmental license ",{"$nulls":3},"Choose an option"]
[null,"Exemption from licensing or Environmental Licensing."]
[]
[13,"FARM'S CRITICAL POINTS (Description of the main problems faced by the farmer)\t"]
[]
[null,"Description"]
[]
[null,"Description"]
[]
[null,"Description"]
[]
[]
[18]
{"$rows_empty":37}
[19,"ATIVIDADE PECUÁRIA (opcional)"]
[]
[null,"19.1 - Utiliza pastagens plantadas para a atividade pecuária",{"$nulls":5},"caso afirmativo marque x"]
[null,"Estimativa da área, considerando áreas próprias e arrendadas (ha)"]
[]
[null,"Total de UA (Unidade Animal) do empreendimento - item 12.3 =>",{"$nulls":4},{"$f":"('2 Indicators'!C71*1.5)+'2 Indicators'!#REF!+'2 Indicators'!#REF!+('2 Indicators'!#REF!*0.75)+('2 Indicators'!#REF!*0.75)+('2 Indicators'!#REF!*0.5)+('2 Indicators'!#REF!*0.5)","v":{"$error":"#REF!"}}]
[null,"Estimativa da taxa média de lotação das áreas com pastagem",{"$nulls":4},{"$f":"IF(G178=\"x\",(G181/G179),\"\")","v":""}]
[]
[null,"Proporção das pastagens no imóvel rural que apresentam processo de  degradação dos solos e baixa capacidade de suporte de animais (%)"]
[]
[]
[20,"ADUBAÇÃO NITROGENADA NA LAVOURA DE MILHO (opcional)"]
[]
[null,"20.1 - Possui lavoura de milho para produção de grãos"]
[null,"Estimativa da área (ha)"]
[]
[null,"20.2 - Possui lavoura de milho para produção de silagem"]
[null,"Estimativa da área (ha)"]
[]
[null,"20.3 - Estimativa da adubação nitrogenada para a lavoura de milho (kg de N/ha)*"]
[null,"*Considerar apenas os adubos nitrogenados solúveis (NPK, ureia, sulfato de amônia, etc.)"]
[]
[null,"20.4 - Produtividade da lavoura de milho para grãos (sc/ha)*"]
[null,"Estimativa da relação: sc milho produzido (60 Kg)/kg de N via adubação/ha ",{"$nulls":6},{"$f":"IF(I189=\"x\",(I198/I195),\"\")","v":""}]
[]
[null,"20.5 - Produtividade da lavoura de milho para silagem (t/ha)*"]
[null,"Estimativa da relação: tonelada (t) de milho produzido (silagem)/kg de N via adubação/ha ",{"$nulls":6},{"$f":"IF(I192=\"x\",(I201/I195),\"\")","v":""}]

{"sheet":"2 Indicators","index":2,"n_rows":460,"n_cols":9,"rows_kept":460,"merged":[[0,1,1,1],[0,2,1,2],[2,1,2,2],[6,1,6,3],[11,1,11,2],[13,1,13,2],[13,6,13,7],[14,1,14,2],[14,6,14,7],[15,1,15,2],[16,1,16,2],[16,6,17,6],[16,7,17,7],[17,1,17,2],[18,1,18,2],[19,1,19,2],[37,1,37,4],[38,1,38,4],[39,1,39,4],[40,1,40,4],[41,1,41,4],[42,1,42,4],[51,1,51,2],[51,6,51,7],[52,6,52,7],[55,1,55,2],[56,6,56,7],[59,1,59,2],[59,6,59,7],[60,6,60,7],[63,1,63,2],[64,6,64,7],[68,1,68,3],[68,4,68,5],[74,3,75,3],[93,1,94,1],[95,5,95,7],[97,1,98,4],[97,5,98,5],[97,6,98,6],[99,2,99,4],[100,1,103,1],[100,2,100,4],[101,2,101,4],[102,2,102,4],[103,2,103,4],[104,1,104,4],[105,1,105,4],[109,1,109,3],[109,6,109,7],[110,1,110,3],[110,6,110,7],[111,1,111,3],[111,6,111,7],[120,3,120,6],[121,1,121,2],[122,1,122,2],[123,1,123,2],[124,1,124,2],[125,1,125,2],[126,1,126,2],[127,1,127,2],[128,1,128,2],[129,1,129,2],[130,1,130,2],[132,1,132,2],[133,1,134,2],[133,3,133,6],[135,1,135,2],[136,1,136,2],[137,1,137,2],[140,1,140,2],[146,1,146,2],[147,1,147,2],[148,1,148,2],[149,1,149,2],[150,1,150,2],[153,1,153,2],[154,1,154,2],[155,1,155,2],[158,1,159,2],[158,3,159,3],[158,4,159,4],[158,5,159,5],[160,1,160,2],[161,1,161,2],[162,1,162,3],[167,1,168,2],[167,3,168,3],[167,4,168,4],[167,5,168,5],[169,1,169,2],[170,1,170,2],[171,1,171,2],[174,1,175,2],[174,3,175,3],[174,4,175,4],[176,1,176,2],[177,1,177,2],[178,1,178,2],[179,1,179,2],[180,1,180,2],[181,1,181,2],[182,1,182,2],[183,1,183,2],[184,1,184,3],[189,2,189,4],[190,1,191,1],[190,2,190,3],[191,2,191,3],[192,1,192,3],[193,1,193,3],[194,1,194,3],[195,1,197,1],[195,2,195,3],[196,2,196,3],[197,2,197,3],[204,1,204,3],[205,1,205,3],[207,1,207,3],[208,1,208,3],[209,1,209,3],[210,1,210,3],[211,1,211,3],[212,1,212,7],[213,1,213,2],[213,4,213,7],[214,1,214,2],[215,1,215,2],[216,1,216,7],[220,3,220,4],[220,6,221,6],[222,1,222,2],[223,1,223,2],[226,1,226,3],[228,1,228,3],[229,1,229,3],[230,1,230,3],[233,1,233,3],[234,2,234,3],[240,1,240,2],[253,1,253,2],[266,17,266,18],[266,19,266,20],[268,1,268,2],[269,1,269,2],[270,1,270,5],[272,1,272,2],[273,1,273,5],[276,1,276,2],[276,3,276,4],[277,1,279,1],[277,2,277,3],[278,2,278,3],[279,2,279,3],[280,3,280,4],[281,1,282,1],[281,2,281,3],[282,2,282,3],[284,1,284,3],[285,2,285,3],[291,6,292,7],[294,1,295,1],[296,1,297,1],[298,1,299,1],[300,1,301,1],[302,1,303,1],[304,1,305,1],[306,1,307,1],[309,1,309,5],[312,1,313,1],[314,1,315,1],[316,1,317,1],[318,1,319,1],[321,1,322,1],[324,1,325,1],[327,1,327,5],[328,1,328,2],[330,1,330,2],[331,1,331,2],[332,1,332,2],[333,1,333,2],[338,1,338,2],[339,1,339,2],[340,1,340,2],[341,1,341,2],[342,1,342,2],[343,1,343,2],[344,1,344,2],[345,1,345,2],[346,1,346,2],[347,1,347,2],[348,1,348,2],[349,1,349,2],[350,1,350,2],[351,1,351,2],[352,1,352,2],[353,1,353,2],[354,1,354,2],[355,1,355,2],[356,1,356,2],[357,1,357,2],[359,1,359,2],[359,3,359,4],[360,1,360,2],[361,1,361,2],[362,1,362,2],[363,1,363,2],[364,1,364,2],[366,1,366,2],[367,1,367,2],[368,1,368,2],[372,1,372,2],[373,1,373,3],[374,1,374,3],[376,1,376,3],[377,1,377,3],[385,2,386,2],[387,1,390,1],[391,1,391,2],[391,5,391,6],[394,1,394,2],[401,2,402,2],[403,1,406,1],[407,1,407,2],[408,1,408,4],[408,5,408,6],[409,1,409,4],[412,1,412,3],[415,1,415,4],[422,1,424,1],[428,1,428,4],[431,1,431,4],[433,1,433,4],[437,7,439,7],[439,1,439,2],[440,1,441,1],[440,2,440,4],[441,2,441,4],[444,1,444,4],[448,1,448,4],[449,1,449,2],[450,1,450,2],[451,1,451,2],[452,1,455,1],[452,2,452,4],[453,2,453,4],[454,2,454,4],[455,2,455,4],[456,1,456,3],[461,27,461,28]]}
[null,"ISA","INDICATORS"]
[]
[null,"Complete the fields in yellow"]
[]
[1,"PRODUCTIVITY AND SALES PRICES"]
[]
[null,"1.1 Estimated gross annual income on the farm (descending order)"]
[null,null,"Choose an option\t","Annual estimated value ($)\t"]
[null,"Activity 1 (higher income)",null,null,{"$f":"(D9/($D$9+$D$10+$D$11+D28+$D$29+$D$30+'2 Indicators'!$D$34+'2 Indicators'!D35))","v":{"$error":"#DIV/0!"}}]
[null,"Activity 2",null,null,{"$f":"(D10/($D$9+$D$10+$D$11+D28+$D$29+$D$30+'2 Indicators'!$D$34+'2 Indicators'!D35))","v":{"$error":"#DIV/0!"}}]
[null,"Others activities",null,null,{"$f":"(D11/($D$9+$D$10+$D$11+$D$28+$D$29+$D$30+'2 Indicators'!$D$34+D35))","v":{"$error":"#DIV/0!"}}]
[null,"*Agricultural, livestock and/or forestry activities carried out at the farm"]
[]
[null,"1.2 Productivity of the main activities ",null,"Activity 1","Activity 2","Activity 3"]
[null,"Activities (select)",{"$nulls":4},"Weighting factor \t"]
[null,"Units of measurement (select)",{"$nulls":4},"> 20%",0.9]
[null,"Current mean productivity\t",{"$nulls":4},"Production or sale price = local ",0.7]
[null,"Mean selling price ($/un.)\t"]
[null,"Mean local productivity",{"$nulls":4},"< 20%",0.5]
[null,"Mean local price ($/un.)\t",{"$nulls":4},"< 40%",0.3]
[]
[null,"Result",{"$f":"IF(D17>0,Formulas!G15,0)","v":{"v":0,"d":"0.00"}},"Reference: Depontti (2002); Mattos Filho (2004); Lopez e Ridaura (2001)."]
[]
[2,"INCOME DIVERSITY"]
[]
[null,"2.1 Estimated gross annual income of other activities on the farm*\t\t\t"]
[null,null,"Activities description\t","Annual estimated value ($)\t"]
[null,"Activity 1",null,null,{"$f":"(D28/($D$9+$D$10+$D$11+$D$29+$D$30+'2 Indicators'!$D$34+D28+D35))","v":{"$error":"#DIV/0!"}}]
[null,"Activity 2",null,null,{"$f":"(D29/($D$9+$D$10+$D$11+$D$29+$D$30+'2 Indicators'!$D$34+'2 Indicators'!D35+D28))","v":{"$error":"#DIV/0!"}}]
[null,"Others activities",null,null,{"$f":"(D30/($D$9+$D$10+$D$11+$D$28+$D$29+$D$30+'2 Indicators'!$D$34+'2 Indicators'!D35))","v":{"$error":"#DIV/0!"}}]
[null,"*Tourism, handicrafts, agribusiness, processed foods, etc."]
[]
[null,"2.2 Estimated gross annual income off-site activities*"]
[null,"Pension, retirement, financial aid ($)",null,null,{"$f":"(D34/('2 Indicators'!$D$9+'2 Indicators'!$D$10+'2 Indicators'!$D$11+$D$28+'2 Indicators'!$D$29+'2 Indicators'!$D$30+$D$34+'2 Indicators'!D35))","v":{"$error":"#DIV/0!"}}]
[null,"Other activities outside the farm ($)",null,null,{"$f":"(D35/('2 Indicators'!$D$9+'2 Indicators'!$D$10+'2 Indicators'!$D$11+$D$28+'2 Indicators'!$D$29+'2 Indicators'!$D$30+$D$35+'2 Indicators'!D34))","v":{"$error":"#DIV/0!"}}]
[null,"*All the incomes of family members with direct ties to the establishment (machinery rental, off-site employment, services rendered, etc.)"]
[]
[null,"2.3 Income Diversity\t\t\t",{"$nulls":3},"Proportion of income  (%)","Weighting factor"]
[null,"Agricultural, livestock and forestry activities carried out on the farm\t",{"$nulls":3},{"$f":"(E11+E10+E9)","v":{"$error":"#DIV/0!"}},{"v":2,"d":"2.0"}]
[null,"Other activities on the farm\t\t\t",{"$nulls":3},{"$f":"(E30+E29+E28)","v":{"$error":"#DIV/0!"}},{"v":2,"d":"2.0"}]
[null,"Off-site activities\t",{"$nulls":3},{"$f":"'2 Indicators'!E35","v":{"$error":"#DIV/0!"}},{"v":1,"d":"1.0"}]
[null,"Retirement; Pension; Financial help; Other sources of income\t",{"$nulls":3},{"$f":"'2 Indicators'!E34","v":{"$error":"#DIV/0!"}},0.3]
[null,"Concentration in a single activity on the farm (> 80% of the total income verified)\t",{"$nulls":3},{"$f":"IF('2 Indicators'!E9>0.8,\"Yes\",\"no\")","v":{"$error":"#DIV/0!"}},"Income ratio verification",{"$f":"F39+F40+F41+F42","v":{"$error":"#DIV/0!"}}]
[]
[null,"Result",{"$f":"IF(H43<0.99,\"\",Formulas!H32)","v":{"$error":"#DIV/0!"}},"Adaptation APOIA-NovoRural (Rodrigues et al, 2010), Deponti (2002)."]
[]
[3,"ASSET DEVELOPMENT AND CURRENT INDEBTEDNESS"]
[]
[null,"3.1 Equity evolution period (years)\t\t"]
[]
[null,"3.2 Farm asset evaluation\t\t\t"]
[null,"3.2.1 Construction / Renovation (recent period)* \t",{"$nulls":4},"Valor histórico*"]
[null,"Description","Estimated value ($)\t"]
[null,null,{"v":1E-3,"d":"$0.00"}]
[null,"*evaluation period defined on item 3.1"]
[null,"3.2.2 Existing buildings and constructions on the farm*"]
[null,"Description","Estimated value ($)\t",{"$nulls":3},{"$f":"IF(C58>0,((1+0.04167)^'2 Indicators'!$D$49*C58),\" \")","v":{"v":1E-3,"d":"R$ 0.00"}}]
[null,null,{"v":1E-3,"d":"$0.00"},null,"Historical Value*"]
[null,"*Depreciation - 40 years","Total",{"$f":"C58+C54","v":{"v":2E-3,"d":"$0.00"}},{"$f":"SUM(G57:G57)","v":{"v":1E-3,"d":"$0.00"}}]
[null,"3.2.3 Equipment - acquired ",{"$nulls":4},"Valor histórico*"]
[null,"Description","Estimated value ($)\t"]
[null,null,{"v":1E-3,"d":"$0.00"}]
[null,"*evaluation period defined on item 3.1"]
[null,"3.2.4 Equipment - existing on the farm*"]
[null,"Description","Estimated value ($)\t",{"$nulls":3},{"$f":"IF(C66>0,((1+0.052632)^'2 Indicators'!$D$49*C66),\" \")","v":{"v":1E-3,"d":"R$ 0.00"}}]
[null,null,{"v":1E-3,"d":"$0.00"},null,"Historical Value*"]
[null,"*Depreciation - 20 years","Total",{"$f":"C66+C62","v":{"v":2E-3,"d":"$0.00"}},{"$f":"SUM(G65:G65)","v":{"v":1E-3,"d":"$0.00"}}]
[]
[null,"3.3 Animals / stock*",null,null,"Historical (before period defined item 3.1)"]
[null,"Description (choose)","Amount (un.)","Current value ($)","Amount (un.)","Value ($)"]
[{"$nulls":5},{"v":1E-3,"d":"$0.00"}]
[{"$nulls":5},{"v":1E-3,"d":"$0.00"}]
[null,"*Maize, soybeans, coffee, etc.","Total",{"$f":"SUM(D71:D72)","v":0},"Total",{"$f":"SUM(F71:F72)","v":{"v":2E-3,"d":"R$ 0.00"}}]
[]
[null,"3.4 Irrigation Systems",null,"Historical use (ha)*"]
[null,"Irrigation system","Total area (ha)"]
[]
[null,"*before the period defined in item 3.1"]
[null,"3.5 Land use and cover","Current use (ha)","Historical use (ha)*"]
[null,"Permanent crops\t",{"$f":"'1 Survey'!D84","v":0},{"$f":"C80","v":{"v":0,"d":"0.00"}}]
[null,"Annual crops\t",{"$f":"'1 Survey'!D85","v":0},{"$f":"C81","v":{"v":0,"d":"0.00"}}]
[null,"Pastures\t",{"$f":"'1 Survey'!D86","v":0},{"$f":"C82","v":{"v":0,"d":"0.00"}}]
[null,"Forestry\t",{"$f":"'1 Survey'!D87","v":0},{"$f":"C83","v":{"v":0,"d":"0.00"}}]
[null,"Non-agricultural area\t",{"$f":"'1 Survey'!D88","v":0},{"v":0,"d":"0.00"}]
[null,"Fallow\t",{"$f":"'1 Survey'!D89","v":0},{"v":0,"d":"0.00"}]
[null,"Water courses\t",{"$f":"'1 Survey'!D90","v":0},{"v":0,"d":"0.00"}]
[null,"Native vegetation\t",{"$f":"'1 Survey'!D91","v":0},{"v":0,"d":"0.00"}]
[null,"Unsuitable areas\t",{"$f":"'1 Survey'!D92","v":0},{"v":0,"d":"0.00"}]
[null,"Total (ha)",{"$f":"SUM(C80:C88)","v":{"v":0,"d":"0.00"}},{"$f":"SUM(D80:D88)","v":{"v":0,"d":"0.00"}}]
[null,"*before the period defined in item 3.1"]
[null,"3.6 Land value\t","Current ($/ha)","Historical ($/ha)* "]
[null,"Reference value "]
[null,"*before the period defined in item 3.1"]
[null,"Estimated farm's total asset values**","Current ($/ha)","Historical ($/ha)* "]
[null,null,{"$f":"Formulas!E57+'2 Indicators'!D73+'2 Indicators'!D67+'2 Indicators'!D59","v":{"$error":"#DIV/0!"}},{"$f":"Formulas!J57+'2 Indicators'!E59+'2 Indicators'!E67+'2 Indicators'!F73","v":{"$error":"#DIV/0!"}}]
[null,"**(Sum of improvements, machines, equipment, animals and land value)"]
[]
[null,"Asset development ",{"$nulls":3},"Evolution in the period (%)","Weighting factor"]
[]
[null,"External factor","Land value in the region\t\t",null,null,{"$f":"IF('2 Indicators'!C92>0,('2 Indicators'!C92/'2 Indicators'!D92-1),\"\")","v":""},{"v":0.67,"d":"0.7"}]
[null,"Internal factors (Farm)","Buildings ",null,null,{"$f":"IF('2 Indicators'!D59>0,('2 Indicators'!D59/'2 Indicators'!E59-1),\"\")","v":{"v":1,"d":"100.0%"}},{"v":1,"d":"1.0"}]
[null,null,"Equipment\t\t",null,null,{"$f":"IF('2 Indicators'!D67>0,('2 Indicators'!D67/'2 Indicators'!E67-1),\"\")","v":{"v":1,"d":"100.0%"}},{"v":1,"d":"1.0"}]
[null,null,"Animals / Grain stock\t\t",null,null,{"$f":"IF('2 Indicators'!D73>0,('2 Indicators'!D73/'2 Indicators'!F73-1),\"\")","v":""},{"v":1,"d":"1.0"}]
[null,null,"Increase in the agriculture area and/or irrigation area\t\t",null,null,{"$f":"+Formulas!H59","v":{"$error":"#DIV/0!"}},{"v":1,"d":"1.0"}]
[null,"Anual asset development (%)\t\t\t",{"$nulls":3},{"$f":"(+Formulas!H63)/D49","v":{"$error":"#DIV/0!"}}]
[null,"Anual asset development discounting land appreciation (%)\t\t\t",{"$nulls":3},{"$f":"(Formulas!H61)/D49","v":{"$error":"#DIV/0!"}}]
[null,"Partial result",{"$f":"IF(Formulas!I39>1,1,Formulas!I39)","v":{"$error":"#DIV/0!"}},"Reference: Rodrigues et al, 2010; Gitman and Zutter (2015)."]
[]
[null,"3.7 Current Indebtdeness",{"$nulls":3},"% debt/equity","Weighting factor"]
[null,"Total amount of debt and investments in relation to the asset ",{"$nulls":3},"0-7,5%","07 - 1 (y = 0,04x + 0,7)"]
[null,"Total Amount - financing and other financial commitments\t",{"$nulls":3},"7,5-30%","1 - 01 (y = -0,04x + 1,3)"]
[null,"Value of debt in relation to equity (%)\t",null,null,{"$f":"E111/C95","v":{"$error":"#DIV/0!"}},">30%",0.1]
[null,"Partial result",{"$f":"Formulas!G68","v":{"$error":"#DIV/0!"}},"Adaptation APOIA-NovoRural (Rodrigues et al, 2010), Deponti (2002)."]
[]
[null,"Result",{"$f":"IF(C107=\"\",\"\",((C107*2)+C113)/3)","v":{"$error":"#DIV/0!"}}]
[]
[4,"ACCESS TO PUBLIC SERVICES"]
[]
[null,"4.1 Number of residences"]
[]
[{"$nulls":3},"Choose an option: 1 (satisfactory); 0.5 (partial); 0 (absent)           \t\t\t         "]
[null,"4.2 Basic services available \t",null,"Rural residence (1)","Other residences","Weighting factor"]
[null,"Water availability (quantity and quality)\t",{"$nulls":3},{"v":1,"d":"1.0"}]
[null,"Access to electricity\t",{"$nulls":3},{"v":1,"d":"1.0"}]
[null,"Regular road access to the farm\t",{"$nulls":3},{"v":1,"d":"1.0"}]
[null,"Access to health care",{"$nulls":3},{"v":1,"d":"1.0"}]
[null,"Regular access to school transportation\t",{"$nulls":3},{"v":1,"d":"1.0"}]
[null,"Security in the area (patrol for rural policing)\t",{"$nulls":3},{"v":1,"d":"1.0"}]
[null,"Internet\t",{"$nulls":3},{"v":1,"d":"1.0"}]
[null,"Waste collection by the municipality\t",{"$nulls":3},{"v":1,"d":"1.0"}]
[]
[null,"Partial result",{"$f":"IF('1 Survey'!E118=\"sim\",(Formulas!H77/10),(Formulas!H77/8))","v":{"v":0,"d":"0.00"}},"Adaptation APOIA-NovoRural (Rodrigues et al, 2010)."]
[]
[null,"4.3 Domestic food production (only for small scale agriculture)\t",null,"Choose an option: 1 (satisfactory); 0.5 (partial); 0 (absent)           \t\t\t         "]
[{"$nulls":3},"Rural residence (1)","Other residences","Weighting factor"]
[null,"Vegetables, grains, and tubers\t",{"$nulls":3},{"v":1,"d":"1.0"}]
[null,"Orchard\t",{"$nulls":3},{"v":1,"d":"1.0"}]
[null,"Milk, eggs, and meat production\t",{"$nulls":3},{"v":1,"d":"1.0"}]
[]
[null,"Partial result",{"$f":"IF('1 Survey'!D74=\"No\",\"\",Formulas!F89/3)","v":{"v":0,"d":"0.00"}},"Reference - Correa (2007)."]
[]
[null,"Result",{"$f":"IF(C140=\"\",C132,(((C132*2)+C140)/3))","v":{"v":0,"d":"0.00"}}]
[]
[5,"EDUCATION AND TRAINING COURSES "]
[{"$nulls":3},"Fill in the number of people in each field"]
[null,"5.1 Degree of education",null,"Family members","Permanent workers"]
[null,"Number of people working in the farm\t",{"$nulls":3},"Weighting factor"]
[null,"Less than 9 years of study\t",{"$nulls":3},0.7]
[null,"Complete primary education",{"$nulls":3},{"v":1,"d":"1.0"}]
[null,"Complete secondary education",{"$nulls":3},1.2]
[null,"College / University",{"$nulls":3},1.5]
[]
[{"$nulls":3},"Fill in the number of people in each field"]
[null,"5.2 Courses related to the farm's main activities",null,"Family members","Permanent workers"]
[null,"Short training season\t",{"$nulls":3},0.5]
[null,"Long-term training\t",{"$nulls":3},0.8]
[]
[{"$nulls":3},"Fill in the number of people in each field"]
[null,"5.3 Education",null,"Family members (6 - 18 years old)","Family members of resident workers (6 - 18 years old)","Weighting factor"]
[]
[null,"Number of children living on the farm\t"]
[null,"Number of children in school\t",{"$nulls":3},{"v":1,"d":"1.0"}]
[]
[null,"Result",{"$f":"IF(Formulas!K96>1,1,Formulas!K96)","v":{"$error":"#DIV/0!"}},"Reference: Calorio (1997), Correa (2007) e Rodrigues et al. (2003)."]
[]
[6,"EMPLOYMENT QUALITY"]
[{"$nulls":3},"Fill in the number of people in each field"]
[null,"6.1 Compliance with Labor Legislation\t\t",null,"Permanent employees","Temporary employees","Weighting factor"]
[]
[null,"Number of employees in the farm\t\t"]
[null,"Employee registration\t\t",{"$nulls":3},{"v":1,"d":"1.0"}]
[null,"Overtime payment / absence of overtime\t\t",{"$nulls":3},{"v":1,"d":"1.0"}]
[]
[{"$nulls":3},"Fill in the number of people in each field"]
[null,"6.2 Adoption of benefits / compliance with the Labor Legislation\t\t\n\t\t",null,"Permanent employees","Temporary employees"]
[]
[null,"Above minimum wage\t\t",{"$nulls":3},{"v":1,"d":"1.0"}]
[null,"Food supplementation\t\t",{"$nulls":3},{"v":1,"d":"1.0"}]
[null,"Housing assistance\t\t",{"$nulls":3},{"v":1,"d":"1.0"}]
[null,"Education and transportation assistance\t\t",{"$nulls":3},{"v":1,"d":"1.0"}]
[null,"Profit sharing\t\t",{"$nulls":3},{"v":5,"d":"5.0"}]
[null,"Accident insurance\t\t",{"$nulls":3},{"v":3,"d":"3.0"}]
[null,"Access to leisure\t\t",{"$nulls":3},{"v":1,"d":"1.0"}]
[null,"Space for growing food\t\t",{"$nulls":3},{"v":3,"d":"3.0"}]
[]
[null,"Result",{"$f":"IF(Formulas!H108>1,1,Formulas!H108)","v":{"v":0.7,"d":"0.70"}},"Adaptation APOIA-NovoRural (Rodrigues et al, 2010)."]
[]
[7,"BUSINESS MANAGEMENT"]
[]
[null,null,"Choose an option: 1 (complies satisfactorily); 0.5 (partially); 0 (nonexistent)\t  \t\t\t         ",null,null,"Weighting factor"]
[null,"7.1 Accounting","Cash flow (income / expense)\t",null,null,{"v":1,"d":"1.0"}]
[null,null," Production's cost \t",null,null,{"v":1,"d":"1.0"}]
[null,"7.2 Access to technical assistance*\t\t",{"$nulls":3},{"v":1,"d":"1.0"}]
[null,"7.3 Existence of rural associations and the farmer's participation\t",{"$nulls":3},{"v":1,"d":"1.0"}]
[null,"7.4 Environmental regularization (water use, licensing)\t\t",{"$nulls":3},{"v":2,"d":"2.0"}]
[null,"7.5 Credit\n","Access to investment loans\t",null,null,0.4]
[null,null,"Access to loans for the farm activities\t",null,null,0.4]
[null,null,"Access loans for commercialization\t",null,null,0.2]
[null,"* Do not consider technical assistance from resales companies."]
[null,"Result",{"$f":"((+E191*F191+E192*F192+E193+E194+E195*2+E196*F196+E197*F197+E198*F198)/7)","v":{"v":0,"d":"0.00"}},"Reference: Correa (2007)."]
[]
[8,"COMMERCIALIZATION AND INNOVATION"]
[]
[null,"8.1 Commercialization",null,null,"Choose an option\t","Weighting factor"]
[null,"Buyer diversification / Market research, pre-sale pricing\t",{"$nulls":3},0.4]
[null,"Certified production /  Added value\t\t",{"$nulls":3},0.4]
[]
[null,"8.2 Innovation (conservation / regenerative practices)",null,null,"Choose an option\t"]
[null,"Adoption of innovative techniques*\t\t",{"$nulls":3},0.3]
[null,"Description"]
[null,"Ability to innovate or leadership\t\t",{"$nulls":3},0.4]
[null,"Description"]
[null,"* Concept, practice or technology, perceived as new by the individual or social group. Scientific and technological knowledge transformed into good practices (conservation / regenerative agriculture principles\t)\t\t\t\t\t"]
[null,"8.3 Adoption of conservation / regenerative practices (optional)",null,"Choose an option ","If so, what proportion of the production area adopts this practice (%)"]
[null,"Use of bioinputs in production areas"]
[null,"Use of cover crops / perennials for shading**"]
[null,"** Strategies for permanent soil cover; increasing biodiversity and/or animal welfare"]
[null,"Result",{"$f":"IF(Formulas!F128>1,1,Formulas!F128)","v":{"v":0,"d":"0.00"}}]
[]
[9," WASTE RESIDUES MANAGEMENT"]
[{"$nulls":3},"Choose an option by clicking the field below",null,null,"Weighting factor"]
[{"$nulls":3},"Rural residence (1)","Other residences"]
[null,"9.1 Sewage destination\t",{"$nulls":3},{"$f":"Formulas!M144","v":{"$error":"#DIV/0!"}},{"v":1,"d":"1.0"}]
[null,"9.2 Garbage destination",{"$nulls":3},{"$f":"Formulas!M150","v":{"$error":"#DIV/0!"}},{"v":1,"d":"1.0"}]
[]
[null,"Mandatory field",null,null,"(%)"]
[null,"9.3 Composting and/or reuse of organic solid waste\t\t\t",{"$nulls":4},{"v":1,"d":"1.0"}]
[]
[null,"Leave the field blank when there is no generation of liquid and/or gaseous effluents",null,null,"(%)"]
[null,"9.4 Adequate allocation and treatment of liquid effluents*.\t\t\t",{"$nulls":3},{"$f":"IF(ISBLANK(E230),Formulas!$K$136,\" \")","v":"Not applicable"},{"v":1,"d":"1.0"}]
[null,"9.5 Treatment of gaseous effluents (generated in boilers, biodigesters).\t\t\t",{"$nulls":3},{"$f":"IF(ISBLANK(E231),Formulas!$K$136,\" \")","v":"Not applicable"},{"v":1,"d":"1.0"}]
[null,"* Treatment station; Biodigestor; Composting; etc."]
[{"$nulls":4},"Choose an option\t"]
[null,"9.6 Critical point regarding the management of waste/effluents*\t\t\t"]
[null,null,"*Critical situation - specify"]
[null,"Result",{"$f":"IF(Formulas!H136=0,0.7,+Formulas!F137)","v":{"v":0.7,"d":"0.70"}},"Adaptation APOIA-NovoRural (Rodrigues et al, 2010)."]
[]
[10,"SOIL FERTILITY"]
[]
[null,"Plot identification \t"]
[null,"10.1 Soil chemical analysis",null,null,"Result "]
[null,"Clay content",null,"dag kg-1 (%) Clay",{"$f":"IF(ISBLANK(C242),0,IF(C242<=15,Formulas!H156,IF(AND(C242>15,C242<35),Formulas!H157,IF(AND(C242>=35,C242<=60),Formulas!H158,IF(C242>60,Formulas!H159)))))","v":{"v":0,"d":"0.00"}}]
[null,"Organic matter",null,"(dag kg-1)",{"$f":"IF(Formulas!M168>1,1,IF(Formulas!M168<0,0,Formulas!M168))","v":{"v":0,"d":"0.00"}}]
[null,"Available P",null,"(mg dm-3) (Mehlich-1)",{"$f":"IF(Formulas!F197>1,1,IF(Formulas!F197<0,0,Formulas!F197))","v":{"v":0,"d":"0.00"}}]
[null,"Exchangeable Ca",null,"(cmolc dm-3)",{"$f":"IF(ISBLANK(C245),0,IF(Formulas!I205>1,1,IF(Formulas!I205<0,0,Formulas!I205)))","v":{"v":0,"d":"0.00"}}]
[null,"Exchangeable Mg",null,"(cmolc dm-3)",{"$f":"IF(ISBLANK(C246),0,IF(Formulas!I214>1,1,IF(Formulas!I214<0,0,Formulas!I214)))","v":{"v":0,"d":"0.00"}}]
[null,"Exchangeable K",null,"(mg dm-3)",{"$f":"IF(ISBLANK(C247),0,IF(Formulas!I223>1,1,IF(Formulas!I223<0,0,Formulas!I223)))","v":{"v":0,"d":"0.00"}}]
[null,"pH",null,"Index",{"$f":"IF(ISBLANK(C248),0,IF(Formulas!H232>1,1,IF(Formulas!H232<0,0,Formulas!H232)))","v":{"v":0,"d":"0.00"}}]
[null,"Exchangeable Al",null,"(cmolc dm-3)",{"$f":"IF(C249>2,0,IF(ISBLANK(C249),0,IF(Formulas!H240>1,1,IF(Formulas!H240<0,0,Formulas!H240))))","v":{"v":0,"d":"0.00"}}]
[null,"CEC",null,"(cmolc dm-3)",{"$f":"IF(ISBLANK(C250),0,Formulas!H248)","v":{"v":0,"d":"0.00"}}]
[null,"Base Saturation",null,"(%)",{"$f":"IF(ISBLANK(C251),0,IF(Formulas!H256>0.83,1,IF(Formulas!H256<0,0,Formulas!H256)))","v":{"v":0,"d":"0.00"}}]
[null,"Partial result",{"$f":"AVERAGE(E243,E244,E251)","v":{"v":0,"d":"0.00"}},null,"Regression analysis generated by the SigmaPlot program."]
[]
[null,"10.2 Soil biology assessment  (optional)"]
[null,"Arylsulfatase activity",null,"(mg p-nitrophenol kg-1 h-1)"]
[null,"β-Glucosidase activity",null,"(mg p-nitrophenol kg-1 h-1)"]
[null,"Organic matter (0-10cm)",null,"(dag kg-1)"]
[null,"Biological soil quality index",null,"Index"]
[null,"Nutrient storage index",null,"Index"]
[null,"Nutrient supply index",null,"Index"]
[null,"Chemical soil quality index",null,"Index"]
[null,"FertBio index",null,"Index"]
[null,"Partial result",{"$f":"C258","v":{"v":0,"d":"0.00"}}]
[]
[null,"Result",{"$f":"IF(C263>0,(2*C252+C263)/3,C252)","v":{"v":0,"d":"0.00"}},"Soil analysis interpretation ( EMBRAPA and Soil Fertility Commission of the State of Minas Gerais)."]
[]
[11,"SOIL EROSION AND ROAD MAINTENANCE "]
[]
[null,"Soil erosion",null,"Choose an option","Area (ha)","Proportion (%) total area","Weighting factor"]
[null,"11.1 Degradation stage*",{"$nulls":3},{"$f":"IF(E270>0,E270/Formulas!$I$520,\" \")","v":" "},{"v":1,"d":"1.0"},"Initial"]
[null,"* Evidence of erosion: Initial - reduction of water infiltration, exposed roots; Intermediate - removal of top horizon, presence of localized shallow grooves; Advanced - deep and widespread furrows in the area, gullies, mass movement (soil displacement).\t\t\t",{"$nulls":4},0.8,"Intermediary"]
[{"$nulls":6},0.5,"Advanced"]
[null,"11.2 Trend of process behavior",null,null,"Choose an option"]
[null,"** Adoption of recovery or mitigation measures such as terraces, physical barriers, revegetation, etc."]
[null,"Partial result",{"$f":"IF(Formulas!E294>0,(Formulas!E294*Formulas!E295*1.2)+(Formulas!E294*Formulas!F295)+(Formulas!E294*Formulas!G295*0.8),0.7)","v":{"v":0.7,"d":"0.70"}},"Adaptation APOIA-NovoRural (Rodrigues et al, 2003); Fidalski (1997)."]
[]
[null,"Road maintenance and conservation",null,"Percentage of roads (%)",null,"Weighting factor"]
[null,"11.3 Presence of conservation and drainage system on roads\n","Transverse slope of roads\t",null,null,{"v":1,"d":"1.0"}]
[null,null,"Water run off adequacy - bumps/grooves\t",null,null,{"v":1,"d":"1.0"},{"$f":"IF(ISBLANK(E279),Formulas!M302,\" \")","v":"Not applicable"}]
[null,null,"Water run off adequacy - infiltration structures",null,null,{"v":1,"d":"1.0"},{"$f":"IF(ISBLANK(E280),Formulas!M302,\" \")","v":"Not applicable"}]
[{"$nulls":3},"Percentage of roads (%)"]
[null,"11.4 Road maintenance","Potholes on roads\t",null,null,{"v":1,"d":"1.0"},"Fator de ponderação"]
[null,null,"Erosion grooves on roads\t",null,null,{"v":1,"d":"1.0"},{"v":2,"d":"2.0"}]
[{"$nulls":4},"Choose an option"]
[null," 11.5 Critical point on the farm roads* \t\t",{"$nulls":3},{"v":1,"d":"1.0"}]
[null,null,"*Critical situation - specify"]
[null,"Partial result",{"$f":"IF(AND(E282=\"\",E278=\"\"),0,Formulas!J303)","v":{"v":0,"d":"0.00"}}]
[]
[null,"Result",{"$f":"IF(AND(C275=0.7,C287>0.925),1,((C275+C287)/2))","v":0.35}]
[]
[12,"WATER QUALITY "]
[{"$nulls":6},"*Adaptation CALLISTO et al., 2002 - Application of a rapid assessment protocol for habitats.\t"]
[null,"12.1 Assessment of aquatic ecosystems (from water samples)*"]
[null,null,"Point Description","Choose an option ",null,null,"Weighting factor"]
[null,"Type of occupation of river banks (main activity)\n","Upstream",null,null,{"$f":"SUM((IF('2 Indicators'!D295=Formulas!L309,4,0))+(IF('2 Indicators'!D295=Formulas!L310,2,0)))","v":{"v":0,"d":"0.0"}},{"v":4,"d":"4.0"},{"$f":"'2 Indicators'!G295*'2 Indicators'!F295","v":{"v":0,"d":"0.0"}}]
[null,null,"Downstream",null,null,{"$f":"SUM((IF('2 Indicators'!D296=Formulas!L309,4,0))+(IF('2 Indicators'!D296=Formulas!L310,2,0)))","v":{"v":0,"d":"0.0"}},{"v":4,"d":"4.0"},{"$f":"'2 Indicators'!G296*'2 Indicators'!F296","v":{"v":0,"d":"0.0"}}]
[null,"Anthropogenic changes\n","Upstream",null,null,{"$f":"SUM((IF('2 Indicators'!D297=Formulas!L312,4,0))+(IF('2 Indicators'!D297=Formulas!L313,2,0)))","v":{"v":0,"d":"0.0"}},{"v":2,"d":"2.0"},{"$f":"'2 Indicators'!G297*'2 Indicators'!F297","v":{"v":0,"d":"0.0"}}]
[null,null,"Downstream",null,null,{"$f":"SUM((IF('2 Indicators'!D298=Formulas!L312,4,0))+(IF('2 Indicators'!D298=Formulas!L313,2,0)))","v":{"v":0,"d":"0.0"}},{"v":2,"d":"2.0"},{"$f":"'2 Indicators'!G298*'2 Indicators'!F298","v":{"v":0,"d":"0.0"}}]
[null,"Shading from vegetal cover in river banks","Upstream",null,null,{"$f":"SUM((IF('2 Indicators'!D299=Formulas!L315,4,0))+(IF('2 Indicators'!D299=Formulas!L316,2,0)))","v":{"v":0,"d":"0.0"}},{"v":4,"d":"4.0"},{"$f":"'2 Indicators'!G299*'2 Indicators'!F299","v":{"v":0,"d":"0.0"}}]
[null,null,"Downstream",null,null,{"$f":"SUM((IF('2 Indicators'!D300=Formulas!L315,4,0))+(IF('2 Indicators'!D300=Formulas!L316,2,0)))","v":{"v":0,"d":"0.0"}},{"v":4,"d":"4.0"},{"$f":"'2 Indicators'!G300*'2 Indicators'!F300","v":{"v":0,"d":"0.0"}}]
[null,"Erosion signals next to banks \n","Upstream",null,null,{"$f":"SUM((IF('2 Indicators'!D301=Formulas!L318,4,0))+(IF('2 Indicators'!D301=Formulas!L319,2,0)))","v":{"v":0,"d":"0.0"}},{"v":4,"d":"4.0"},{"$f":"'2 Indicators'!G301*'2 Indicators'!F301","v":{"v":0,"d":"0.0"}}]
[null,null,"Downstream",null,null,{"$f":"SUM((IF('2 Indicators'!D302=Formulas!L318,4,0))+(IF('2 Indicators'!D302=Formulas!L319,2,0)))","v":{"v":0,"d":"0.0"}},{"v":4,"d":"4.0"},{"$f":"'2 Indicators'!G302*'2 Indicators'!F302","v":{"v":0,"d":"0.0"}}]
[null,"Water clarity\n","Upstream",null,null,{"$f":"SUM((IF('2 Indicators'!D303=Formulas!L321,4,0))+(IF('2 Indicators'!D303=Formulas!L322,2,0)))","v":{"v":0,"d":"0.0"}},{"v":3,"d":"3.0"},{"$f":"'2 Indicators'!G303*'2 Indicators'!F303","v":{"v":0,"d":"0.0"}}]
[null,null,"Downstream",null,null,{"$f":"SUM((IF('2 Indicators'!D304=Formulas!L321,4,0))+(IF('2 Indicators'!D304=Formulas!L322,2,0)))","v":{"v":0,"d":"0.0"}},{"v":3,"d":"3.0"},{"$f":"'2 Indicators'!G304*'2 Indicators'!F304","v":{"v":0,"d":"0.0"}}]
[null,"Water Odor\n","Upstream",null,null,{"$f":"SUM((IF('2 Indicators'!D305=Formulas!L324,4,0))+(IF('2 Indicators'!D305=Formulas!L325,2,0)))","v":{"v":0,"d":"0.0"}},{"v":2,"d":"2.0"},{"$f":"'2 Indicators'!G305*'2 Indicators'!F305","v":{"v":0,"d":"0.0"}}]
[null,null,"Downstream",null,null,{"$f":"SUM((IF('2 Indicators'!D306=Formulas!L324,4,0))+(IF('2 Indicators'!D306=Formulas!L325,2,0)))","v":{"v":0,"d":"0.0"}},{"v":2,"d":"2.0"},{"$f":"'2 Indicators'!G306*'2 Indicators'!F306","v":{"v":0,"d":"0.0"}}]
[null,"Characterization of river bottom ","Upstream",null,null,{"$f":"SUM((IF('2 Indicators'!D307=Formulas!L327,4,0))+(IF('2 Indicators'!D307=Formulas!L328,2,0)))","v":{"v":0,"d":"0.0"}},{"v":4,"d":"4.0"},{"$f":"'2 Indicators'!G307*'2 Indicators'!F307","v":{"v":0,"d":"0.0"}}]
[null,null,"Downstream",null,null,{"$f":"SUM((IF('2 Indicators'!D308=Formulas!L327,4,0))+(IF('2 Indicators'!D308=Formulas!L328,2,0)))","v":{"v":0,"d":"0.0"}},{"v":4,"d":"4.0"},{"$f":"'2 Indicators'!G308*'2 Indicators'!F308","v":{"v":0,"d":"0.0"}}]
[]
[null,"12.2 Surface water quality assessment (optional)\t\t\t"]
[null,"Description of the sample sections"]
[{"$nulls":5},"Result","Weighting factor"]
[null,"Water pH","Upstream",null,"Unit",{"$f":"IF(D313>0,Formulas!B314,\"\")","v":""},{"v":1,"d":"1.0"}]
[null,null,"Downstream",null,"Unit",{"$f":"IF(D314>0,Formulas!C314,\"\")","v":""},{"v":1,"d":"1.0"}]
[null,"Thermotolerant Coliform","Upstream",null,"(UFC 100 mL-1)",{"$f":"IF(D315=\"\",\"\",Formulas!B323)","v":""},{"v":3,"d":"3.0"}]
[null,null,"Downstream",null,"(UFC 100 mL-1)",{"$f":"IF(D316=\"\",\"\",Formulas!C323)","v":""},{"v":3,"d":"3.0"}]
[null,"Total Nitrate","Upstream",null,"(mg L-1 NO3)",{"$f":"IF(D317=\"\",\"\",Formulas!B340)","v":""},{"v":2,"d":"2.0"}]
[null,null,"Downstream",null,"(mg L-1 NO3)",{"$f":"IF(D318=\"\",\"\",Formulas!C340)","v":""},{"v":2,"d":"2.0"}]
[null,"Water turbidity","Upstream",null,"UNT",{"$f":"IF(D319=\"\",\"\",Formulas!B332)","v":""},{"v":4,"d":"4.0"}]
[null,null,"Downstream",null,"UNT",{"$f":"IF(D320=\"\",\"\",Formulas!C332)","v":""},{"v":4,"d":"4.0"}]
[]
[null,"Assessment of the Aquatic Ecosystem","Upstream",{"$f":"(H295+H297+H299+H301+H303+H305+H307)/92","v":{"v":0,"d":"0.00"}},null,null,{"v":4,"d":"4.0"}]
[null,null,"Downstream",{"$f":"(H296+H298+H300+H302+H304+H306+H308)/92","v":{"v":0,"d":"0.00"}},null,null,{"v":4,"d":"4.0"}]
[]
[null,"Partial Result - Surface water quality","Upstream",{"$f":"+Formulas!L344","v":{"v":0,"d":"0.00"}}]
[null,null,"Downstream",{"$f":"+Formulas!L345","v":{"v":0,"d":"0.00"}}]
[]
[null,"12.3 Assessment of groundwater quality (optional)\t\t\t"]
[null,"Description of the sample section\t"]
[{"$nulls":5},"Result","Weighting factor"]
[null,"Water pH",null,null,"Unit",{"$f":"IF(D331>0,Formulas!B356,\"\")","v":""},{"v":1,"d":"1.0"}]
[null,"Thermotolerant Coliform",null,null,"(UFC 100 mL-1)",{"$f":"IF(D332=\"\",\"\",Formulas!B363)","v":""},{"v":1,"d":"1.0"}]
[null,"Total Nitrate",null,null,"(mg L-1 de NO3)",{"$f":"IF(D333=\"\",\"\",Formulas!B370)","v":""},{"v":1,"d":"1.0"}]
[null,"Partial Result - Surface groundwater quality\t",null,{"$f":"IF(AND(D331>0),AVERAGE(F331,F332,F333),\"\")","v":""}]
[]
[null,"Result",{"$f":"IF(D334=\"\",Formulas!F350,(((Formulas!F350*2)+D334)/3))","v":{"v":0,"d":"0.00"}}]
[]
[13,"WATER CONTAMINATION RISK AND PESTICIDE MANAGEMENT"]
[null,"Water contamination risk"]
[null,"13.1 Chemical product potential contamination",{"$nulls":3},"To include more products click here"]
[null,"Product active principle (select)\t"]
[null,"Active ingredient (%)"]
[null,"Land use/crop description"]
[null,"Area (ha)\t"]
[null,"Volume applied  L ha-1 or kg ha-1 \t"]
[null,"Total volume applied (L ha-1 or Kg ha-1)",null,{"$f":"+D345*D344","v":{"v":0,"d":"0.0"}},{"$f":"+E345*E344","v":{"v":0,"d":"0.0"}},{"$f":"+F345*F344","v":{"v":0,"d":"0.0"}},{"$f":"+G345*G344","v":{"v":0,"d":"0.0"}},{"$f":"+H345*H344","v":{"v":0,"d":"0.0"}}]
[null,"Product active principle ",null,{"$f":"IF(D$344>0,(HLOOKUP(D$341,'Data base'!$B$5:$AIN$11,$I347,0)),\"\")","v":""},{"$f":"IF(E$344>0,(HLOOKUP(E$341,'Data base'!$B$5:$AIN$11,$I347,0)),\"\")","v":""},{"$f":"IF(F$344>0,(HLOOKUP(F$341,'Data base'!$B$5:$AIN$11,$I347,0)),\"\")","v":""},{"$f":"IF(G$344>0,(HLOOKUP(G$341,'Data base'!$B$5:$AIN$11,$I347,0)),\"\")","v":""},{"$f":"IF(H$344>0,(HLOOKUP(H$341,'Data base'!$B$5:$AIN$11,$I347,0)),\"\")","v":""},2]
[null,"Toxicity to fish - 96h LC50 (mg l-1)",null,{"$f":"IF(D$344>0,(HLOOKUP(D$341,'Data base'!$B$5:$AIN$11,$I348,0)),\"\")","v":""},{"$f":"IF(E$344>0,(HLOOKUP(E$341,'Data base'!$B$5:$AIN$11,$I348,0)),\"\")","v":""},{"$f":"IF(F$344>0,(HLOOKUP(F$341,'Data base'!$B$5:$AIN$11,$I348,0)),\"\")","v":""},{"$f":"IF(G$344>0,(HLOOKUP(G$341,'Data base'!$B$5:$AIN$11,$I348,0)),\"\")","v":""},{"$f":"IF(H$344>0,(HLOOKUP(H$341,'Data base'!$B$5:$AIN$11,$I348,0)),\"\")","v":""},3]
[null,"Toxicity - ADI (mg kg-1 day-1)",null,{"$f":"IF(D$344>0,(HLOOKUP(D$341,'Data base'!$B$5:$AIN$11,$I349,0)),\"\")","v":""},{"$f":"IF(E$344>0,(HLOOKUP(E$341,'Data base'!$B$5:$AIN$11,$I349,0)),\"\")","v":""},{"$f":"IF(F$344>0,(HLOOKUP(F$341,'Data base'!$B$5:$AIN$11,$I349,0)),\"\")","v":""},{"$f":"IF(G$344>0,(HLOOKUP(G$341,'Data base'!$B$5:$AIN$11,$I349,0)),\"\")","v":""},{"$f":"IF(H$344>0,(HLOOKUP(H$341,'Data base'!$B$5:$AIN$11,$I349,0)),\"\")","v":""},4]
[null,"Product Toxicity Index",null,{"$f":"IF(D$344>0,(HLOOKUP(D$341,'Data base'!$B$5:$AIN$11,$I350,0)),\"\")","v":""},{"$f":"IF(E$344>0,(HLOOKUP(E$341,'Data base'!$B$5:$AIN$11,$I350,0)),\"\")","v":""},{"$f":"IF(F$344>0,(HLOOKUP(F$341,'Data base'!$B$5:$AIN$11,$I350,0)),\"\")","v":""},{"$f":"IF(G$344>0,(HLOOKUP(G$341,'Data base'!$B$5:$AIN$11,$I350,0)),\"\")","v":""},{"$f":"IF(H$344>0,(HLOOKUP(H$341,'Data base'!$B$5:$AIN$11,$I350,0)),\"\")","v":""},5]
[null,"Soil adsorption and mobility Koc (mL g-1)",null,{"$f":"IF(D$344>0,(HLOOKUP(D$341,'Data base'!$B$5:$AIN$11,$I351,0)),\"\")","v":""},{"$f":"IF(E$344>0,(HLOOKUP(E$341,'Data base'!$B$5:$AIN$11,$I351,0)),\"\")","v":""},{"$f":"IF(F$344>0,(HLOOKUP(F$341,'Data base'!$B$5:$AIN$11,$I351,0)),\"\")","v":""},{"$f":"IF(G$344>0,(HLOOKUP(G$341,'Data base'!$B$5:$AIN$11,$I351,0)),\"\")","v":""},{"$f":"IF(H$344>0,(HLOOKUP(H$341,'Data base'!$B$5:$AIN$11,$I351,0)),\"\")","v":""},6]
[null,"Soil degradation t1/2 (DT50) (days)",null,{"$f":"IF(D$344>0,(HLOOKUP(D$341,'Data base'!$B$5:$AIN$11,$I352,0)),\"\")","v":""},{"$f":"IF(E$344>0,(HLOOKUP(E$341,'Data base'!$B$5:$AIN$11,$I352,0)),\"\")","v":""},{"$f":"IF(F$344>0,(HLOOKUP(F$341,'Data base'!$B$5:$AIN$11,$I352,0)),\"\")","v":""},{"$f":"IF(G$344>0,(HLOOKUP(G$341,'Data base'!$B$5:$AIN$11,$I352,0)),\"\")","v":""},{"$f":"IF(H$344>0,(HLOOKUP(H$341,'Data base'!$B$5:$AIN$11,$I352,0)),\"\")","v":""},7]
[null,"Vulnerability index GUS (IUPAC)",null,{"$f":"IF(D344=0,\"\",IF(LOG10(D352)*(4-LOG10(D351))<=0,0,IF(OR(LOG10(D352)*(4-LOG10(D351))>0,),(LOG10(D352)*(4-LOG10(D351))),IF((LOG10(D352)*(4-LOG10(D351))>0),(LOG10(D352)*(4-LOG10(D351)))))))","v":""},{"$f":"IF(E344=0,\"\",IF(LOG10(E352)*(4-LOG10(E351))<=0,0,IF(OR(LOG10(E352)*(4-LOG10(E351))>0,),(LOG10(E352)*(4-LOG10(E351))),IF((LOG10(E352)*(4-LOG10(E351))>0),(LOG10(E352)*(4-LOG10(E351)))))))","v":""},{"$f":"IF(F344=0,\"\",IF(LOG10(F352)*(4-LOG10(F351))<=0,0,IF(OR(LOG10(F352)*(4-LOG10(F351))>0,),(LOG10(F352)*(4-LOG10(F351))),IF((LOG10(F352)*(4-LOG10(F351))>0),(LOG10(F352)*(4-LOG10(F351)))))))","v":""},{"$f":"IF(G344=0,\"\",IF(LOG10(G352)*(4-LOG10(G351))<=0,0,IF(OR(LOG10(G352)*(4-LOG10(G351))>0,),(LOG10(G352)*(4-LOG10(G351))),IF((LOG10(G352)*(4-LOG10(G351))>0),(LOG10(G352)*(4-LOG10(G351)))))))","v":""},{"$f":"IF(H344=0,\"\",IF(LOG10(H352)*(4-LOG10(H351))<=0,0,IF(OR(LOG10(H352)*(4-LOG10(H351))>0,),(LOG10(H352)*(4-LOG10(H351))),IF((LOG10(H352)*(4-LOG10(H351))>0),(LOG10(H352)*(4-LOG10(H351)))))))","v":""}]
[null,"Potential contamination (1, 2 or 3)",null,{"$f":"IF(D344>0,(IF(OR(Formulas!C387=0.83,Formulas!C387<0.83),1,IF(OR(AND(0.83<Formulas!C387,Formulas!C387<=1.66)),2,IF(Formulas!C387>1.66,3,\"\")))),\"\")","v":""},{"$f":"IF(E344>0,(IF(OR(Formulas!D387=0.83,Formulas!D387<0.83),1,IF(OR(AND(0.83<Formulas!D387,Formulas!D387<=1.66)),2,IF(Formulas!D387>1.66,3,\"\")))),\"\")","v":""},{"$f":"IF(F344>0,(IF(OR(Formulas!E387=0.83,Formulas!E387<0.83),1,IF(OR(AND(0.83<Formulas!E387,Formulas!E387<=1.66)),2,IF(Formulas!E387>1.66,3,\"\")))),\"\")","v":""},{"$f":"IF(G344>0,(IF(OR(Formulas!F387=0.83,Formulas!F387<0.83),1,IF(OR(AND(0.83<Formulas!F387,Formulas!F387<=1.66)),2,IF(Formulas!F387>1.66,3,\"\")))),\"\")","v":""},{"$f":"IF(H344>0,(IF(OR(Formulas!G387=0.83,Formulas!G387<0.83),1,IF(OR(AND(0.83<Formulas!G387,Formulas!G387<=1.66)),2,IF(Formulas!G387>1.66,3,\"\")))),\"\")","v":""}]
[null,"EIQ Farm worker component (<  80; 80 - 128; > 128)",null,{"$f":"IF(D$344>0,(HLOOKUP(D$341,'Data base'!$B$5:$AIN$18,$I355,0)),\"\")","v":""},{"$f":"IF(E$344>0,(HLOOKUP(E$341,'Data base'!$B$5:$AIN$18,$I355,0)),\"\")","v":""},{"$f":"IF(F$344>0,(HLOOKUP(F$341,'Data base'!$B$5:$AIN$18,$I355,0)),\"\")","v":""},null,null,12]
[null,"EIQ Consumer component (< 20,5; 20,5 - 36,25; > 36,25)",null,{"$f":"IF(D$344>0,(HLOOKUP(D$341,'Data base'!$B$5:$AIN$18,$I356,0)),\"\")","v":""},{"$f":"IF(E$344>0,(HLOOKUP(E$341,'Data base'!$B$5:$AIN$18,$I356,0)),\"\")","v":""},{"$f":"IF(F$344>0,(HLOOKUP(F$341,'Data base'!$B$5:$AIN$18,$I356,0)),\"\")","v":""},null,null,13]
[null,"EIQ Ecological component (< 75; 75 - 136,5; > 136,5)",null,{"$f":"IF(D$344>0,(HLOOKUP(D$341,'Data base'!$B$5:$AIN$18,$I357,0)),\"\")","v":""},{"$f":"IF(E$344>0,(HLOOKUP(E$341,'Data base'!$B$5:$AIN$18,$I357,0)),\"\")","v":""},{"$f":"IF(F$344>0,(HLOOKUP(F$341,'Data base'!$B$5:$AIN$18,$I357,0)),\"\")","v":""},null,null,14]
[null,"Environmental Impact Quotient (EIQ) (<58,33; 58,33 - 94,46; > 94,46)",null,{"$f":"IF(D$344>0,(HLOOKUP(D$341,'Data base'!$B$5:$AIN$18,$I358,0)),\"\")","v":""},{"$f":"IF(E$344>0,(HLOOKUP(E$341,'Data base'!$B$5:$AIN$18,$I358,0)),\"\")","v":""},{"$f":"IF(F$344>0,(HLOOKUP(F$341,'Data base'!$B$5:$AIN$18,$I358,0)),\"\")","v":""},null,null,11]
[null,"Banned Pesticides - EU (2022) (X)",null,{"$f":"IF(D$344>0,(HLOOKUP(D$341,'Data base'!$B$5:$AIN$19,$I359,0)),\"\")","v":""},{"$f":"IF(E$344>0,(HLOOKUP(E$341,'Data base'!$B$5:$AIN$19,$I359,0)),\"\")","v":""},{"$f":"IF(F$344>0,(HLOOKUP(F$341,'Data base'!$B$5:$AIN$19,$I359,0)),\"\")","v":""},null,null,15]
[null,"13.2 Field Vulnerability",null,"Check the option with the value (1, 2 or 3)\t"]
[null,"Soil clay content                                                                           > 60% (1); 30% - 60% (2); <30% (3)\t"]
[null,"Distance to water course (edge ​​of field)  >1.000m (1);  300 - 1.000m (2);  <300m (3)\t"]
[null,"No Till system with cover crops (1); No Till System (2); Plowed soil (3)\t"]
[null,"Field Vulnerability (1, 2 or 3)\t",null,{"$f":"IF(D345>0,(IF(OR(AND(1<=Formulas!C388,Formulas!C388<=3)),1,IF(OR(AND(3<Formulas!C388,Formulas!C388<=9)),2,IF(Formulas!C388>9,3)))),\"\")","v":""},{"$f":"IF(E345>0,(IF(OR(AND(1<=Formulas!D388,Formulas!D388<=3)),1,IF(OR(AND(3<Formulas!D388,Formulas!D388<=9)),2,IF(Formulas!D388>9,3)))),\"\")","v":""},{"$f":"IF(F345>0,(IF(OR(AND(1<=Formulas!E388,Formulas!E388<=3)),1,IF(OR(AND(3<Formulas!E388,Formulas!E388<=9)),2,IF(Formulas!E388>9,3)))),\"\")","v":""},{"$f":"IF(G345>0,(IF(OR(AND(1<=Formulas!F388,Formulas!F388<=3)),1,IF(OR(AND(3<Formulas!F388,Formulas!F388<=9)),2,IF(Formulas!F388>9,3)))),\"\")","v":""},{"$f":"IF(H345>0,(IF(OR(AND(1<=Formulas!G388,Formulas!G388<=3)),1,IF(OR(AND(3<Formulas!G388,Formulas!G388<=9)),2,IF(Formulas!G388>9,3)))),\"\")","v":""}]
[null,"Contamination risk (1 (low), 2 (medium) or 3 (high))",null,{"$f":"IF(D345>0,(IF(OR(AND(1<=Formulas!C390,Formulas!C390<=2)),1,IF(OR(AND(2<Formulas!C390,Formulas!C390<=4)),2,IF(Formulas!C390>4,3)))),\"\")","v":""},{"$f":"IF(E345>0,(IF(OR(AND(1<=Formulas!D390,Formulas!D390<=2)),1,IF(OR(AND(2<Formulas!D390,Formulas!D390<=4)),2,IF(Formulas!D390>4,3)))),\"\")","v":""},{"$f":"IF(F345>0,(IF(OR(AND(1<=Formulas!E390,Formulas!E390<=2)),1,IF(OR(AND(2<Formulas!E390,Formulas!E390<=4)),2,IF(Formulas!E390>4,3)))),\"\")","v":""},{"$f":"IF(G345>0,(IF(OR(AND(1<=Formulas!F390,Formulas!F390<=2)),1,IF(OR(AND(2<Formulas!F390,Formulas!F390<=4)),2,IF(Formulas!F390>4,3)))),\"\")","v":""},{"$f":"IF(H345>0,(IF(OR(AND(1<=Formulas!G390,Formulas!G390<=2)),1,IF(OR(AND(2<Formulas!G390,Formulas!G390<=4)),2,IF(Formulas!G390>4,3)))),\"\")","v":""}]
[null,"13.3 Contamination Risk"]
[null,"Crop\t",null,{"$f":"D343","v":0}]
[null,"Area (ha)",null,{"$f":"D344","v":{"v":0,"d":"0.0"}}]
[null,"Maximum risk identified (1 - low), (2 - medium) or (3 - high)",null,{"$f":"MAX(D365:F365,Formulas!D437:L437,Formulas!D466:L466,Formulas!D494:I494)","v":0}]
[]
[null,"Partial result",{"$f":"IF(D344=0,1,Formulas!D499)","v":{"v":1,"d":"1.00"}},"Reference: Chaves (2015); Kovach et al. (1992)"]
[]
[null,"Pesticides management",null,null,"Number of people","Weighting factor"]
[null,"13.4 Number of people handling pesticides\t\t",{"$nulls":3},{"v":1,"d":"1.0"}]
[null,"13.5 Number of people using properly individual protective equipment \t\t",{"$nulls":3},{"v":1,"d":"1.0"}]
[{"$nulls":4},"Choose an option "]
[null,"13.6 Proper storage of pesticides\t\t",{"$nulls":3},{"v":1,"d":"1.0"},"Yes"]
[null,"13.7 Return of pesticide packaging",{"$nulls":3},{"v":1,"d":"1.0"},"No"]
[]
[null,"Partial result",{"$f":"IF(E374=\"\",1,Formulas!G510)","v":{"v":1,"d":"1.00"}},"Adaptation APOIA-NovoRural (Rodrigues et al, 2010)."]
[]
[null,"Result",{"$f":"(C371+C380)/2","v":{"v":1,"d":"1.00"}}]
[]
[14,"SOIL AND WATER CONSERVATION PRACTICES"]
[]
[null,null,"Area (ha)","Permanent crops                  ","Anual crops","Pasture","Forestry","Weighting factor"]
[{"$nulls":3},{"$f":"+'1 Survey'!D84","v":0},{"$f":"+'1 Survey'!D85","v":0},{"$f":"+'1 Survey'!D86","v":0},{"$f":"+'1 Survey'!D87","v":0}]
[null,"14.1 Soil conservation practices (adoption intensity)\n","High",{"$nulls":4},{"v":1,"d":"1.0"}]
[null,null,"Moderate",{"$nulls":4},0.6]
[null,null,"Incipient",{"$nulls":4},0.3]
[null,null,"Critical situation*",{"$nulls":4},0.1]
[null,"*Critical situation (soil/water) - specify",{"$nulls":3},"Verification (Land Use) =>",null,{"$f":"SUM(D388:G391)/('1 Survey'!D84+'1 Survey'!D85+'1 Survey'!D86+'1 Survey'!D87)","v":{"$error":"#DIV/0!"}}]
[]
[{"$nulls":3},"Choose an option","Weighting factor"]
[null,"14.2 Strategies for water conservation and reservation  \n",null,null,{"v":1,"d":"1.0"},"Sufficient"]
[{"$nulls":4},0.4,"Insufficient"]
[{"$nulls":4},0.1,"Critical situation"]
[null,"Result",{"$f":"IF(Formulas!F523=0,\"\",(((Formulas!E523*2)+Formulas!F523)/3))","v":""},"Adaptation APOIA-NovoRural (Rodrigues et al, 2010)."]
[]
[15,"BIODIVERSITY CONSERVATION PRACTICES"]
[]
[null,null,"Area (ha)","Permanent crops                  ","Anual crops","Pasture","Forestry","Weighting factor"]
[{"$nulls":3},{"$f":"+D387","v":0},{"$f":"+E387","v":0},{"$f":"+F387","v":0},{"$f":"+G387","v":0}]
[null,"15.1 Biodiversity conservation practices (adoption intensity)*\n","High",{"$nulls":4},{"v":1,"d":"1.0"}]
[null,null,"Moderate",{"$nulls":4},0.6]
[null,null,"Incipient",{"$nulls":4},0.3]
[null,null,"Critical situation**",{"$nulls":4},0.1]
[null,"Critical situation (biodiversity) - specify"]
[null,"* Intercropping, rotations, integration, green manuring, alternating bands, plant barriers, afforestation.",{"$nulls":3},"Verification (Land Use) =>",null,{"$f":"SUM(D404:G407)/('1 Survey'!D84+'1 Survey'!D85+'1 Survey'!D86+'1 Survey'!D87)","v":{"$error":"#DIV/0!"}}]
[null,"** Use of fire in pastures or straw; Areas with no vegetation cover; Successions with the same culture.\t"]
[null,"Partial result",{"$f":"(Formulas!M528*Formulas!C528)+(Formulas!M529*Formulas!C529)+(Formulas!M530*Formulas!C530)+(Formulas!M531*Formulas!C531)","v":{"$error":"#DIV/0!"}}]
[]
[null,"15.2 Shannon-Wiener Index (productive areas and phytophysiognomies)\t\t",null,null,{"$f":"Formulas!L548","v":{"$error":"#DIV/0!"}}]
[null,"Partial result",{"$f":"Formulas!F543*(1-EXP((-Formulas!F544)*(E413*100)))","v":{"$error":"#DIV/0!"}}]
[{"$nulls":5},"Choose an option"]
[null,"15.3 High proportion (over 70% of the perimeter) of monocultures bordering the farm \t\t\t\t"]
[]
[null,"Result",{"$f":"IF(F416=\"yes\",((((C411*3)+(C414*2))/5)*0.9),(((C411*3)+(C414*2))/5))","v":{"$error":"#DIV/0!"}},"Adaptation APOIA-NovoRural (Rodrigues et al, 2010)."]
[]
[16,"NATURAL HABITATS STATUS"]
[]
[null,null,"Phytophysiognomies (select)",{"$nulls":4},"Weighting factor"]
[null,"16.1 Successional stages of native vegetation\n","Advanced stage (area ha)",{"$nulls":4},{"v":1,"d":"1.0"}]
[null,null,"Middle stage  (area ha)",{"$nulls":4},0.9]
[null,null,"Early stage (area ha)",{"$nulls":4},0.7]
[null,"Partial result",{"$f":"IF('1 Survey'!I91=0,0,Formulas!C558)","v":{"v":0,"d":"0.00"}},"Area of ​​native vegetation",{"$f":"+'1 Survey'!I91","v":{"v":0,"d":"0.00"}},null,"                                       Verification  =>",{"$f":"SUM(Formulas!F555:F557)","v":{"v":0,"d":"0.0%"}}]
[]
[{"$nulls":5},"Unit","Fator de ponderação","Weighting factor"]
[null,"16.2  Number of fragments with native vegetation (inside the farm)\t\t",{"$nulls":5},{"v":1,"d":"1.0"}]
[null,"Partial result",{"$f":"IF(F429=\"\",\"\",(Formulas!D566))","v":""}]
[{"$nulls":5},"Choose an option"]
[null,"16.3 The fragment(s) has (have) a connection with the native vegetation of neighboring farms \t\t\t\t"]
[{"$nulls":5},"Choose an option"]
[null,"16.4 Protected fragment(s) from grazing and fire (firebreaks with annual maintenance) \t\t\t\t"]
[]
[null,"Result",{"$f":"IF(H426=0,0,(Formulas!B561))","v":{"v":0,"d":"0.00"}},"Adaptation APOIA-NovoRural (Rodrigues et al, 2010)."]
[]
[17,"PRESERVATION AND CONSERVATION RESERVE AREAS ",{"$nulls":5},"Weighting factor"]
[]
[null,"Preservation Areas (PA) - riparian buffer zones",{"$nulls":3},"Unit (ha)"]
[null,"17.1  Land use and occupation in PAs","Area with native vegetation\t\t\t",null,null,{"$f":"+'1 Survey'!I97","v":{"v":0,"d":"0.00"}},null,0.7]
[null,null,"Area indicated for recomposition of native vegetation\t\t\t",null,null,{"$f":"'1 Survey'!D98","v":{"v":0,"d":"0.00"}},null,0.1]
[{"$nulls":4},"Sum =>",{"$f":"+F441+F442","v":{"v":0,"d":"0.00"}}]
[{"$nulls":5},"Unit (%)"]
[null,"17.2 Proportion of PAs effectively protected (%) "]
[]
[null,"Partial result",{"$f":"IF(F445=\"\",0,Formulas!F582)","v":{"v":0,"d":"0.00"}},"Adaptation APOIA-NovoRural (Rodrigues et al, 2010)."]
[]
[null,"Conservation Reserve Areas (CRA) - natural habitats to enhance ecosystem services"]
[null,"Conservation Reserve Area (ha) =>\t",null,{"$f":"Formulas!M598","v":{"v":0,"d":"0.00"}},{"$f":"'1 Survey'!E103","v":{"v":0,"d":"0%"}}]
[null,"Conservation Reserve Area that requires restoration\t",null,{"$f":"+Formulas!L602","v":{"v":0,"d":"0.00"}}]
[{"$nulls":3},{"$f":"'1 Survey'!E104","v":{"v":0,"d":"0.00"}},null,"Unit (ha)","Weighting factor"]
[null,"17.3 Adequacy of conservation reserve \n\n","Surplus native vegetation",null,null,{"$f":"+'1 Survey'!E104","v":{"v":0,"d":"0.00"}},{"v":1,"d":"1.0"}]
[null,null,"CRA located outside the farm\t\t",{"$nulls":3},0.7]
[null,null,"Areas of Conservation Reserve not subject to restoration\t\t",null,null,{"$f":"'1 Survey'!D91-'2 Indicators'!F453","v":{"v":0,"d":"0.00"}},0.7]
[null,null,"Areas from/to Conservation Reserve that require restoration\t\t",{"$nulls":3},0.1]
[{"$nulls":4},"Verification =>",{"$f":"(F454+F455+F456)/D450","v":{"$error":"#DIV/0!"}}]
[null,"Partial result",{"$f":"IF(F457<0.99,\"\",Formulas!F592)","v":{"$error":"#DIV/0!"}},"Adaptation APOIA-NovoRural (Rodrigues et al, 2010)."]
[]
[null,"Result",{"$f":"IF(AND(C447=0.7,C458=1),1,((C447+C458)/2))","v":{"$error":"#DIV/0!"}}]

{"sheet":"3 Report","index":3,"n_rows":85,"n_cols":23,"rows_kept":85,"merged":[[0,0,1,2],[0,3,1,4],[61,16,61,18],[65,12,72,12],[73,12,81,12]]}
["ISA",null,null,"REPORT"]
[]
[{"$nulls":5},"Application date",null,{"$f":"IF('1 Survey'!C34=\"\",\"\",'1 Survey'!C34)","v":""}]
[null,"FINAL INDEX",null,{"$f":"'3 Report'!Q65","v":""},null,"Farm",null,{"$f":"'1 Survey'!D70","v":0}]
[null,"Standard Deviation",null,{"$f":"STDEV(Q66:Q82)","v":{"$error":"#DIV/0!"}},null,"Area (ha)",null,{"$f":"'1 Survey'!D72","v":{"v":0,"d":"0.0"}}]
{"$rows_empty":17}
[null,"Land use and cover",{"$nulls":5},"Land use and cover"]
[{"$nulls":7},"Nº of fragments with native vegetation",null,null,{"$f":"+'2 Indicators'!F429","v":0}]
[{"$nulls":7},"Nº of water courses",null,null,{"$f":"'1 Survey'!E108","v":0}]
[{"$nulls":7},"Nº of springs",null,null,{"$f":"'1 Survey'!E109","v":0}]
[{"$nulls":7},"Nº of natural lakes and ponds",null,null,{"$f":"'1 Survey'!E110","v":0}]
[{"$nulls":7},"Nº of dams",null,null,{"$f":"'1 Survey'!E111","v":0}]
[{"$nulls":7},"Irrigation area (ha)",null,null,{"$f":"+'2 Indicators'!C77","v":0}]
[]
[{"$nulls":7},"Problems with water supply",null,null,{"$f":"IF('1 Survey'!E118=\"x\",\"Yes\",\"No\")","v":"No"}]
[]
[]
[{"$nulls":7},"Management"]
[{"$nulls":7},"Gross income ($/ha/year)",null,null,{"$f":"+K38/('1 Survey'!D72+'1 Survey'!D79)","v":{"$error":"#DIV/0!"}}]
[{"$nulls":7},"Debt in relation to the Asset\t",null,null,{"$f":"'2 Indicators'!E112","v":{"$error":"#DIV/0!"}}]
[{"$nulls":7},"Anual gross income in relation to the Asset",null,null,{"$f":"K38/'2 Indicators'!C95","v":{"$error":"#DIV/0!"}}]
[null,"Soil Fertility",{"$nulls":5},"Gross income ($/year)",null,null,{"$f":"SUM('2 Indicators'!D9:D11)+SUM('2 Indicators'!D28:E30)","v":{"$error":"#DIV/0!"}}]
[null,"Soil organic matter (dag kg-1)",null,null,{"$f":"'2 Indicators'!C243","v":{"v":0,"d":"0.0"}},null,null,"Proportion of main gross activity/gross income",null,null,{"$f":"+'2 Indicators'!E9","v":{"$error":"#DIV/0!"}}]
[null,"Phosphorus (mg dm-3)",null,null,{"$f":"'2 Indicators'!C244","v":{"v":0,"d":"0.0"}}]
[null,"Calcium (cmolc dm-3)",null,null,{"$f":"'2 Indicators'!C245","v":{"v":0,"d":"0.0"}},null,null,"Participation of women in the farm management",null,null,{"$f":"'1 Survey'!D66","v":{"v":0,"d":"0.0%"}}]
[null,"Magnesium (cmolc dm-3)",null,null,{"$f":"'2 Indicators'!C246","v":{"v":0,"d":"0.0"}},null,null,"Succession process (farm management)",null,null,{"$f":"'1 Survey'!D64","v":{"v":0,"d":"0.0%"}}]
[null,"Potassium (mg dm-3)",null,null,{"$f":"'2 Indicators'!C247","v":{"v":0,"d":"0.0"}}]
[null,"Active acidity (pH)",null,null,{"$f":"'2 Indicators'!C248","v":{"v":0,"d":"0.0"}},null,null,"Amount of pesticides / prod. area (L/ha/year)",null,null,{"$f":"Formulas!D503","v":""}]
[null,"Aluminium (cmolc dm-3)",null,null,{"$f":"'2 Indicators'!C249","v":{"v":0,"d":"0.0"}},null,null,"Anual volume of pesticides (L)\t",null,null,{"$f":"Formulas!D500","v":""}]
[null,"CEC (cmolc dm-3)",null,null,{"$f":"'2 Indicators'!C250","v":{"v":0,"d":"0.0"}},null,null,"∑ EIQ Final Index (pesticides)\t",null,null,{"$f":"SUM('2 Indicators'!D358:F358,Formulas!D429:L429,Formulas!D458:L458,Formulas!D486:I486)","v":0}]
[null,"Base Saturation (%)",null,null,{"$f":"'2 Indicators'!C251","v":{"v":0,"d":"0.0"}}]
[null,"K/CTC (reference 3 - 5%)",null,null,{"$f":"IF(E43>0,((E43/1000*2.5577)/E46*100),\"\")","v":""},null,null,"Soil Biology"]
[null,"Ca/CTC (reference 40 - 60%)",null,null,{"$f":"IF(E41>0,E41/E46*100,\"\")","v":""},null,null,"Arylsulfatase (mg p-nitrofenol kg-1 h-1)",null,null,{"$f":"IF('2 Indicators'!C255=\"\",\"\",'2 Indicators'!C255)","v":""}]
[null,"Mg/CTC (reference 10 - 15%)",null,null,{"$f":"IF(E42>0,E42/E46*100,\"\")","v":""},null,null,"ß-glucosidase (mg p-nitrofenol kg-1 h-1)",null,null,{"$f":"IF('2 Indicators'!C256=\"\",\"\",'2 Indicators'!C256)","v":""}]
[{"$nulls":7},"Biological soil quality index",null,null,{"$f":"IF('2 Indicators'!C258=\"\",\"\",'2 Indicators'!C258)","v":""}]
[null,"Yield",{"$nulls":5},"Chemical soil quality index",null,null,{"$f":"IF('2 Indicators'!C261=\"\",\"\",'2 Indicators'!C261)","v":""}]
[null,"Main agricultural activity",null,null,{"$f":"'2 Indicators'!D15","v":{"v":0,"d":"0.0%"}},null,null,"FertBio index",null,null,{"$f":"IF('2 Indicators'!C262=\"\",\"\",'2 Indicators'!C262)","v":""}]
[null,"Unit",null,null,{"$f":"'2 Indicators'!D16","v":0}]
[null,"Yield / productivity",null,null,{"$f":"'2 Indicators'!D17","v":0},null,null,"Soil erosion"]
[{"$nulls":7},"Soil erosion - area",null,null,{"$f":"'2 Indicators'!E270","v":0}]
[{"$nulls":7},"Soil erosion - degradation stage",null,null,{"$f":"'2 Indicators'!D270","v":0}]
[{"$nulls":7},"Soil erosion - degradation process trend",null,null,{"$f":"'2 Indicators'!D273","v":0}]
[null,"Innovative techniques:",null,null,{"$f":"IF('2 Indicators'!E210=\"\",\"\",'2 Indicators'!E210)","v":""}]
[]
[]
[{"$nulls":16},"DATA"]
[{"$nulls":16},{"$f":"H3","v":""},"2013-05-01","2011-05-01"]
[{"$nulls":13},"Standard Deviation",null,{"$f":"STDEV(Q66:Q78,Q75:Q82)","v":{"$error":"#DIV/0!"}},"Current","Historical I","Historical II"]
[{"$nulls":13},"SUSTAINABILITY INDEX",null,null,{"$f":"IF(Q66>0,AVERAGE(Q66:Q82),\"\")","v":""},{"$f":"IF(R66>0,AVERAGE(R66:R82),\"\")","v":{"v":0.6207988730786138,"d":"0.62"}},{"$f":"IF(S66>0,AVERAGE(S66:S82),\"\")","v":{"v":0.5394117647058824,"d":"0.54"}}]
[{"$nulls":12},"Socioeconomic aspects","1. Productivity and Sales Prices",null,null,{"$f":"'2 Indicators'!C22","v":{"v":0,"d":"0.00"}},0.75,0.63,0.7]
[{"$nulls":13},"2. Income Diversity",null,null,{"$f":"'2 Indicators'!C45","v":{"$error":"#DIV/0!"}},{"v":0.6205673489790091,"d":"0.62"},{"v":0.6,"d":"0.60"},0.7]
[{"$nulls":13},"3. Asset Development and Indebtedness",null,null,{"$f":"'2 Indicators'!C115","v":{"$error":"#DIV/0!"}},{"v":0.8484019226384294,"d":"0.85"},{"v":0.7,"d":"0.70"},0.7]
[{"$nulls":13},"4. Public Services",null,null,{"$f":"'2 Indicators'!C142","v":{"v":0,"d":"0.00"}},{"v":0.7777777777777778,"d":"0.78"},{"v":0.8,"d":"0.80"},0.7]
[{"$nulls":13},"5. Education and Courses",null,null,{"$f":"'2 Indicators'!C164","v":{"$error":"#DIV/0!"}},0.71,{"v":0.6,"d":"0.60"},0.7]
[{"$nulls":13},"6. Employment Quality",null,null,{"$f":"'2 Indicators'!C186","v":{"v":0.7,"d":"0.70"}},{"v":0.7,"d":"0.70"},{"v":0.5,"d":"0.50"},0.7]
[{"$nulls":13},"7. Business Management",null,null,{"$f":"'2 Indicators'!C200","v":{"v":0,"d":"0.00"}},{"v":0.6857142857142858,"d":"0.69"},{"v":0.4,"d":"0.40"},0.7]
[{"$nulls":13},"8. Commercialization and Innovation",null,null,{"$f":"'2 Indicators'!C218","v":{"v":0,"d":"0.00"}},{"v":0.7,"d":"0.70"},{"v":0.5,"d":"0.50"},0.7,{"$f":"AVERAGE(Q66:Q73)","v":{"$error":"#DIV/0!"}},{"$f":"AVERAGE(R66:R73)","v":{"v":0.7240576668886878,"d":"0.72"}},{"$f":"AVERAGE(S66:S73)","v":{"v":0.59125,"d":"0.59"}}]
[{"$nulls":12},"Environmental aspects","9. Waste Residues Management",null,null,{"$f":"'2 Indicators'!C236","v":{"v":0.7,"d":"0.70"}},0.11,0.13,0.7]
[{"$nulls":13},"10. Soil Fertility",null,null,{"$f":"'2 Indicators'!C265","v":{"v":0,"d":"0.00"}},{"v":0.5424491666666666,"d":"0.54"},0.48,0.7]
[{"$nulls":13},"11. Soil Erosion and Road Maintenance",null,null,{"$f":"'2 Indicators'!C289","v":0.35},0.44,0.37,0.7]
[{"$nulls":13},"12. Water Quality",null,null,{"$f":"'2 Indicators'!C336","v":{"v":0,"d":"0.00"}},{"v":0.663655890003716,"d":"0.66"},0.54,0.7]
[{"$nulls":13},"13. Water contamination risk and Pesticides",null,null,{"$f":"'2 Indicators'!C382","v":{"v":1,"d":"1.00"}},0.29,0.48,0.7]
[{"$nulls":13},"14. Soil and Water Conservation ",null,null,{"$f":"'2 Indicators'!C398","v":""},{"v":0.631638418079096,"d":"0.63"},{"v":0.5,"d":"0.50"},0.7]
[{"$nulls":13},"15. Biodiversity Conservation",null,null,{"$f":"'2 Indicators'!C418","v":{"$error":"#DIV/0!"}},{"v":0.7533760324774537,"d":"0.75"},{"v":0.6,"d":"0.60"},0.7]
[{"$nulls":13},"16. Natural Habitats Status",null,null,{"$f":"'2 Indicators'!C436","v":{"v":0,"d":"0.00"}},0.75,{"v":0.6,"d":"0.60"},0.7]
[{"$nulls":13},"17. Preservation  Areas",null,null,{"$f":"'2 Indicators'!C460","v":{"$error":"#DIV/0!"}},0.58,0.74,0.7,{"$f":"AVERAGE(Q74:Q82)","v":{"$error":"#DIV/0!"}},{"$f":"AVERAGE(R74:R82)","v":{"v":0.5290132785807703,"d":"0.53"}},{"$f":"AVERAGE(S74:S82)","v":{"v":0.4933333333333334,"d":"0.49"}}]
[]
[{"$nulls":20},{"v":1.0092029755445981,"d":"1.0092030"}]
[{"$nulls":20},{"$f":"Q65*U84","v":{"$error":"#VALUE!"}}]

{"sheet":"4 Adequacy plan","index":4,"n_rows":30,"n_cols":5,"rows_kept":30,"merged":[[0,3,1,3]]}
[{"$nulls":3},"ADEQUACY PLAN "]
[null,"ISA"]
[]
[]
[null,"FARMER",null,{"$f":"IF('1 Survey'!C44=\"\",\"\",'1 Survey'!C44)","v":""}]
[null,"LOCAL DESCRIPTION",null,{"$f":"IF('1 Survey'!C54=\"\",\"\",'1 Survey'!C54)","v":""}]
[null,"APPLICATION DATE",null,{"$f":"IF('1 Survey'!C34=\"\",\"\",'1 Survey'!C34)","v":""}]
[]
[null,"TECHNICAL REGISTRATION",null,{"$f":"IF('1 Survey'!C38=\"\",\"\",'1 Survey'!C38)","v":""}]
[]
[null,"ITEM","Index","Tecnical information","Execution Period "]
[null,{"$f":"'3 Report'!N66","v":"1. Productivity and Sales Prices"},{"$f":"'3 Report'!Q66","v":{"v":0,"d":"0.00"}}]
[null,{"$f":"'3 Report'!N75","v":"10. Soil Fertility"},{"$f":"'3 Report'!Q75","v":{"v":0,"d":"0.00"}}]
[null,{"$f":"'3 Report'!N76","v":"11. Soil Erosion and Road Maintenance"},{"$f":"'3 Report'!Q76","v":0.35}]
[null,{"$f":"'3 Report'!N77","v":"12. Water Quality"},{"$f":"'3 Report'!Q77","v":{"v":0,"d":"0.00"}}]
[null,{"$f":"'3 Report'!N78","v":"13. Water contamination risk and Pesticides"},{"$f":"'3 Report'!Q78","v":{"v":1,"d":"1.00"}}]
[null,{"$f":"'3 Report'!N79","v":"14. Soil and Water Conservation "},{"$f":"'3 Report'!Q79","v":""}]
[null,{"$f":"'3 Report'!N80","v":"15. Biodiversity Conservation"},{"$f":"'3 Report'!Q80","v":{"$error":"#DIV/0!"}}]
[null,{"$f":"'3 Report'!N81","v":"16. Natural Habitats Status"},{"$f":"'3 Report'!Q81","v":{"v":0,"d":"0.00"}}]
[null,{"$f":"'3 Report'!N82","v":"17. Preservation  Areas"},{"$f":"'3 Report'!Q82","v":{"$error":"#DIV/0!"}}]
[null,{"$f":"'3 Report'!N67","v":"2. Income Diversity"},{"$f":"'3 Report'!Q67","v":{"$error":"#DIV/0!"}}]
[null,{"$f":"'3 Report'!N68","v":"3. Asset Development and Indebtedness"},{"$f":"'3 Report'!Q68","v":{"$error":"#DIV/0!"}}]
[null,{"$f":"'3 Report'!N69","v":"4. Public Services"},{"$f":"'3 Report'!Q69","v":{"v":0,"d":"0.00"}}]
[null,{"$f":"'3 Report'!N70","v":"5. Education and Courses"},{"$f":"'3 Report'!Q70","v":{"$error":"#DIV/0!"}}]
[null,{"$f":"'3 Report'!N71","v":"6. Employment Quality"},{"$f":"'3 Report'!Q71","v":{"v":0.7,"d":"0.70"}}]
[null,{"$f":"'3 Report'!N72","v":"7. Business Management"},{"$f":"'3 Report'!Q72","v":{"v":0,"d":"0.00"}}]
[null,{"$f":"'3 Report'!N73","v":"8. Commercialization and Innovation"},{"$f":"'3 Report'!Q73","v":{"v":0,"d":"0.00"}}]
[null,{"$f":"'3 Report'!N74","v":"9. Waste Residues Management"},{"$f":"'3 Report'!Q74","v":{"v":0.7,"d":"0.70"}}]
[null,"Environmental license ",{"$f":"'1 Survey'!E126","v":{"v":0,"d":"0.00"}}]
[null,"Regularization of water use ",{"$f":"'1 Survey'!E124","v":{"v":0,"d":"0.00"}}]

{"sheet":"Plan1","index":5,"n_rows":0,"n_cols":0,"rows_kept":0,"hidden":true}

{"sheet":"Sheet3","index":6,"n_rows":0,"n_cols":0,"rows_kept":0,"hidden":true}

{"sheet":"Sheet4","index":7,"n_rows":0,"n_cols":0,"rows_kept":0,"hidden":true}

{"sheet":"Sheet5","index":8,"n_rows":0,"n_cols":0,"rows_kept":0,"hidden":true}

{"sheet":"Sheet6","index":9,"n_rows":0,"n_cols":0,"rows_kept":0,"hidden":true}

{"sheet":"Relatório de Assist (2)","index":10,"n_rows":48,"n_cols":19,"rows_kept":48,"hidden":true,"merged":[[0,11,0,16],[4,6,4,13],[4,15,4,16],[5,5,5,9],[5,12,5,16],[7,8,7,16],[8,8,8,16],[10,2,37,15],[38,2,38,15],[39,2,39,15],[40,2,40,15],[42,1,42,16],[45,2,45,4],[45,6,45,9],[45,11,45,15],[46,2,46,4],[46,11,46,15]]}
[{"$nulls":11},"RELATÓRIO DE ASSISTÊNCIA   TÉCNICA AO PRODUTOR RURAL ",{"$nulls":5},{"$f":"C9","v":"Visita N°"},{"$f":"D9","v":1}]
[]
[{"$nulls":10}," Formulário atualizado em: UPEC–05/01/2012"]
[]
[null,"  Produtor:",{"$nulls":12},"CPF:"]
[null,"  Município:",{"$nulls":8},"Comunidade:"]
[null,"  Convênio: ",{"$nulls":7}," META:",null," Nº Convênio:"]
[null,"  Nome  do Técnico / Matrícula:"]
[null,null,"Visita N°",1]
[{"$nulls":6},"ORIENTAÇÃO TÉCNICA (Situação Atual, Orientações e Recomendações) "]
{"$rows_empty":32}
[null,"Assinaturas"]
[]
[]
[]
[null,null,"Data",{"$nulls":5},"Técnico Responsável / Nº Conselho",null,null," Produtor"]
[null,"MOD.230-07 E MAPA/EMBRAPA",{"$nulls":9}," Formulário atualizado em: UPEC–13/03/2013"]

{"sheet":"Formulas","index":11,"n_rows":605,"n_cols":14,"rows_kept":605,"merged":[[0,1,1,2],[0,3,1,5],[3,1,3,12],[5,1,5,3],[5,5,5,7],[6,1,6,2],[6,5,7,7],[7,1,8,2],[7,3,8,3],[9,1,9,2],[10,1,10,2],[18,7,19,7],[19,1,20,1],[19,2,19,3],[20,2,20,3],[30,1,30,2],[30,5,30,7],[37,1,37,2],[37,5,37,8],[49,1,49,2],[49,4,49,5],[49,8,49,9],[50,1,50,2],[50,4,50,5],[50,8,50,9],[51,1,51,2],[51,4,51,5],[51,8,51,9],[52,1,52,2],[52,4,52,5],[52,8,52,9],[53,1,53,2],[53,4,53,5],[53,8,53,9],[54,1,54,2],[54,4,54,5],[54,8,54,9],[55,4,55,5],[56,1,56,2],[56,4,56,5],[56,9,56,10],[58,9,58,10],[59,9,59,10],[60,9,60,10],[61,9,61,10],[62,9,62,10],[63,9,63,10],[64,9,64,10],[64,11,64,12],[66,1,66,2],[66,5,66,8],[75,1,75,2],[75,5,75,8],[85,1,85,2],[85,5,85,8],[92,1,92,2],[92,5,92,10],[93,5,93,10],[102,1,102,2],[102,5,102,7],[103,5,104,7],[115,1,115,2],[126,1,126,2],[126,5,126,7],[134,1,134,2],[134,5,134,8],[153,1,153,5],[154,1,154,4],[154,5,155,5],[154,7,154,9],[155,7,155,8],[156,7,156,8],[157,7,157,8],[158,7,158,8],[162,1,162,10],[163,1,167,1],[163,2,163,3],[163,4,163,5],[163,6,167,6],[163,7,163,8],[163,9,163,10],[168,1,172,1],[168,4,168,5],[168,6,172,6],[168,7,168,8],[168,9,168,10],[175,1,175,5],[176,1,176,4],[176,5,177,5],[185,0,185,13],[186,0,189,0],[186,1,186,2],[186,3,186,4],[186,5,186,6],[186,7,189,7],[186,8,186,9],[186,10,186,11],[186,12,186,13],[190,0,193,0],[190,1,190,2],[190,3,190,4],[190,5,190,6],[190,7,193,7],[190,8,190,9],[190,10,190,11],[190,12,190,13],[198,1,198,2],[198,4,198,10],[199,7,199,8],[199,9,199,10],[208,1,208,2],[208,4,208,10],[209,7,209,8],[209,9,209,10],[217,1,217,2],[217,4,217,10],[218,7,218,8],[218,9,218,10],[226,1,226,2],[226,4,226,8],[234,1,234,2],[234,4,234,8],[242,1,242,2],[242,4,242,8],[250,1,250,2],[250,4,250,8],[251,4,251,5],[251,6,251,8],[283,1,283,2],[283,4,283,5],[296,4,298,11],[300,1,300,2],[300,4,300,9],[308,1,308,5],[308,6,308,9],[309,6,309,7],[309,8,309,9],[310,6,312,7],[310,8,312,9],[317,1,317,5],[317,6,317,9],[318,6,318,7],[318,8,318,9],[319,3,319,5],[319,6,323,7],[319,8,323,9],[326,1,326,5],[326,6,326,9],[327,1,327,2],[327,3,327,4],[327,6,327,7],[327,8,327,9],[328,1,328,2],[328,3,328,4],[328,6,331,7],[328,8,331,9],[329,1,329,2],[329,3,329,4],[334,1,334,5],[334,6,334,9],[335,1,335,2],[335,3,335,4],[335,6,335,7],[335,8,335,9],[336,1,336,2],[336,3,336,4],[336,6,338,7],[336,8,338,9],[337,1,337,2],[337,3,337,4],[341,1,341,5],[342,1,345,5],[347,1,347,3],[348,1,349,3],[351,1,351,2],[351,4,351,7],[352,4,352,7],[353,4,353,7],[358,1,358,2],[358,4,358,7],[359,4,359,5],[359,6,359,7],[360,4,363,5],[360,6,363,7],[365,1,365,2],[365,4,365,7],[366,4,366,5],[366,6,366,7],[367,4,371,5],[367,6,371,7],[373,1,373,3],[373,5,373,11],[374,1,375,3],[374,5,375,11],[377,1,377,2],[379,4,379,12],[384,1,384,13],[410,1,410,2],[411,1,411,2],[412,1,412,2],[413,1,413,2],[414,1,414,2],[415,1,415,2],[417,1,417,2],[418,1,418,2],[419,1,419,2],[420,1,420,2],[421,1,421,2],[422,1,422,2],[423,1,423,2],[424,1,424,2],[425,1,425,2],[426,1,426,2],[427,1,427,2],[428,1,428,2],[431,1,431,2],[432,1,432,2],[433,1,433,2],[434,1,434,2],[436,1,436,2],[439,1,439,2],[440,1,440,2],[441,1,441,2],[442,1,442,2],[443,1,443,2],[444,1,444,2],[446,1,446,2],[447,1,447,2],[448,1,448,2],[449,1,449,2],[450,1,450,2],[451,1,451,2],[452,1,452,2],[453,1,453,2],[454,1,454,2],[455,1,455,2],[456,1,456,2],[457,1,457,2],[460,1,460,2],[461,1,461,2],[462,1,462,2],[463,1,463,2],[465,1,465,2],[467,1,467,2],[468,1,468,2],[469,1,469,2],[470,1,470,2],[471,1,471,2],[472,1,472,2],[474,1,474,2],[475,1,475,2],[476,1,476,2],[477,1,477,2],[478,1,478,2],[479,1,479,2],[480,1,480,2],[481,1,481,2],[482,1,482,2],[483,1,483,2],[484,1,484,2],[485,1,485,2],[488,1,488,2],[489,1,489,2],[490,1,490,2],[491,1,491,2],[493,1,493,2],[495,1,495,2],[496,1,496,2],[497,1,497,2],[498,1,498,2],[499,1,499,2],[500,1,500,2],[501,1,501,2],[502,1,502,2],[506,1,506,2],[506,5,506,7],[507,5,508,7],[514,1,514,2],[514,4,514,8],[518,1,519,1],[518,2,519,2],[519,4,519,7],[526,1,526,2],[532,1,532,2],[536,7,536,8],[537,7,537,11],[539,5,539,6],[540,4,540,6],[544,5,544,6],[547,7,547,8],[551,1,551,6],[551,10,551,13],[552,1,553,6],[552,10,552,12],[553,10,553,12],[554,10,554,12],[557,10,557,13],[558,10,558,12],[559,10,559,12],[560,10,560,12],[561,10,561,12],[562,1,564,1],[562,2,564,2],[562,3,564,5],[562,10,562,12],[563,10,563,12],[564,10,564,12],[566,1,566,2],[568,1,569,11],[570,1,571,11],[572,1,573,11],[575,1,575,3],[575,4,575,5],[576,1,576,3],[576,4,576,5],[579,1,579,3],[579,5,579,8],[580,1,580,2],[581,1,581,2],[584,1,584,5],[587,1,587,3],[587,5,587,8],[588,1,588,2],[589,1,589,2],[590,1,590,2],[591,1,591,2],[592,1,592,3],[593,1,593,4],[600,1,600,4],[600,8,600,10],[601,1,601,4],[601,8,601,10],[602,1,602,4],[603,1,603,4],[604,1,604,4]]}
[null,"ISA",null,"FORMULAS"]
[]
[]
[null,"INDICATORS"]
[]
[1,"Weighting factor",{"$nulls":3},"Formulas\t\t"]
[null,"> 20%",null,0.9,null,"Formula (R parcial) = Yo + ax",{"$nulls":3},"Units I",null,"Units II"]
[null,"Production or sale price = to local",null,0.7,{"$nulls":5},"Aquaculture production",null,"Sc/ha"]
[{"$nulls":5},"yo",{"v":-0.3,"d":"-0.30"},null,null,"Bovine milk",null,"Ton./ha"]
[null,"< 20%",null,0.5,null,"a",0.01,null,null,"Cattle meat",null,"Kg/ha"]
[null,"< 40%",null,0.3,null,{"$f":"IF(ISBLANK('2 Indicators'!D17),\"\",(G9+G10*(100+(Formulas!E17*100))))","v":""},{"$f":"IF(ISBLANK('2 Indicators'!E17),\"\",(G9+G10*(100+(Formulas!F17*100))))","v":""},{"$f":"IF(ISBLANK('2 Indicators'!F17),\"\",(G9+G10*(100+(Formulas!G17*100))))","v":""},null,"Chicken meat",null," @/ha/year"]
[{"$nulls":5},{"$f":"IF(ISBLANK('2 Indicators'!D18),\"\",(G9+G10*(100+(Formulas!E18*100))))","v":""},{"$f":"IF(ISBLANK('2 Indicators'!E18),\"\",(G9+G10*(100+(Formulas!F18*100))))","v":""},{"$f":"IF(ISBLANK('2 Indicators'!F18),\"\",(G9+G10*(100+(Formulas!G18*100))))","v":""},null,"Coffee",null,"L of milk/ha/year"]
[{"$nulls":9},"Cotton",null,"L of milk/cow/day"]
[{"$nulls":5},{"$f":"AVERAGE(Formulas!E20:G21)","v":{"$error":"#DIV/0!"}},{"$nulls":3},"Eggs",null,"Kg/dia"]
[{"$nulls":5},{"$f":"IF('3 Report'!K35<50,Formulas!F14*0.7,Formulas!F14)","v":{"$error":"#DIV/0!"}},{"$f":"IF(F15<0,0,F15)","v":{"$error":"#DIV/0!"}},null,null,"Fisheries products",null,"Kg of food/kg de meat produced"]
[{"$nulls":9},"Forest products",null,"Piglets sold/pig/year"]
[null,"Variation of item 1.3 in relation to item 1.5",null,null,{"$f":"IF('2 Indicators'!D17>0,(('2 Indicators'!D17/'2 Indicators'!D19)-1),\"\")","v":""},{"$f":"IF('2 Indicators'!E17>0,(('2 Indicators'!E17/'2 Indicators'!E19)-1),\"\")","v":""},{"$f":"IF('2 Indicators'!F17>0,(('2 Indicators'!F17/'2 Indicators'!F19)-1),\"\")","v":""},{"v":1,"d":"1.0"},null,"Fruit cultivation",null,"Eggs/chicken/year"]
[null,"Variation of item 1.4 in relation to item 1.6",null,null,{"$f":"IF('2 Indicators'!D18>0,(('2 Indicators'!D18/'2 Indicators'!D20)-1),\"\")","v":""},{"$f":"IF('2 Indicators'!E18>0,(('2 Indicators'!E18/'2 Indicators'!E20)-1),\"\")","v":""},{"$f":"IF('2 Indicators'!F18>0,(('2 Indicators'!F18/'2 Indicators'!F20)-1),\"\")","v":""},{"v":1,"d":"1.0"},null,"Grains",null,"Food conversion/dozen eggs"]
[{"$nulls":4},{"v":1,"d":"1.0"},{"v":1,"d":"1.0"},{"v":1,"d":"1.0"},"Weighting matrix\t",null,"Livestock",null,"Food conversion/Kg"]
[null,"Partial result","Productivity",null,{"$f":"IF(ISBLANK('2 Indicators'!D17),\"\",IF(Formulas!F11>1,1,Formulas!F11))","v":""},{"$f":"IF(ISBLANK('2 Indicators'!E17),\"\",IF(Formulas!G11>1,1,Formulas!G11))","v":""},{"$f":"IF(ISBLANK('2 Indicators'!F17),\"\",IF(Formulas!H11>1,1,Formulas!H11))","v":""},null,null,"Maize",null,"Percentage of laying eggs"]
[null,null,"Selling price ",null,{"$f":"IF(ISBLANK('2 Indicators'!D18),\"\",IF(Formulas!F12>1,1,Formulas!F12))","v":""},{"$f":"IF(ISBLANK('2 Indicators'!E18),\"\",IF(Formulas!G12>1,1,Formulas!G12))","v":""},{"$f":"IF(ISBLANK('2 Indicators'!F18),\"\",IF(Formulas!H12>1,1,Formulas!H12))","v":""},null,null,"Oil paml fruit"]
[{"$nulls":9},"Others"]
[{"$nulls":9},"Pig Meat"]
[{"$nulls":9},"Potatos"]
[{"$nulls":9},"Rice"]
[{"$nulls":9},"Soybeans"]
[{"$nulls":9},"Sugar cane"]
[{"$nulls":9},"Vegetables"]
[{"$nulls":9},"Wheat"]
[]
[2,"Weighting factor",{"$nulls":3},"Formulas\t\t",{"$nulls":4},0.3]
[null,"item 2.3","1 - (F362 *0,3)",null,null,{"$f":"1-(('2 Indicators'!F39^2*Formulas!K31)+('2 Indicators'!F40^2*Formulas!K32)+('2 Indicators'!F41^2*Formulas!K33)+('2 Indicators'!F42^2*Formulas!K34))","v":{"$error":"#DIV/0!"}},{"$f":"IF(AND('2 Indicators'!F39>80%,'2 Indicators'!F43=\"Yes\"),F32-10%,F32)","v":{"$error":"#DIV/0!"}},{"$f":"IF(Formulas!G32<0.1,0.1,Formulas!G32)","v":{"$error":"#DIV/0!"}},null,null,0.3]
[null,"item 2.3","1 - (F372 *0,3)",{"$nulls":7},{"v":1,"d":"1.0"}]
[null,"item 2.3","1 - (F382 *1)",{"$nulls":7},{"v":2,"d":"2.0"}]
[null,"item 2.3","1 - (F392 *2)"]
[]
[]
[3,"Weighting factor",{"$nulls":3},"Formulas",{"$nulls":4},{"$f":"+Formulas!M38","v":{"$error":"#DIV/0!"}},null,{"$f":"(+(Formulas!E57-Formulas!J57)/('2 Indicators'!C95-'2 Indicators'!D95))","v":{"$error":"#DIV/0!"}}]
[null,"item 3.1",0.67,null,null,{"$f":"(Formulas!M38*'2 Indicators'!G100+Formulas!M39*'2 Indicators'!G101+Formulas!M40*'2 Indicators'!G102+Formulas!M41*'2 Indicators'!G103+Formulas!M42*'2 Indicators'!G104)","v":{"$error":"#DIV/0!"}},{"$f":"IF('2 Indicators'!F106>26%,F39*((1+('2 Indicators'!F106-0.26))),F39)","v":{"$error":"#DIV/0!"}},{"$f":"IF('2 Indicators'!F105>0,G39,1-(0.3-10*'2 Indicators'!F105))","v":{"$error":"#DIV/0!"}},{"$f":"IF(H39<0,0,H39)","v":{"$error":"#DIV/0!"}},null,{"$f":"+Formulas!M39","v":{"$error":"#DIV/0!"}},null,{"$f":"('2 Indicators'!$D$59-'2 Indicators'!$E$59)/('2 Indicators'!$C$95-'2 Indicators'!$D$95)","v":{"$error":"#DIV/0!"}}]
[null,"item 3.2",{"v":1,"d":"1.00"},{"$nulls":7},{"$f":"+Formulas!M40","v":{"$error":"#DIV/0!"}},null,{"$f":"('2 Indicators'!$D$67-'2 Indicators'!$E$67)/('2 Indicators'!$C$95-'2 Indicators'!$D$95)","v":{"$error":"#DIV/0!"}}]
[null,"item 3.3",{"v":1,"d":"1.00"},{"$nulls":7},{"$f":"+Formulas!M41","v":{"$error":"#DIV/0!"}},null,{"$f":"('2 Indicators'!$D$73-'2 Indicators'!$F$73)/('2 Indicators'!$C$95-'2 Indicators'!$D$95)","v":{"$error":"#DIV/0!"}}]
[null,"item 3.4",{"v":1,"d":"1.00"}]
[null,"Units III",{"$nulls":10},{"$f":"M42+M41+M40+M39+M38","v":{"$error":"#DIV/0!"}}]
[null,"Sprinkling",{"$nulls":7},"Verification",{"$f":"SUM(Formulas!M38:M42)","v":{"$error":"#DIV/0!"}}]
[null,"Drip / micro sprinkler"]
[null,"Central pivot irrigation"]
[null,"Other categories",null,"Item 3.2"]
[null,"Various types of irrigation",null,"Formula - RV(Residual Value) = (1-T)N x IV: T =Depreciation rate; N = time (nº of years); e IV = initial value"]
[{"$nulls":12},"Units IV"]
[null,"Categories",null,"Weighting","Total value",null,"Total area","Weighting","Historical value",null,"Total area",null,"Grain stock"]
[null,"Native vegetation",null,{"v":1,"d":"1.00"},{"$f":"('2 Indicators'!C92*D51)*G51*('3 Report'!$H$5)","v":{"$error":"#DIV/0!"}},null,{"$f":"'1 Survey'!E88+'1 Survey'!E89+'1 Survey'!E90+'1 Survey'!E91+'1 Survey'!E92","v":{"$error":"#DIV/0!"}},{"$f":"+D51","v":{"v":1,"d":"1.00"}},{"$f":"(K51*H51)*'2 Indicators'!D89*'2 Indicators'!D92","v":{"$error":"#DIV/0!"}},null,{"$f":"+('2 Indicators'!D85+'2 Indicators'!D84+'2 Indicators'!D86+'2 Indicators'!D87+'2 Indicators'!D88)/'2 Indicators'!D89","v":{"$error":"#DIV/0!"}},null,"Cattle"]
[null,"Pastures",null,{"v":1,"d":"1.00"},{"$f":"('2 Indicators'!C92*D52)*G52*('3 Report'!$H$5)","v":{"$error":"#DIV/0!"}},null,{"$f":"'1 Survey'!E86","v":{"$error":"#DIV/0!"}},{"$f":"+D52","v":{"v":1,"d":"1.00"}},{"$f":"(K52*H52)*'2 Indicators'!D89*'2 Indicators'!D92","v":{"$error":"#DIV/0!"}},null,{"$f":"+'2 Indicators'!D82/'2 Indicators'!D89","v":{"$error":"#DIV/0!"}},null,"Horse / Donkey"]
[null,"Anual crops",null,{"v":1,"d":"1.00"},{"$f":"('2 Indicators'!C92*D53)*G53*('3 Report'!$H$5)","v":{"$error":"#DIV/0!"}},null,{"$f":"'1 Survey'!E85","v":{"$error":"#DIV/0!"}},{"$f":"+D53","v":{"v":1,"d":"1.00"}},{"$f":"K53*'2 Indicators'!D89*('2 Indicators'!D92*H53)","v":{"$error":"#DIV/0!"}},null,{"$f":"+'2 Indicators'!D81/'2 Indicators'!D89","v":{"$error":"#DIV/0!"}},null,"Pig"]
[null,"Irrigation  (R$1.000,00/ha)",null,{"v":5000,"d":"5,000.00"},{"$f":"+'3 Report'!H5*G54*D54","v":{"$error":"#DIV/0!"}},null,{"$f":"'2 Indicators'!C77/'3 Report'!H5","v":{"$error":"#DIV/0!"}},{"$f":"+D54","v":{"v":5000,"d":"5,000.00"}},{"$f":"+'2 Indicators'!D89*K54*H54","v":{"$error":"#DIV/0!"}},null,{"$f":"+'2 Indicators'!D77/'3 Report'!H5","v":{"$error":"#DIV/0!"}},null,"Goats / Sheep"]
[null,"Permanent crops",null,{"v":1,"d":"1.00"},{"$f":"('2 Indicators'!C92*D55)*G55*('3 Report'!$H$5)","v":{"$error":"#DIV/0!"}},null,{"$f":"'1 Survey'!E84+'1 Survey'!E87","v":{"$error":"#DIV/0!"}},{"$f":"+D55","v":{"v":1,"d":"1.00"}},{"$f":"K55*'2 Indicators'!D89*('2 Indicators'!D92*H55)","v":{"$error":"#DIV/0!"}},null,{"$f":"+('2 Indicators'!D80+'2 Indicators'!D83)/'2 Indicators'!D89","v":{"$error":"#DIV/0!"}},null,"Chickens"]
[{"$nulls":6},{"$f":"+G55+G53+G52+G51","v":{"$error":"#DIV/0!"}},null,null,"Historical",{"$f":"+K55+K53+K52+K51","v":{"$error":"#DIV/0!"}},null,"Others"]
[null,"Land value",null,null,{"$f":"E51+E52+E53+E54+E55","v":{"$error":"#DIV/0!"}},null,null,"",null,{"$f":"I51+I52+I53+I54+I55","v":{"$error":"#DIV/0!"}}]
[]
[null,"Current and historical land use and occupation",{"$nulls":5},{"$f":"J59/'2 Indicators'!C95","v":{"$error":"#DIV/0!"}},null,{"$f":"(((Formulas!G53-Formulas!K53)*'3 Report'!H5*'2 Indicators'!C92*1.1)+((Formulas!G54-Formulas!K54)*'3 Report'!H5*('2 Indicators'!C92+1000))+((Formulas!G55-Formulas!K55)*'3 Report'!H5*'2 Indicators'!C92*1.3))","v":{"$error":"#DIV/0!"}}]
[{"$nulls":9},{"$f":"('2 Indicators'!$C$92*Formulas!D51)*Formulas!K51*'3 Report'!$H$5","v":{"$error":"#DIV/0!"}}]
[null,"The evolution of asset values discounting land appreciation",{"$nulls":5},{"$f":"IF('2 Indicators'!D95>0,('2 Indicators'!C95/L65-1),\"\")","v":{"$error":"#DIV/0!"}},null,{"$f":"('2 Indicators'!$C$92*Formulas!D52)*Formulas!K52*'3 Report'!$H$5","v":{"$error":"#DIV/0!"}}]
[{"$nulls":9},{"$f":"('2 Indicators'!$C$92*Formulas!D53)*Formulas!K53*'3 Report'!$H$5","v":{"$error":"#DIV/0!"}}]
[null,"Asset development",{"$nulls":5},{"$f":"IF('2 Indicators'!C95>0,('2 Indicators'!C95/'2 Indicators'!D95-1),\"\")","v":{"$error":"#DIV/0!"}},null,{"$f":"Formulas!I54","v":{"$error":"#DIV/0!"}}]
[{"$nulls":9},{"$f":"('2 Indicators'!$C$92*Formulas!D55)*Formulas!K55*'3 Report'!$H$5","v":{"$error":"#DIV/0!"}}]
[{"$nulls":9},{"$f":"SUM(J60:K64)","v":{"$error":"#DIV/0!"}},null,{"$f":"+J65+'2 Indicators'!E59+'2 Indicators'!E67+'2 Indicators'!F73","v":{"$error":"#DIV/0!"}}]
[]
[null,"Weighting factor",{"$nulls":3},"Formulas"]
[null,{"v":0,"d":"0%"},0.7,null,null,{"$f":"IF('2 Indicators'!E112=0,0.7,0)","v":{"$error":"#DIV/0!"}},{"$f":"SUM(F68:F71)","v":{"$error":"#DIV/0!"}}]
[null,"0-7,5%","y = 0,04x + 0,7",null,null,{"$f":"IF('2 Indicators'!E112>0,G69,0)","v":{"$error":"#DIV/0!"}},{"$f":"IF('2 Indicators'!E112>=0.075,0,H69)","v":{"$error":"#DIV/0!"}},{"$f":"0.04*('2 Indicators'!E112*100)+0.7","v":{"$error":"#DIV/0!"}}]
[null,"7,5-30%","y = -0,04x + 1,3",null,null,{"$f":"IF('2 Indicators'!E112>=0.075,G70,0)","v":{"$error":"#DIV/0!"}},{"$f":"IF('2 Indicators'!E112>0.3,0,H70)","v":{"$error":"#DIV/0!"}},{"$f":"-0.04*('2 Indicators'!E112*100)+1.3","v":{"$error":"#DIV/0!"}}]
[null,"15-30%","y = -0,4x + 1,29",null,null,{"$f":"IF('2 Indicators'!E112>0.3,0.1,0)","v":{"$error":"#DIV/0!"}}]
[null,">30%",0.1]
[null,">25%",0.1]
[]
[]
[4,"Weighting factor",{"$nulls":3},"Formulas"]
[null,"Water availability",{"v":1,"d":"1.0"},null,null,{"$f":"IF(G77>0,1,0)","v":0},{"$f":"+'2 Indicators'!D129+'2 Indicators'!D126+'2 Indicators'!D125+'2 Indicators'!D124+'2 Indicators'!D123*I77+'2 Indicators'!D130+'2 Indicators'!D127+'2 Indicators'!D128","v":0},{"$f":"(('2 Indicators'!D123*I77+'2 Indicators'!D124+'2 Indicators'!D125+'2 Indicators'!D126+'2 Indicators'!D127+'2 Indicators'!D128+'2 Indicators'!D129+'2 Indicators'!D130)+('2 Indicators'!E123*I77+'2 Indicators'!E124+'2 Indicators'!E125+'2 Indicators'!E126+'2 Indicators'!E127+'2 Indicators'!E128+'2 Indicators'!E129+'2 Indicators'!E130))/H79","v":0},1,null,1]
[null,"Acess to eletricity",{"v":1,"d":"1.0"},null,null,{"$f":"IF(G78>0,1,0)","v":0},{"$f":"+'2 Indicators'!E129+'2 Indicators'!E126+'2 Indicators'!E125+'2 Indicators'!E124+'2 Indicators'!E123*I77+'2 Indicators'!E130+'2 Indicators'!E127+'2 Indicators'!E128","v":0},{"$f":"+F80+F79+F78+F77","v":0},null,null,0.5]
[null,"Road access to the farm\t",{"v":1,"d":"1.0"},{"$nulls":4},{"$f":"IF(H78=0,1,H78)","v":{"v":1,"d":"1.00"}},null,null,0]
[null,"Access to health care",{"v":1,"d":"1.0"}]
[null,"School transportation",{"v":1,"d":"1.0"}]
[null,"Security ",{"v":1,"d":"1.0"}]
[null,"Internet\t",{"v":1,"d":"1.0"}]
[null,"Waste collection\t",{"v":1,"d":"1.0"}]
[]
[null,"Weighting factor",{"$nulls":3},"Formulas"]
[null,"Vegetables",{"v":1,"d":"1.0"},null,null,{"$f":"IF(G87>0,1,0)","v":0},{"$f":"'2 Indicators'!D136+'2 Indicators'!D137+'2 Indicators'!D138","v":0}]
[null,"Orchard",{"v":1,"d":"1.0"},null,null,{"$f":"IF(G88>0,1,0)","v":0},{"$f":"'2 Indicators'!E136+'2 Indicators'!E137+'2 Indicators'!E138","v":0}]
[null,"Milk, eggs, meat",{"v":1,"d":"1.0"},null,null,{"$f":"IF(('2 Indicators'!D136+'2 Indicators'!D137+'2 Indicators'!D138)=0,0,(('2 Indicators'!D136+'2 Indicators'!D137+'2 Indicators'!D138)+('2 Indicators'!E136+'2 Indicators'!E137+'2 Indicators'!E138))/F90)","v":0}]
[{"$nulls":5},{"$f":"SUM(F87:F88)","v":0}]
[]
[]
[5,"Weighting factor",{"$nulls":3},"Formulas"]
[null,{"$f":"+'2 Indicators'!B148:C148","v":"Less than 9 years of study\t"},0.7,null,null,"Formula: sustainability threshold (0,7) => adults with at least 5 years of schooling and children in the school system.Training courses directed to the activity and qualified workforce => adds maximum 0.3"]
[null,{"$f":"+'2 Indicators'!B149:C149","v":"Complete primary education"},{"v":1,"d":"1.0"},null,null,{"$f":"IF('2 Indicators'!D147>0,((('2 Indicators'!D148*'2 Indicators'!F148+'2 Indicators'!D149*'2 Indicators'!F149+'2 Indicators'!D150*'2 Indicators'!F150+'2 Indicators'!D151*'2 Indicators'!F151))*0.7),0)","v":0},{"$f":"IF('2 Indicators'!D147>0,(('2 Indicators'!D155*'2 Indicators'!F155+'2 Indicators'!D156*'2 Indicators'!F156))*0.3,0)","v":0},{"$f":"+'2 Indicators'!D147+'2 Indicators'!E147","v":0},{"$f":"IF('2 Indicators'!D161>0,(('2 Indicators'!D162*'2 Indicators'!F162)*0.7),0)","v":0},null,{"$f":"I97+G97","v":{"$error":"#DIV/0!"}}]
[null,{"$f":"+'2 Indicators'!B150:C150","v":"Complete secondary education"},1.2,null,null,{"$f":"IF('2 Indicators'!E147>0,((('2 Indicators'!E148*'2 Indicators'!F148+'2 Indicators'!E149*'2 Indicators'!F149+'2 Indicators'!E150*'2 Indicators'!F150+'2 Indicators'!E151*'2 Indicators'!F151))*0.7),0)","v":0},{"$f":"IF('2 Indicators'!E147>0,(('2 Indicators'!E155*'2 Indicators'!F155+'2 Indicators'!E156*'2 Indicators'!F156))*0.3,0)","v":0},{"$f":"+'2 Indicators'!D161+'2 Indicators'!E161","v":0},{"$f":"IF('2 Indicators'!E161>0,(('2 Indicators'!E162*'2 Indicators'!F162))*0.7,0)","v":0},null,{"$f":"K95","v":{"$error":"#DIV/0!"}}]
[null,{"$f":"+'2 Indicators'!B151:C151","v":"College / University"},1.5,null,null,{"$f":"(F95+F96)/H95","v":{"$error":"#DIV/0!"}},{"$f":"(G95+G96)/H95","v":{"$error":"#DIV/0!"}},{"$f":"(I95+I96)/H96","v":{"$error":"#DIV/0!"}},{"$f":"IF(OR('2 Indicators'!D161>0,'2 Indicators'!E161>0),((H97+F97)/2),F97)","v":{"$error":"#DIV/0!"}}]
[null,{"$f":"+'2 Indicators'!B155:C155","v":"Short training season\t"},0.5]
[null,{"$f":"+'2 Indicators'!B156:C156","v":"Long-term training\t"},0.8]
[null,{"$f":"+'2 Indicators'!B162:C162","v":"Number of children in school\t"},{"v":1,"d":"1.0"}]
[]
[]
[6,"Weighting factor",{"$nulls":3},"Formulas"]
[null,{"$f":"+'2 Indicators'!B171:D171","v":"Employee registration\t\t"},{"v":1,"d":"1.0"},null,null,"Formula: = 0.7 if there is compliance with the law regarding the registration and overtime payment of all employees; aid and benefits - maximum 0.3"]
[null,{"$f":"+'2 Indicators'!B172:D172","v":"Overtime payment / absence of overtime\t\t"},{"v":1,"d":"1.0"}]
[null,{"$f":"+'2 Indicators'!B177:D177","v":"Above minimum wage\t\t"},{"v":1,"d":"1.0"},null,null,{"$f":"IF('2 Indicators'!D170>0,((('2 Indicators'!D171*'2 Indicators'!$F$171+'2 Indicators'!D172*'2 Indicators'!$F$172)/('2 Indicators'!D170*2))*0.7),0.7)","v":{"v":0.7,"d":"0.70"}},{"$f":"IF('2 Indicators'!D170>0,(('2 Indicators'!D177*'2 Indicators'!$F$177+'2 Indicators'!D178*'2 Indicators'!$F$178+'2 Indicators'!D179*'2 Indicators'!$F$179+'2 Indicators'!D180*'2 Indicators'!$F$180+'2 Indicators'!D181*'2 Indicators'!$F$181+'2 Indicators'!D182*'2 Indicators'!$F$182+'2 Indicators'!D183*'2 Indicators'!$F$183+'2 Indicators'!D184*'2 Indicators'!$F$184)/('2 Indicators'!D170*8)*0.3),0)","v":0},{"$f":"(F106+G106)","v":{"v":0.7,"d":"0.70"}}]
[null,{"$f":"+'2 Indicators'!B178:D178","v":"Food supplementation\t\t"},{"v":1,"d":"1.0"},null,null,{"$f":"IF('2 Indicators'!E170>0,((('2 Indicators'!E171*'2 Indicators'!$F$171+'2 Indicators'!E172*'2 Indicators'!$F$172)/('2 Indicators'!E170*2))*0.7),0.7)","v":{"v":0.7,"d":"0.70"}},{"$f":"IF('2 Indicators'!E170>0,(('2 Indicators'!E177*'2 Indicators'!$F$177+'2 Indicators'!E178*'2 Indicators'!$F$178+'2 Indicators'!E179*'2 Indicators'!$F$179+'2 Indicators'!E180*'2 Indicators'!$F$180+'2 Indicators'!E181*'2 Indicators'!$F$181+'2 Indicators'!E182*'2 Indicators'!$F$182+'2 Indicators'!E183*'2 Indicators'!$F$183+'2 Indicators'!E184*'2 Indicators'!$F$184)/('2 Indicators'!E170*8)*0.3),0)","v":0},{"$f":"(F107+G107)","v":{"v":0.7,"d":"0.70"}}]
[null,{"$f":"+'2 Indicators'!B179:D179","v":"Housing assistance\t\t"},{"v":1,"d":"1.0"},null,null,{"$f":"+H106","v":{"v":0.7,"d":"0.70"}},{"$f":"IF('2 Indicators'!E170>0,(H107+F108)/2,F108)","v":{"v":0.7,"d":"0.70"}},{"$f":"IF(SUM('2 Indicators'!D170:E170)=0,0.7,Formulas!G108)","v":{"v":0.7,"d":"0.70"}}]
[null,{"$f":"+'2 Indicators'!B180:D180","v":"Education and transportation assistance\t\t"},{"v":1,"d":"1.0"}]
[null,{"$f":"+'2 Indicators'!B181:D181","v":"Profit sharing\t\t"},{"v":5,"d":"5.0"}]
[null,{"$f":"+'2 Indicators'!B182:D182","v":"Accident insurance\t\t"},{"v":3,"d":"3.0"}]
[null,{"$f":"+'2 Indicators'!B183:D183","v":"Access to leisure\t\t"},{"v":1,"d":"1.0"}]
[null,{"$f":"+'2 Indicators'!B184:D184","v":"Space for growing food\t\t"},{"v":3,"d":"3.0"}]
[]
[]
[7,"Weighting factor"]
[null,{"$f":"+'2 Indicators'!C191","v":"Cash flow (income / expense)\t"},0.5]
[null,{"$f":"+'2 Indicators'!C192","v":" Production's cost \t"},0.5]
[null,"Access to technical assistance",{"v":1,"d":"1.0"}]
[null,"Existence of rural associations and the farmer's participation",{"v":1,"d":"1.0"}]
[null,"Environmental regularization (water use, licensing)",{"v":1,"d":"1.0"}]
[null,{"$f":"+'2 Indicators'!C196","v":"Access to investment loans\t"},0.4]
[null,{"$f":"+'2 Indicators'!C197","v":"Access to loans for the farm activities\t"},0.4]
[null,{"$f":"+'2 Indicators'!C198","v":"Access loans for commercialization\t"},0.2]
[]
[]
[8,"Weighting factor",{"$nulls":3},"Fórmulas"]
[null,{"$f":"+'2 Indicators'!B205:D205","v":"Buyer diversification / Market research, pre-sale pricing\t"},0.4,null,null,{"$f":"(G128*C128+G129*C129+G130*C130+G131*C131)","v":{"v":0,"d":"0.00"}},{"$f":"IF('2 Indicators'!E205=\"Yes\",1,0)","v":0}]
[null,{"$f":"+'2 Indicators'!B206:D206","v":"Certified production /  Added value\t\t"},0.4,{"$nulls":3},{"$f":"IF('2 Indicators'!E206=\"Yes\",1,0)","v":0}]
[null,{"$f":"+'2 Indicators'!B209:D209","v":"Adoption of innovative techniques*\t\t"},0.3,{"$nulls":3},{"$f":"IF('2 Indicators'!E209=\"Yes\",1,0)","v":0}]
[null,{"$f":"+'2 Indicators'!B211:D211","v":"Ability to innovate or leadership\t\t"},0.4,{"$nulls":3},{"$f":"IF('2 Indicators'!E211=\"Yes\",1,0)","v":0}]
[]
[]
[]
[9,"Weighting factor",{"$nulls":3},"Fórmulas"]
[null,"9.1 Sewage destination\t",{"v":1,"d":"1.0"},null,null,{"$f":"IF(G136>1,1,G136)","v":{"$error":"#DIV/0!"}},{"$f":"IF(H136>0,I136/H136,I136)","v":{"$error":"#DIV/0!"}},{"$f":"COUNTIF('2 Indicators'!E223:F231,\">=0\")","v":0},{"$f":"'2 Indicators'!F223+'2 Indicators'!F224+'2 Indicators'!E227+'2 Indicators'!E230+'2 Indicators'!E231","v":{"$error":"#DIV/0!"}},null,"Not applicable"]
[null,"9.2 Garbage destination",{"v":1,"d":"1.0"},null,null,{"$f":"IF('2 Indicators'!E234=\"Yes\",Formulas!F136*0.7,Formulas!F136)","v":{"$error":"#DIV/0!"}}]
[null,"9.3 Composting and/or reuse of organic solid waste\t\t",{"v":1,"d":"1.0"}]
[null,"9.4 Adequate allocation and treatment of liquid effluents",{"v":1,"d":"1.0"}]
[null,"9.5 Treatment of gaseous effluents\t\t",{"v":1,"d":"1.0"}]
[]
[null,"Units V",{"$nulls":3},"Weighting factor"]
[null,"Absence of any collection and treatment structure\t",{"$nulls":3},{"v":1E-4,"d":"0.00"},{"$f":"IF('2 Indicators'!$D$223=Formulas!B143,1,0)","v":0},{"$f":"G143*F143","v":0},{"$f":"IF('2 Indicators'!$E$223=Formulas!B143,1,0)","v":0},{"$f":"I143*F143","v":0},{"$f":"SUM(G143:G147)","v":0},{"$f":"SUM(I143:I147)","v":0},{"$f":"L143+K143","v":0}]
[null,"Rudimentary sewage collector\t",{"$nulls":3},0.25,{"$f":"IF('2 Indicators'!$D$223=Formulas!B144,1,0)","v":0},{"$f":"G144*F144","v":0},{"$f":"IF('2 Indicators'!$E$223=Formulas!B144,1,0)","v":0},{"$f":"I144*F144","v":0},{"$f":"SUM(H143:H147)","v":0},{"$f":"SUM(J143:J147)","v":0},{"$f":"SUM(K144:L144)/M143","v":{"$error":"#DIV/0!"}}]
[null,"Sewage collector, filter, sump",{"$nulls":3},{"v":0.7,"d":"0.70"},{"$f":"IF('2 Indicators'!$D$223=Formulas!B145,1,0)","v":0},{"$f":"G145*F145","v":0},{"$f":"IF('2 Indicators'!$E$223=Formulas!B145,1,0)","v":0},{"$f":"I145*F145","v":0}]
[null,"Sewage collection with adequate maintenance\t",{"$nulls":3},{"v":0.8,"d":"0.80"},{"$f":"IF('2 Indicators'!$D$223=Formulas!B146,1,0)","v":0},{"$f":"G146*F146","v":0},{"$f":"IF('2 Indicators'!$E$223=Formulas!B146,1,0)","v":0},{"$f":"I146*F146","v":0}]
[null,"Biodigester tank, separation of gray water\t\t",{"$nulls":3},{"v":1,"d":"1.00"},{"$f":"IF('2 Indicators'!$D$223=Formulas!B147,1,0)","v":0},{"$f":"G147*F147","v":0},{"$f":"IF('2 Indicators'!$E$223=Formulas!B147,1,0)","v":0},{"$f":"I147*F147","v":0}]
[null,"Units VI"]
[null,"Burned / discarded in inappropriate place\t",{"$nulls":3},{"v":1E-4,"d":"0.00"},{"$f":"IF('2 Indicators'!$D$224=Formulas!B149,1,0)","v":0},{"$f":"G149*F149","v":0},{"$f":"IF('2 Indicators'!$E$224=Formulas!B149,1,0)","v":0},{"$f":"I149*F149","v":0},{"$f":"SUM(G149:G152)","v":0},{"$f":"SUM(I149:I152)","v":0},{"$f":"L149+K149","v":0}]
[null,"Buried on the farm",{"$nulls":3},{"v":0.3,"d":"0.30"},{"$f":"IF('2 Indicators'!$D$224=Formulas!B150,1,0)","v":0},{"$f":"G150*F150","v":0},{"$f":"IF('2 Indicators'!$E$224=Formulas!B150,1,0)","v":0},{"$f":"I150*F150","v":0},{"$f":"SUM(H149:H152)","v":0},{"$f":"SUM(J149:J152)","v":0},{"$f":"SUM(K150:L150)/M149","v":{"$error":"#DIV/0!"}}]
[null,"Garbage taken by the farmer\t",{"$nulls":3},{"v":0.8,"d":"0.80"},{"$f":"IF('2 Indicators'!$D$224=Formulas!B151,1,0)","v":0},{"$f":"G151*F151","v":0},{"$f":"IF('2 Indicators'!$E$224=Formulas!B151,1,0)","v":0},{"$f":"I151*F151","v":0}]
[null,"Garbage collected\t",{"$nulls":3},{"v":1,"d":"1.00"},{"$f":"IF('2 Indicators'!$D$224=Formulas!B152,1,0)","v":0},{"$f":"G152*F152","v":0},{"$f":"IF('2 Indicators'!$E$224=Formulas!B152,1,0)","v":0},{"$f":"I152*F152","v":0}]
[]
[10,"SOM - Weighting factor"]
[null,"Classification",{"$nulls":3},"Weighting ",null,"Soil granulometry (dag kg-1 of clay)"]
[null,"Sandy\t","Loam\t","Clay\t","Heavy clay\t",null,null,"Sandy",null,"≤ 15"]
[null,{"v":0,"d":"0.00"},{"v":0,"d":"0.00"},{"v":0,"d":"0.00"},{"v":0,"d":"0.00"},{"v":0.1,"d":"0.10"},null,"Loam",null,"16 a 34"]
[null,{"v":0.8,"d":"0.80"},{"v":1.6,"d":"1.60"},{"v":2.4,"d":"2.40"},{"v":2.8,"d":"2.80"},{"v":0.5,"d":"0.50"},null,"Clay",null,"35 a 60"]
[null,{"v":1.1,"d":"1.10"},{"v":2.1,"d":"2.10"},{"v":3.1,"d":"3.10"},{"v":3.6,"d":"3.60"},{"v":0.7,"d":"0.70"},null,"Heavy clay",null,"> 60"]
[null,{"v":1.5,"d":"1.50"},{"v":3,"d":"3.00"},{"v":4.5,"d":"4.50"},{"v":5.2,"d":"5.20"},{"v":1,"d":"1.00"}]
[null,{"v":4.5,"d":"4.50"},{"v":9,"d":"9.00"},{"v":13.5,"d":"13.50"},{"v":15.6,"d":"15.60"},{"v":0.7,"d":"0.70"}]
[]
[null,"SOM - Formulas"]
[null,"Sandy"," Yo + ax + bx2 + cx3 ",null,"Formula2 = Yo + ax ",null,"Loam"," Yo + ax + bx2 + cx3 ",null,"Formula2 = Yo + ax ",null,null,{"$f":"IF(AND('2 Indicators'!E242=\"Sandy\"),IF('2 Indicators'!C243<1.5,Formulas!E167,Formulas!F167),0)","v":{"v":0,"d":"0.00"}}]
[null,null,"Yo",{"v":0.1,"d":"0.100"},"Yo",1.15,null,"Yo",{"v":0.1,"d":"0.100"},"Yo",1.15,null,{"$f":"IF(AND('2 Indicators'!E242=\"Loam\"),IF('2 Indicators'!C243<3,Formulas!J167,Formulas!K167),0)","v":{"v":0,"d":"0.00"}}]
[null,null,"a",{"v":0.3597,"d":"0.360"},"a",{"v":-0.1,"d":"-0.10"},null,"a",{"v":0.0024,"d":"0.002"},"a",-0.05,null,{"$f":"IF(AND('2 Indicators'!E242=\"Clay\"),IF('2 Indicators'!C243<4.5,Formulas!E172,Formulas!F172),0)","v":{"v":0,"d":"0.00"}}]
[null,null,"b",{"v":0.1926,"d":"0.193"},{"$f":"D165+D166*'2 Indicators'!C243+D167*'2 Indicators'!C243^2+D168*'2 Indicators'!C243^3","v":{"v":0.1,"d":"0.10"}},{"$f":"F165+F166*'2 Indicators'!C243","v":1.15},null,"b",{"v":0.2183,"d":"0.218"},{"$f":"I165+I166*'2 Indicators'!C243+I167*'2 Indicators'!C243^2+I168*'2 Indicators'!C243^3","v":{"v":0.1,"d":"0.10"}},{"$f":"K165+K166*'2 Indicators'!C243","v":1.15},null,{"$f":"IF(AND('2 Indicators'!E242=\"Heavy clay\"),IF('2 Indicators'!C243<5.2,Formulas!J172,Formulas!K172),0)","v":{"v":0,"d":"0.00"}}]
[null,null,"c",{"v":-0.0216,"d":"-0.022"},{"$nulls":3},"c",{"v":-0.0397,"d":"-0.040"},{"$nulls":3},{"$f":"(M164+M165+M166+M167)","v":{"v":0,"d":"0.00"}}]
[null,"Clay"," Yo + ax + bx2 + cx3 ",null,"Formula2 = Yo + ax ",null,"Heavy clay\t"," Yo + ax + bx2 + cx3 ",null,"Formula2 = Yo + ax "]
[null,null,"Yo",{"v":0.1,"d":"0.100"},"Yo",1.15,null,"Yo",{"v":0.1,"d":"0.100"},"Yo",1.15]
[null,null,"a",{"v":-0.0452,"d":"-0.045"},"a",{"v":-0.03333,"d":"-0.03"},null,"a",{"v":-0.0486,"d":"-0.049"},"a",{"v":-0.0288,"d":"-0.03"}]
[null,null,"b",{"v":0.1269,"d":"0.127"},{"$f":"D170+D171*'2 Indicators'!C243+D172*'2 Indicators'!C243^2+D173*'2 Indicators'!C243^3","v":{"v":0.1,"d":"0.10"}},{"$f":"F170+F171*'2 Indicators'!C243","v":1.15},null,"b",{"v":0.0984,"d":"0.098"},{"$f":"I170+I171*'2 Indicators'!C243+I172*'2 Indicators'!C243^2+I173*'2 Indicators'!C243^3","v":{"v":0.1,"d":"0.10"}},{"$f":"K170+K171*'2 Indicators'!C243","v":1.15}]
[null,null,"c",{"v":-0.0161,"d":"-0.016"},{"$nulls":3},"c",{"v":-0.0107,"d":"-0.011"}]
[]
[]
[null,"P - Weighting factor"]
[null,"Classification",{"$nulls":3},"Weighting "]
[null,"Sandy\t","Loam\t","Clay\t","Heavy clay\t"]
[null,{"v":0,"d":"0.00"},{"v":0,"d":"0.00"},{"v":0,"d":"0.00"},{"v":0,"d":"0.00"},{"v":0.1,"d":"0.10"}]
[null,{"v":12.1,"d":"12.10"},{"v":10.1,"d":"10.10"},{"v":5.1,"d":"5.10"},{"v":3.1,"d":"3.10"},0.25]
[null,{"v":18.1,"d":"18.10"},{"v":15.1,"d":"15.10"},{"v":8.1,"d":"8.10"},{"v":4.1,"d":"4.10"},{"v":0.5,"d":"0.50"}]
[null,{"v":25.1,"d":"25.10"},{"v":20.1,"d":"20.10"},{"v":12.1,"d":"12.10"},{"v":6.1,"d":"6.10"},{"v":0.7,"d":"0.70"}]
[null,{"v":40,"d":"40.00"},{"v":30,"d":"30.00"},{"v":18,"d":"18.00"},{"v":9,"d":"9.00"},{"v":1,"d":"1.00"}]
[null,{"v":400,"d":"400.00"},{"v":300,"d":"300.00"},{"v":180,"d":"180.00"},{"v":90,"d":"90.00"},{"v":0.7,"d":"0.70"}]
[]
["P - Formulas"]
["Sandy"," Yo + ax ",null,"F2 = Yo + ax + bx2 ",null,"F3 = Yo + ax ",null,"Loam","F1 = Yo + ax + bx2 ",null,"F2 = Yo + ax + bx2 ",null,"F3 = Yo + ax "]
[null,"Yo",{"v":0.1,"d":"0.10"},"Yo",{"v":-0.4748,"d":"-0.47"},"Yo",{"v":1.0233,"d":"1.02"},null,"Yo",{"v":0.1,"d":"0.10"},"Yo",{"v":-0.3015,"d":"-0.30"},"Yo",{"v":1.0333,"d":"1.03"}]
[null,"a",{"v":0.0124,"d":"0.01"},"a",{"v":0.0721,"d":"0.07"},"a",{"v":-0.0008,"d":"-0.00"},null,"a",{"v":-0.0087,"d":"-0.01"},"a",{"v":0.0639,"d":"0.06"},"a",{"v":-0.0011,"d":"-0.00"}]
[{"$nulls":3},"b",{"v":-1E-3,"d":"-0.00"},{"$nulls":3},"b",{"v":2.3E-3,"d":"0.00"},"b",{"v":-0.0007,"d":"-0.00"}]
["Clay","F1 = Yo + ax + bx2 ",null,"F2 = Yo + ax + bx2 ",null,"F3 = Yo + ax ",null,"Heavy clay\t","F1 = Yo + ax + bx2 ",null,"F2 = Yo + ax + bx2 ",null,"F3 = Yo + ax "]
[null,"Yo",{"v":0.1,"d":"0.10"},"Yo",{"v":0.1034,"d":"0.10"},"Yo",{"v":1.04333,"d":"1.04"},null,"Yo",{"v":0.1,"d":"0.10"},"Yo",{"v":0.1076,"d":"0.11"},"Yo",{"v":1.0333,"d":"1.03"}]
[null,"a",{"v":-0.0045,"d":"-0.00"},"a",{"v":0.0483,"d":"0.05"},"a",{"v":-1.9E-3,"d":"-0.00"},null,"a",{"v":-0.1041,"d":"-0.10"},"a",{"v":0.0928,"d":"0.09"},"a",{"v":-0.0037,"d":"-0.00"}]
[null,"b",{"v":0.0067,"d":"0.01"},"b",{"v":8.56e-05,"d":"0.00"},{"$nulls":3},"b",{"v":0.0492,"d":"0.05"},"b",{"v":0.0007,"d":"0.00"}]
[null,{"$f":"C188+C189*'2 Indicators'!C244","v":{"v":0.1,"d":"0.10"}},{"$f":"E188+E189*'2 Indicators'!C244+E190*'2 Indicators'!C244^2","v":{"v":-0.4748,"d":"-0.47"}},{"$f":"0.1946+0.0201*'2 Indicators'!C244","v":{"v":0.1946,"d":"0.19"}},{"$f":"G188+G189*'2 Indicators'!C244","v":{"v":1.0233,"d":"1.02"}},{"$f":"IF('2 Indicators'!C244<=12.1,B195,IF(AND('2 Indicators'!C244>12.1,'2 Indicators'!C244<25.1),C195,IF('2 Indicators'!C244>40,E195,D195)))","v":{"v":0.1,"d":"0.10"}},{"$nulls":3},{"$f":"J188+J189*'2 Indicators'!C244+J190*'2 Indicators'!C244^2","v":{"v":0.1,"d":"0.10"}},{"$f":"L188+L189*'2 Indicators'!C244+L190*'2 Indicators'!C244^2","v":{"v":-0.3015,"d":"-0.30"}},{"$f":"N188+N189*'2 Indicators'!C244","v":{"v":1.0333,"d":"1.03"}},{"$f":"IF(AND('2 Indicators'!C244>15.1,'2 Indicators'!C244<30),K195,IF('2 Indicators'!C244>=30,L195,J195))","v":{"v":0.1,"d":"0.10"}}]
[null,{"$f":"C192+C193*'2 Indicators'!C244+C194*'2 Indicators'!C244^2","v":{"v":0.1,"d":"0.10"}},{"$f":"E192+E193*'2 Indicators'!C244+E194*'2 Indicators'!C244^2","v":{"v":0.1034,"d":"0.10"}},{"$f":"G192+G193*'2 Indicators'!C244","v":{"v":1.04333,"d":"1.04"}},{"$f":"IF(AND('2 Indicators'!C244>8.1,'2 Indicators'!C244<18),C196,IF('2 Indicators'!C244>=18,D196,B196))","v":{"v":0.1,"d":"0.10"}},{"$nulls":4},{"$f":"J192+J193*'2 Indicators'!C244+J194*'2 Indicators'!C244^2","v":{"v":0.1,"d":"0.10"}},{"$f":"L192+L193*'2 Indicators'!C244+L194*'2 Indicators'!C244^2","v":{"v":0.1076,"d":"0.11"}},{"$f":"N192+N193*'2 Indicators'!C244","v":{"v":1.0333,"d":"1.03"}},{"$f":"IF(AND('2 Indicators'!C244>4.1,'2 Indicators'!C244<9),K196,IF('2 Indicators'!C244>=9,L196,J196))","v":{"v":0.1,"d":"0.10"}}]
[null,{"$f":"IF(AND('2 Indicators'!E242=\"Sandy\"),IF('2 Indicators'!C244<0,0,IF(Formulas!F195>1,1,Formulas!F195)),0)","v":{"v":0,"d":"0.00"}},{"$f":"IF(AND('2 Indicators'!E242=\"Loam\"),IF('2 Indicators'!C244<0,0,IF(Formulas!M195>1,1,Formulas!M195)),0)","v":{"v":0,"d":"0.00"}},{"$f":"IF(AND('2 Indicators'!E242=\"Clay\"),IF('2 Indicators'!C244<0,0,IF(Formulas!E196>1,1,Formulas!E196)),0)","v":{"v":0,"d":"0.00"}},{"$f":"IF(AND('2 Indicators'!E242=\"Heavy clay\"),IF('2 Indicators'!C244<0,0,IF(Formulas!M196>1,1,Formulas!M196)),0)","v":{"v":0,"d":"0.00"}},{"$f":"(B197+C197+D197+E197)","v":{"v":0,"d":"0.00"}}]
[]
[null,"Ca - Weighting factor",null,null,"Ca - Formulas"]
[null,"Classification"," Weighting factor",null,"F1 = Yo + ax + bx2 ",null,null,"F2 = Yo + ax + bx2 ",null,"F3 = Yo + ax "]
[null,{"v":0,"d":"0.00"},{"v":0.1,"d":"0.10"},null,"Yo",{"v":0.1,"d":"0.10"},null,"Yo",{"v":0.3213,"d":"0.32"},"Yo",{"v":1.075,"d":"1.08"}]
[null,0.41,0.25,null,"a",{"v":0.3839,"d":"0.38"},null,"a",{"v":0.1381,"d":"0.14"},"a",{"v":-0.0188,"d":"-0.02"}]
[null,1.21,{"v":0.5,"d":"0.50"},null,"b",{"v":-0.0441,"d":"-0.04"},null,"b",{"v":0.0079,"d":"0.01"}]
[null,2.41,{"v":0.7,"d":"0.70"}]
[null,{"v":4,"d":"4.00"},{"v":1,"d":"1.00"},null,null,{"$f":"F201+F202*'2 Indicators'!C245+F203*'2 Indicators'!C245^2","v":{"v":0.1,"d":"0.10"}},{"$f":"I201+I202*'2 Indicators'!C245+I203*'2 Indicators'!C245^2","v":{"v":0.3213,"d":"0.32"}},{"$f":"K201+K202*'2 Indicators'!C245","v":{"v":1.075,"d":"1.08"}},{"$f":"IF(AND('2 Indicators'!C245>1.21,'2 Indicators'!C245<4),G205,IF('2 Indicators'!C245>=4,H205,F205))","v":{"v":0.1,"d":"0.10"}}]
[null,{"v":20,"d":"20.00"},{"v":0.7,"d":"0.70"}]
[]
[]
[null,"Mg -  Weighting factor",null,null,"Mg - Formulas"]
[null,"Classification"," Weighting factor",null,"F1 = Yo + ax + bx2 ",null,null,"F2 = Yo + ax + bx2 ",null,"F3 = Yo + ax "]
[null,{"v":0,"d":"0.00"},{"v":0.1,"d":"0.10"},null,"Yo",{"v":0.1,"d":"0.10"},null,"Yo",{"v":0.3213,"d":"0.32"},"Yo",{"v":1.075,"d":"1.08"}]
[null,0.16,0.25,null,"a",{"v":0.9737,"d":"0.97"},null,"a",{"v":0.3601,"d":"0.36"},"a",-0.05]
[null,0.46,{"v":0.5,"d":"0.50"},null,"b",{"v":-0.2264,"d":"-0.23"},null,"b",{"v":0.0616,"d":"0.06"}]
[null,0.91,{"v":0.7,"d":"0.70"},null,null,{"$f":"F211+F212*'2 Indicators'!C246+F213*'2 Indicators'!C246^2","v":{"v":0.1,"d":"0.10"}},{"$f":"I211+I212*'2 Indicators'!C246+I213*'2 Indicators'!C246^2","v":{"v":0.3213,"d":"0.32"}},{"$f":"K211+K212*'2 Indicators'!C246","v":{"v":1.075,"d":"1.08"}},{"$f":"IF(AND('2 Indicators'!C246>0.46,'2 Indicators'!C246<1.5),G214,IF('2 Indicators'!C246>=1.5,H214,F214))","v":{"v":0.1,"d":"0.10"}}]
[null,{"v":1.5,"d":"1.50"},{"v":1,"d":"1.00"}]
[null,{"v":7.5,"d":"7.50"},{"v":0.7,"d":"0.70"}]
[]
[null,"K - Weighting factor",null,null,"K - Formulas"]
[null,"Classification"," Weighting factor",null,"F1 = Yo + ax + bx2 ",null,null,"F2 = Yo + ax + bx2 ",null,"F3 = Yo + ax "]
[null,{"v":0,"d":"0.00"},{"v":0.1,"d":"0.10"},null,"Yo",{"v":0.1,"d":"0.10"},null,"Yo",{"v":0.2066,"d":"0.21"},"Yo",{"v":1.075,"d":"1.08"}]
[null,{"v":16,"d":"16.00"},0.25,null,"a",{"v":0.0091,"d":"0.01"},null,"a",{"v":0.0074,"d":"0.01"},"a",{"v":-6.2E-4,"d":"-0.00"}]
[null,{"v":41,"d":"41.00"},{"v":0.5,"d":"0.50"},null,"b",{"v":1.5244E-5,"d":"0.00"},null,"b",{"v":-6.8888E-6,"d":"-0.00"}]
[null,{"v":71,"d":"71.00"},{"v":0.7,"d":"0.70"},null,null,{"$f":"F220+F221*'2 Indicators'!C247+F222*'2 Indicators'!C247^2","v":{"v":0.1,"d":"0.10"}},{"$f":"I220+I221*'2 Indicators'!C247+I222*'2 Indicators'!C247^2","v":{"v":0.2066,"d":"0.21"}},{"$f":"K220+K221*'2 Indicators'!C247","v":{"v":1.075,"d":"1.08"}},{"$f":"IF(AND('2 Indicators'!C247>41,'2 Indicators'!C247<120),G223,IF('2 Indicators'!C247>=120,H223,F223))","v":{"v":0.1,"d":"0.10"}}]
[null,{"v":120,"d":"120.00"},{"v":1,"d":"1.00"}]
[null,{"v":600,"d":"600.00"},{"v":0.7,"d":"0.70"}]
[]
[null,"pH - Weighting factor",null,null,"pH - Formulas"]
[null,"Classification"," Weighting factor",null,"F1 = Yo + ax + bx2 ",null,null,"F2 = Yo + ax + bx2 "]
[null,{"v":5.1,"d":"5.10"},{"v":0.3,"d":"0.30"},null,"Yo",{"v":-19.1,"d":"-19.10"},null,"Yo",{"v":-42.5,"d":"-42.50"}]
[null,{"v":5.2,"d":"5.20"},{"v":0.4,"d":"0.40"},null,"a",6.35,null,"a",14.75]
[null,{"v":5.5,"d":"5.50"},{"v":0.7,"d":"0.70"},null,"b",{"v":-0.5,"d":"-0.50"},null,"b",-1.25]
[null,{"v":6,"d":"6.00"},{"v":1,"d":"1.00"},null,{"$f":"-4.8+(1*'2 Indicators'!C248)","v":{"v":-4.8,"d":"-4.80"}},{"$f":"F229+F230*'2 Indicators'!C248+F231*'2 Indicators'!C248^2","v":{"v":-19.1,"d":"-19.10"}},{"$f":"I229+I230*'2 Indicators'!C248+I231*'2 Indicators'!C248^2","v":{"v":-42.5,"d":"-42.50"}},{"$f":"IF('2 Indicators'!C248>=6.6,I232,IF(AND('2 Indicators'!C248>=6,'2 Indicators'!C248<6.6),G232,IF(AND('2 Indicators'!C248>5.2,'2 Indicators'!C248<6),F232,E232)))","v":{"v":-4.8,"d":"-4.80"}}]
[null,{"v":6.4,"d":"6.40"},{"v":0.7,"d":"0.70"}]
[]
[null,"Al - Weighting factor",null,null,"Al - Formulas"]
[null,"Classification"," Weighting factor",null,"F1 = Yo + ax + bx2 ",null,null,"F2 = Yo + ax + bx2 "]
[null,{"v":0,"d":"0.00"},{"v":0.7,"d":"0.70"},null,"Yo",{"v":0.7,"d":"0.70"},null,"Yo",{"v":0.8406,"d":"0.84"}]
[null,0.21,{"v":0.6,"d":"0.60"},null,"a",{"v":-0.535,"d":"-0.54"},null,"a",{"v":-0.7525,"d":"-0.75"}]
[null,0.51,{"v":0.5,"d":"0.50"},null,"b",{"v":0.2801,"d":"0.28"},null,"b",{"v":0.1661,"d":"0.17"}]
[null,1.01,0.25,null,null,{"$f":"F237+F238*'2 Indicators'!C249+F239*'2 Indicators'!C249^2","v":{"v":0.7,"d":"0.70"}},{"$f":"I237+I238*'2 Indicators'!C249+I239*'2 Indicators'!C249^2","v":{"v":0.8406,"d":"0.84"}},{"$f":"IF('2 Indicators'!C249>=0.51,G240,F240)","v":{"v":0.7,"d":"0.70"}}]
[null,{"v":2,"d":"2.00"},{"v":0,"d":"0.00"}]
[]
[null,"CEC - Weighting factor",null,null,"CEC - Formulas"]
[null,"Classification"," Weighting factor",null,"F1 = Yo + ax"]
[null,{"v":0,"d":"0.00"},{"v":0.1,"d":"0.10"},null,"Yo",0.1654]
[null,{"v":1.6,"d":"1.60"},0.25,null,"a",{"v":0.0584,"d":"0.06"}]
[null,{"v":4.3,"d":"4.30"},{"v":0.5,"d":"0.50"}]
[null,{"v":8.6,"d":"8.60"},{"v":0.7,"d":"0.70"},null,null,{"$f":"F245+F246*'2 Indicators'!C250","v":{"v":0.1654,"d":"0.17"}},{"$f":"IF(F248>1,1,F248)","v":{"v":0.1654,"d":"0.17"}},{"$f":"G248","v":{"v":0.1654,"d":"0.17"}}]
[null,{"v":15,"d":"15.00"},{"v":1,"d":"1.00"}]
[]
[null,"V - Weighting factor",null,null,"V - Formulas"]
[null,"Classification"," Weighting factor",null,"Fórmula1 = Yo + ax ",null,"Fórmula2 = Yo + ax+bx2 "]
[null,{"v":0,"d":"0.00"},{"v":0.1,"d":"0.10"},null,"Yo",{"v":0.3,"d":"0.30"},null,"Yo",{"v":0.1,"d":"0.10"}]
[null,{"v":15,"d":"15.00"},0.25,null,"a",{"v":0.0067,"d":"0.01"},null,"a",{"v":0.0067,"d":"0.01"}]
[null,{"v":30,"d":"30.00"},{"v":0.5,"d":"0.50"},{"$nulls":4},"b",{"v":0.0002,"d":"0.00"}]
[null,{"v":60,"d":"60.00"},{"v":0.7,"d":"0.70"},null,null,{"$f":"F253+F254*'2 Indicators'!C251","v":{"v":0.3,"d":"0.30"}},{"$f":"I253+I254*'2 Indicators'!C251+I255*'2 Indicators'!C251^2","v":{"v":0.1,"d":"0.10"}},{"$f":"IF('2 Indicators'!C251<30,G256,F256)","v":{"v":0.1,"d":"0.10"}}]
[null,{"v":80,"d":"80.00"},{"v":1,"d":"1.00"}]
[]
[null,"UNITS CONVERSION"]
[null,null,"From ","To",null,null,"From ","To",null,"From ","To"]
[null,null,"Unit ","Unit ","Conversion factor",null,"%; dag/kg","g/dm3; g/kg; g/L",null,"g/dm3; g/kg; g/L","%; dag/kg"]
[null,"Clay content","%; dag/kg","g/dm3; g/kg; g/L",10,null,null,{"$f":"G262*10","v":0},null,null,{"$f":"J262/10","v":0}]
[null,"SOM","%; dag/kg","g/dm3; g/kg; g/L",10,null,null,{"$f":"G263*10","v":0},null,null,{"$f":"J263/10","v":0}]
[null,null,"From ","To"]
[null,null,"Unit ","Unit ","Conversion factor"]
[null,"Available P","mg/dm3; mg/kg; mg/L","ppm",1]
[null,"Exchangeable K","mg/dm3; mg/kg; mg/L","ppm",1]
[null,null,"From ","To",null,null,"From ","To",null,"From ","To"]
[null,null,"Unit ","Unit ","Conversion factor",null,"cmolc/dm3","mmolc/dm3",null,"mmolc/dm3","cmolc/dm3"]
[null,"Exchangeable Ca","cmolc/dm3; meq/100 cm3; meq/ 100ml; meq/ 100g","mmolc/dm3; mmolc/kg",10,null,null,{"$f":"G270*10","v":0},null,null,{"$f":"J270/10","v":0}]
[null,"Exchangeable Mg","cmolc/dm3. meq/100 cm3; meq/ 100ml; meq/ 100g","mmolc/dm3; mmolc/kg",10,null,null,{"$f":"G271*10","v":0},null,null,{"$f":"J271/10","v":0}]
[null,"Exchangeable Al","cmolc/dm3. meq/100 cm3; meq/ 100ml; meq/ 100g","mmolc/dm3; mmolc/kg",10,null,null,{"$f":"G272*10","v":0},null,null,{"$f":"J272/10","v":0}]
[null,"CEC","cmolc/dm3. meq/100 cm3; meq/ 100ml; meq/ 100g","mmolc/dm3; mmolc/kg",10,null,null,{"$f":"G273*10","v":0},null,null,{"$f":"J273/10","v":0}]
[null,null,"From ","To"]
[null,null,"Unit ","Unit ","Conversion factor"]
[null,"Macronutrients","%","g/kg",10]
[null,"Micronutrients","ppm","mg/kg",1]
[null,"P ","P2O5","P",0.437]
[null,"K ","K2O","K",{"v":0.83,"d":"0.830"}]
[null,"Ca ","CaO","Ca",0.715]
[null,"Mg","MgO","Mg",0.602]
[]
[{"$nulls":10},"Units VII",null,"Units VIII"]
[11,"Weighting matrix",null,null,"Formulas",null,"< 5%","5% - 10%","> 10%",null,"Initial",null,"Reduction"]
[null,"item 11.1","Weighting",{"$nulls":3},{"$f":"IF(E293>0,1,\" \")","v":" "},{"$f":"IF(G293>0,1,\" \")","v":" "},{"$f":"IF(I293>0,1,\" \")","v":" "},null,"Intermediary",null,"Unchanged"]
[null,"< 5%",0.55,{"$nulls":3},{"$f":"IF(E291>0,1,\" \")","v":" "},{"$f":"IF(G291>0,1,\" \")","v":" "},{"$f":"IF(I291>0,1,\" \")","v":" "},null,"Advanced",null,"Intensification"]
[null,"5 - 10%",0.45,{"$nulls":3},{"$f":"IF(E289>0,1,\" \")","v":" "},{"$f":"IF(G289>0,1,\" \")","v":" "},{"$f":"IF(I289>0,1,\" \")","v":" "}]
[null,"> 10%",0.35,null,{"$f":"IF('2 Indicators'!$F$270<0.05,'2 Indicators'!$E$270,0)","v":0},null,{"$f":"IF('2 Indicators'!$F$270>=0.05,'2 Indicators'!$E$270,0)","v":0},null,{"$f":"IF('2 Indicators'!$F$270>0.1,'2 Indicators'!$E$270,0)","v":0}]
[null,"item 11.1","Weighting",null,{"$f":"IF('2 Indicators'!D270=Formulas!K284,Formulas!E288,0)","v":0},null,{"$f":"IF(I288>0.001,0,IF('2 Indicators'!D270=Formulas!K284,Formulas!G288,0))","v":0},null,{"$f":"IF('2 Indicators'!D270=Formulas!K284,Formulas!I288,0)","v":0}]
[null,"Advanced",{"v":0.5,"d":"0.50"},null,{"$f":"IF('2 Indicators'!$F$270<0.05,'2 Indicators'!$E$270,0)","v":0},null,{"$f":"IF('2 Indicators'!$F$270>=0.05,'2 Indicators'!$E$270,0)","v":0},null,{"$f":"IF('2 Indicators'!$F$270>0.1,'2 Indicators'!$E$270,0)","v":0}]
[null,"Intermediary",{"v":0.8,"d":"0.80"},null,{"$f":"IF('2 Indicators'!D270=Formulas!K285,Formulas!E290,0)","v":0},null,{"$f":"IF(I290>0.001,0,IF('2 Indicators'!D270=Formulas!K285,Formulas!G290,0))","v":0},null,{"$f":"IF('2 Indicators'!D270=Formulas!K285,Formulas!I290,0)","v":0},null,{"$f":"+C286","v":0.55}]
[null,"Initial",1,null,{"$f":"IF('2 Indicators'!$F$270<0.05,'2 Indicators'!$E$270,0)","v":0},null,{"$f":"IF('2 Indicators'!$F$270>=0.05,'2 Indicators'!$E$270,0)","v":0},null,{"$f":"IF('2 Indicators'!$F$270>0.1,'2 Indicators'!$E$270,0)","v":0},null,{"$f":"+C287","v":0.45}]
[null,"item 11.2","Weighting",null,{"$f":"IF('2 Indicators'!D270=Formulas!K286,Formulas!E292,0)","v":0},null,{"$f":"IF(I292>0.001,0,IF('2 Indicators'!D270=Formulas!K286,Formulas!G292,0))","v":0},null,{"$f":"IF('2 Indicators'!D270=Formulas!K286,Formulas!I292,0)","v":0},null,{"$f":"+C288","v":0.35}]
[null,"Reduction",1.2,null,{"$f":"IF(E296>0,E296,0)+IF(F296>0,F296,0)+IF(G296>0,G296,0)","v":{"v":0,"d":"0.00"}}]
[null,"Unchanged",{"v":1,"d":"1.0"},null,{"$f":"IF('2 Indicators'!D273=M284,1,0)","v":{"v":0,"d":"0.00"}},{"$f":"IF('2 Indicators'!D273=M285,1,0)","v":{"v":0,"d":"0.00"}},{"$f":"IF('2 Indicators'!D273=M286,1,0)","v":{"v":0,"d":"0.00"}}]
[null,"Intensification",0.8,null,{"$f":"IF(E289>0,'2 Indicators'!G270*Formulas!K291,0)+IF(E291>0,'2 Indicators'!G271*Formulas!K291,0)+IF(E293>0,'2 Indicators'!G272*Formulas!K291,0)","v":0},{"$f":"IF(G289>0,'2 Indicators'!G270*Formulas!K292,0)+IF(G291>0,'2 Indicators'!G271*Formulas!K292,0)+IF(G293>0,'2 Indicators'!G272*Formulas!K292,0)","v":0},{"$f":"IF(I289>0,'2 Indicators'!G270*Formulas!K293,0)+IF(I291>0,'2 Indicators'!G271*Formulas!K293,0)+IF(I293>0,'2 Indicators'!G272*Formulas!K293,0)","v":0}]
[{"$nulls":4},"Formula - verifies the proportion of the degraded area in relation to the total area and the degree of intensity of the phenomenon. After calculation, multiply the final value by factor 1.2, if there is a tendency to reduce the degradation stage or by factor 0.8, if the tendency is to intensify the degradation stage."]
[]
[]
[]
[null,"Weighting factor",null,null,"Fórmulas"]
[null,{"$f":"+'2 Indicators'!C278","v":"Transverse slope of roads\t"},{"v":1,"d":"1.0"},null,{"$f":"IF(F302>1,1,F302)","v":{"v":0,"d":"0.00"}},{"$f":"IF(G302>0,H302/G302,H302)","v":{"v":0,"d":"0.00"}},{"$f":"COUNTIF('2 Indicators'!E278:E283,\">=0\")","v":0},{"$f":"('2 Indicators'!E278*0.8+'2 Indicators'!E279*0.8+'2 Indicators'!E280*0.8+K302+K304)","v":{"v":0,"d":"0.00"}},{"$f":"IF(E302>0,I303,E303*1.1)","v":{"v":0,"d":"0.00"}},{"$f":"IF(I302>1,1,I302)","v":{"v":0,"d":"0.00"}},{"$f":"IF('2 Indicators'!E282=\"\",0,1-'2 Indicators'!E282)","v":{"v":0,"d":"0%"}},{"$f":"IF(ISBLANK('2 Indicators'!H278),Formulas!$M$302,\"\")","v":"Not applicable"},"Not applicable"]
[null,{"$f":"+'2 Indicators'!C279","v":"Water run off adequacy - bumps/grooves\t"},{"v":1,"d":"1.0"},null,{"$f":"IF(F303>1,1,F303)","v":{"v":0,"d":"0.00"}},{"$f":"IF(G303>0,H303/G303,H303)","v":{"v":0,"d":"0.00"}},{"$f":"COUNTIF('2 Indicators'!F281:F283,\">=0\")","v":2},{"$f":"'2 Indicators'!H278*0.8+'2 Indicators'!H279*0.8+'2 Indicators'!H280*0.8+K303+K305","v":{"v":0,"d":"0.00"}},{"$f":"IF(E303=0,E302,((2*E302+E303)/3))","v":{"v":0,"d":"0.00"}},{"$f":"IF(OR('2 Indicators'!E285=\"Yes\",'2 Indicators'!H285=\"x\"),Formulas!J302*0.7,Formulas!J302)","v":{"v":0,"d":"0.00"}},{"$f":"IF('2 Indicators'!H282=\"\",0,1-'2 Indicators'!H282)","v":{"v":0,"d":"0%"}},{"$f":"IF(ISBLANK('2 Indicators'!H279),Formulas!$M$302,\"\")","v":"Not applicable"}]
[null,{"$f":"+'2 Indicators'!C280","v":"Water run off adequacy - infiltration structures"},{"v":1,"d":"1.0"},{"$nulls":7},{"$f":"IF('2 Indicators'!E283=\"\",0,1-'2 Indicators'!E283)","v":{"v":0,"d":"0%"}},{"$f":"IF(ISBLANK('2 Indicators'!H280),Formulas!$M$302,\"\")","v":"Not applicable"}]
[null,{"$f":"+'2 Indicators'!C282","v":"Potholes on roads\t"},{"v":1,"d":"1.0"},{"$nulls":7},{"$f":"IF('2 Indicators'!H283=\"\",0,1-'2 Indicators'!H283)","v":{"v":0,"d":"0%"}},{"$f":"IF(ISBLANK('2 Indicators'!H285),Formulas!$M$302,\"\")","v":"Not applicable"}]
[null,{"$f":"+'2 Indicators'!C283","v":"Erosion grooves on roads\t"},{"v":1,"d":"1.0"}]
[]
[{"$nulls":11},"Units IX"]
[12,"Formulas",{"$nulls":4},"pH ",{"$nulls":4},"Native vegetation"]
[null,"Classification","Weighting ","",null,null," Res. CONAMA 357/05",null,"Portaria 518/04 M.S.*",null,null,"Pasture; agriculture; reforestation"]
[null,"6 - 9.0",0.7,{"$nulls":3},"Between 6 and 9 for all classes",null,"Between 6 and 9.5 in the distribution for human consumption",null,null,"Residential"]
[null,"pH < 6 and > 9.0",0.3,{"$nulls":8},"Absent"]
[{"$nulls":11},"Changes of domestic origin (sewage, garbage)"]
[null,{"$f":"IF(('2 Indicators'!D313>=6)*OR('2 Indicators'!D313<=9),0.7,0.3)","v":{"v":0.3,"d":"0.30"}},{"$f":"IF(('2 Indicators'!D314>=6)*OR('2 Indicators'!D314<=9),0.7,0.3)","v":{"v":0.3,"d":"0.30"}},{"$nulls":5},"*Ministry of Health",null,null,"Industrial or Urban "]
[{"$nulls":11},"Partial"]
[{"$nulls":11},"Total"]
[{"$nulls":11},"Absent"]
[null,"Formulas",{"$nulls":4},"Thermotolerant Coliform",{"$nulls":4},"Absent"]
[null,"Classification","Weighting ",{"$nulls":3}," CONAMA 357/05",null,"518/04 M.S.*",null,null,"Moderate"]
[null,"UFC < 1.000",0.7,{"$nulls":3},"Maximum value - 1,000 fecal coliforms per 100 milliliters in 80% or more of at least 06 samples",null,"For human supply - absence in 100 mL sample (VMP)",null,null,"Accentuated"]
[null,"UFC > 1.000",0.1,{"$nulls":8},"Transparent"]
[{"$nulls":11},"Strong tea color"]
[null,{"$f":"IF(('2 Indicators'!D315<=999),0.7,0.1)","v":{"v":0.7,"d":"0.70"}},{"$f":"IF(('2 Indicators'!D316<=999),0.7,0.1)","v":{"v":0.7,"d":"0.70"}},{"$nulls":8},"Opaque"]
[{"$nulls":11},"None"]
[{"$nulls":8},"*Ministry of Health",null,null,"Sewage"]
[{"$nulls":11},"Oil / Industrial"]
[null,"Formulas",{"$nulls":4},"Turbidity ",{"$nulls":4},"Stones, gravel"]
[null,"Classification",null,"Weighting ",null,null," CONAMA 357/05",null,"518/04 M.S.*",null,null,"Mud/sand"]
[null,"< 100 UNT",null,0.7,null,null,"Lentic environment up to 100 UNT for class 2",null,"Turbidity - 5 UNT in distribution for human consumption",null,null,"Cement / channeled"]
[null,"> 100 UNT",null,0.1]
[]
[null,{"$f":"IF(('2 Indicators'!D319<=100),0.7,0.1)","v":{"v":0.7,"d":"0.70"}},{"$f":"IF(('2 Indicators'!D320<=100),0.7,0.1)","v":{"v":0.7,"d":"0.70"}}]
[{"$nulls":8},"*Ministry of Health"]
[]
[null,"Formulas",{"$nulls":4},"Total Nitrate"]
[null,"Classification",null,"Weighting ",null,null," CONAMA 357/05",null,"518/04 M.S.*"]
[null,"< 10 mg/L N",null,0.7,null,null,"Maximum value 10 mg/L N",null,"Maximum NO3- for Class2: 44.3 mg/L"]
[null,"> 10 mg/L N ",null,0.1]
[]
[null,{"$f":"IF(('2 Indicators'!D317<=9.99),0.7,0.1)","v":{"v":0.7,"d":"0.70"}},{"$f":"IF(('2 Indicators'!D318<=9.99),0.7,0.1)","v":{"v":0.7,"d":"0.70"}},{"$nulls":5},"*Ministry of Health"]
[]
[null,"Formulas"]
[null,"Fields marked upstream and downstream multiplied by the weight of the columns (left weight 4, middle weight 2 and right 0) and multiplied by the weighting factors of each item. The total values were transformed in the range of 0 to 100"]
[{"$nulls":9},{"$f":"IF('2 Indicators'!F313=\"\",0,'2 Indicators'!F313*'2 Indicators'!G323)+IF('2 Indicators'!F319=\"\",0,'2 Indicators'!F319*'2 Indicators'!G319)+IF('2 Indicators'!F315=\"\",0,'2 Indicators'!F315*'2 Indicators'!G315)+IF('2 Indicators'!F317=\"\",0,'2 Indicators'!F317*'2 Indicators'!G317)+IF('2 Indicators'!D322=\"\",0,'2 Indicators'!D322*'2 Indicators'!G322)","v":{"v":0,"d":"0.00"}},{"$f":"IF('2 Indicators'!F313=\"\",0,'2 Indicators'!G323)+IF('2 Indicators'!F319=\"\",0,'2 Indicators'!G319)+IF('2 Indicators'!F315=\"\",0,'2 Indicators'!G315)+IF('2 Indicators'!F317=\"\",0,'2 Indicators'!G317)+IF('2 Indicators'!D322=\"\",0,'2 Indicators'!G322)","v":4},{"$f":"+Formulas!J344/K344","v":{"v":0,"d":"0.00"}}]
[{"$nulls":9},{"$f":"IF('2 Indicators'!F314=\"\",0,'2 Indicators'!F314*'2 Indicators'!G323)+IF('2 Indicators'!F320=\"\",0,'2 Indicators'!F320*'2 Indicators'!G319)+IF('2 Indicators'!F316=\"\",0,'2 Indicators'!F316*'2 Indicators'!G315)+IF('2 Indicators'!F318=\"\",0,'2 Indicators'!F318*'2 Indicators'!G317)+IF('2 Indicators'!D323=\"\",0,'2 Indicators'!D323*'2 Indicators'!G322)","v":{"v":0,"d":"0.00"}},{"$f":"IF('2 Indicators'!F314=\"\",0,'2 Indicators'!G323)+IF('2 Indicators'!F320=\"\",0,'2 Indicators'!G319)+IF('2 Indicators'!F316=\"\",0,'2 Indicators'!G315)+IF('2 Indicators'!F318=\"\",0,'2 Indicators'!G317)+IF('2 Indicators'!D323=\"\",0,'2 Indicators'!G322)","v":4},{"$f":"+Formulas!J345/K345","v":{"v":0,"d":"0.00"}}]
[]
[]
[null,"Formula partial result"]
[null,"Average of the results of the parameters of item 12.1 considering the weighting factors in each item"]
[{"$nulls":5},{"$f":"IF('2 Indicators'!D325<'2 Indicators'!D326,'2 Indicators'!D325,'2 Indicators'!D326)","v":{"v":0,"d":"0.00"}}]
[]
[null,"Formulas",null,null,"pH "]
[null,"Classification","Weighting ",null," 518/04 M.S.*"]
[null,"6 - 9.5",0.7,null,"Between 6 and 9.5 in the distribution for human consumption"]
[null,"pH < 6 and > 9.5",0.3,null,"*Ministry of Health"]
[null,{"$f":"IF(('2 Indicators'!D331>=6)*OR('2 Indicators'!D331<=9.5),0.7,0.3)","v":{"v":0.3,"d":"0.30"}}]
[]
[]
[null,"Formulas",null,null,"Thermotolerant Coliform"]
[null,"Classification","Weighting ",null,"CONAMA 396/08",null,"518/04 M.S.*"]
[null,"absent",0.7,null,"For human supply - absence in 100 mL sample (VMP); For animal feedstock 200/100 ml",null,"For human supply - absence in 100 mL sample (VMP)"]
[null,">0",0.1]
[null,{"$f":"IF('2 Indicators'!D332=0,0.701,0.1)","v":{"v":0.701,"d":"0.70"}}]
[]
[{"$nulls":4},"*Ministry of Health"]
[null,"Formulas",null,null,"Total Nitrate"]
[null,"Classification","Weighting ",null,"CONAMA 396/08",null,"518/04 M.S.*"]
[null,"<= 10",0.7,null,"According to this resolution, the maximum permitted value (VMP) for human consumption is 10 mg. L-1 of N)",null,"Maximum permitted value 10 mg L-1 of N"]
[null,"> 10",0.1]
[null,{"$f":"IF('2 Indicators'!D333<=10,0.701,0.1)","v":{"v":0.701,"d":"0.70"}}]
[]
[]
[{"$nulls":4},"*Ministry of Health"]
[null,"Formula partial result\t\t",{"$nulls":3},"Formula final result"]
[null,"Average of the results of the parameters of item 12.2 and average of the results of the parameters of item 12.3",{"$nulls":3},"Formula = ((partial result of surface water quality x 2) + surface result of groundwater quality) / 3"]
[]
[]
[13,"Weighting"]
[null,"Classification1","Weighting2"]
[null,"don't use",{"v":1,"d":"1.0"},null,"Land Vulnerability: item 13.1  = 1 a 3 (1); 4 a 9 (2); 12 a 27 (3)"]
[null,"Rc: 1 a 2",{"v":0.6,"d":"0.60"}]
[null,"Rc: 2 e 4",{"v":0.3,"d":"0.30"}]
[null,"Rc: 6 e 9",{"v":0.1,"d":"0.10"}]
[]
[null,"Formulas"]
[null,null,{"$f":"'2 Indicators'!D341","v":{"v":0,"d":"0.00"}},{"$f":"'2 Indicators'!E341","v":{"v":0,"d":"0.00"}},{"$f":"'2 Indicators'!F341","v":{"v":0,"d":"0.00"}},null,null,{"$f":"Formulas!D411","v":{"v":0,"d":"0.00"}},{"$f":"Formulas!E411","v":{"v":0,"d":"0.00"}},{"$f":"Formulas!F411","v":{"v":0,"d":"0.00"}},{"$f":"Formulas!G411","v":{"v":0,"d":"0.00"}},{"$f":"Formulas!H411","v":{"v":0,"d":"0.00"}},{"$f":"Formulas!I411","v":{"v":0,"d":"0.00"}},{"$f":"Formulas!J411","v":{"v":0,"d":"0.00"}}]
[null,"Pci",{"$f":"IF('2 Indicators'!D351>0.001,((1/LOG10('2 Indicators'!D351))*(LOG10('2 Indicators'!D352))*'2 Indicators'!D350),\" \")","v":{"$error":"#VALUE!"}},{"$f":"IF('2 Indicators'!E351>0.001,((1/LOG10('2 Indicators'!E351))*(LOG10('2 Indicators'!E352))*'2 Indicators'!E350),\" \")","v":{"$error":"#VALUE!"}},{"$f":"IF('2 Indicators'!F351>0.001,((1/LOG10('2 Indicators'!F351))*(LOG10('2 Indicators'!F352))*'2 Indicators'!F350),\" \")","v":{"$error":"#VALUE!"}},null,null,{"$f":"IF(Formulas!D422>0.001,((1/LOG10(Formulas!D422))*(LOG10(Formulas!D423))*Formulas!D421),\" \")","v":{"$error":"#VALUE!"}},{"$f":"IF(Formulas!E422>0.001,((1/LOG10(Formulas!E422))*(LOG10(Formulas!E423))*Formulas!E421),\" \")","v":{"$error":"#VALUE!"}},{"$f":"IF(Formulas!F422>0.001,((1/LOG10(Formulas!F422))*(LOG10(Formulas!F423))*Formulas!F421),\" \")","v":{"$error":"#VALUE!"}},{"$f":"IF(Formulas!G422>0.001,((1/LOG10(Formulas!G422))*(LOG10(Formulas!G423))*Formulas!G421),\" \")","v":{"$error":"#VALUE!"}},{"$f":"IF(Formulas!H422>0.001,((1/LOG10(Formulas!H422))*(LOG10(Formulas!H423))*Formulas!H421),\" \")","v":{"$error":"#VALUE!"}},{"$f":"IF(Formulas!I422>0.001,((1/LOG10(Formulas!I422))*(LOG10(Formulas!I423))*Formulas!I421),\" \")","v":{"$error":"#VALUE!"}},{"$f":"IF(Formulas!J422>0.001,((1/LOG10(Formulas!J422))*(LOG10(Formulas!J423))*Formulas!J421),\" \")","v":{"$error":"#VALUE!"}}]
[null,"Vulnerability",{"$f":"IF('2 Indicators'!D361>0.001,('2 Indicators'!D361*'2 Indicators'!D362*'2 Indicators'!D363),0)","v":{"v":0,"d":"0.00"}},{"$f":"IF('2 Indicators'!E361>0.001,('2 Indicators'!E361*'2 Indicators'!E362*'2 Indicators'!E363),0)","v":{"v":0,"d":"0.00"}},{"$f":"IF('2 Indicators'!F361>0.001,('2 Indicators'!F361*'2 Indicators'!F362*'2 Indicators'!F363),0)","v":{"v":0,"d":"0.00"}},null,null,{"$f":"IF(Formulas!D432>0.001,(Formulas!D432*Formulas!D433*Formulas!D434),0)","v":{"v":0,"d":"0.00"}},{"$f":"IF(Formulas!E432>0.001,(Formulas!E432*Formulas!E433*Formulas!E434),0)","v":{"v":0,"d":"0.00"}},{"$f":"IF(Formulas!F432>0.001,(Formulas!F432*Formulas!F433*Formulas!F434),0)","v":{"v":0,"d":"0.00"}},{"$f":"IF(Formulas!G432>0.001,(Formulas!G432*Formulas!G433*Formulas!G434),0)","v":{"v":0,"d":"0.00"}},{"$f":"IF(Formulas!H432>0.001,(Formulas!H432*Formulas!H433*Formulas!H434),0)","v":{"v":0,"d":"0.00"}},{"$f":"IF(Formulas!I432>0.001,(Formulas!I432*Formulas!I433*Formulas!I434),0)","v":{"v":0,"d":"0.00"}},{"$f":"IF(Formulas!J432>0.001,(Formulas!J432*Formulas!J433*Formulas!J434),0)","v":{"v":0,"d":"0.00"}}]
[]
[null,"Risk",{"$f":"IF('2 Indicators'!D364>0.01,('2 Indicators'!D364*'2 Indicators'!D354),\" \")","v":{"$error":"#VALUE!"}},{"$f":"IF('2 Indicators'!E364>0.01,('2 Indicators'!E364*'2 Indicators'!E354),\" \")","v":{"$error":"#VALUE!"}},{"$f":"IF('2 Indicators'!F364>0.01,('2 Indicators'!F364*'2 Indicators'!F354),\" \")","v":{"$error":"#VALUE!"}},null,null,{"$f":"IF(Formulas!D435>0.01,(Formulas!D435*Formulas!D425),\" \")","v":{"$error":"#VALUE!"}},{"$f":"IF(Formulas!E435>0.01,(Formulas!E435*Formulas!E425),\" \")","v":{"$error":"#VALUE!"}},{"$f":"IF(Formulas!F435>0.01,(Formulas!F435*Formulas!F425),\" \")","v":{"$error":"#VALUE!"}},{"$f":"IF(Formulas!G435>0.01,(Formulas!G435*Formulas!G425),\" \")","v":{"$error":"#VALUE!"}},{"$f":"IF(Formulas!H435>0.01,(Formulas!H435*Formulas!H425),\" \")","v":{"$error":"#VALUE!"}},{"$f":"IF(Formulas!I435>0.01,(Formulas!I435*Formulas!I425),\" \")","v":{"$error":"#VALUE!"}},{"$f":"IF(Formulas!J435>0.01,(Formulas!J435*Formulas!J425),\" \")","v":{"$error":"#VALUE!"}}]
[null,{"$f":"IF(C387=B394,C388,IF(D387=B394,D388,IF(E387=B394,E388,IF(F387=B394,F388,IF(G387=B394,G388,IF(H387=B394,H388,IF(I387=B394,I388,IF(J387=B394,J388,IF(K387=B394,K388,IF(L387=B394,L388,IF(M387=B394,M388,IF(N387=B394,N388,IF(Formulas!B399=B394,Formulas!B400,IF(Formulas!C399=B394,Formulas!C400,IF('2 Indicators'!BT345=B394,'2 Indicators'!BT346,IF(Formulas!D399=B394,Formulas!D400,IF(Formulas!E399=B394,Formulas!E400,IF(Formulas!F399=B394,Formulas!F400,IF(Formulas!G399=B394,Formulas!G400,IF(Formulas!H399=B394,Formulas!H400,IF(Formulas!I399=B394,Formulas!I400,IF(Formulas!J399=B394,Formulas!J400,IF(Formulas!K399=B394,Formulas!K400,IF(Formulas!L399=B394,Formulas!L400,IF(Formulas!M399=B394,Formulas!M400,IF(Formulas!N399=B394,Formulas!N400,IF(Formulas!B405=B394,Formulas!B406,IF(Formulas!C405=B394,Formulas!C406,IF(Formulas!D405=B394,Formulas!D406)))))))))))))))))))))))))))))","v":{"$error":"#VALUE!"}}]
[]
[null,"Risk Calculation"]
[null,{"$f":"MAX(C387:N387)","v":{"$error":"#VALUE!"}}]
[null,{"$f":"IF(OR(B394=0.83,B394<0.83),1,IF(OR(AND(0.83<B394,B394<=1.66)),2,IF(B394>1.66,3,\"\")))","v":{"$error":"#VALUE!"}},{"$f":"B391","v":{"$error":"#VALUE!"}}]
[null,{"$f":"B395*C396","v":{"$error":"#VALUE!"}},{"$f":"IF(OR(AND(1<=C395,C395<=3)),1,IF(OR(AND(3<C395,C395<=9)),2,IF(C395>9,3)))","v":{"$error":"#VALUE!"}}]
[]
[null,{"$f":"Formulas!K411","v":{"v":0,"d":"0.00"}},{"$f":"Formulas!L411","v":{"v":0,"d":"0.00"}},{"$f":"Formulas!D440","v":{"v":0,"d":"0.00"}},{"$f":"Formulas!E440","v":{"v":0,"d":"0.00"}},{"$f":"Formulas!F440","v":{"v":0,"d":"0.00"}},{"$f":"Formulas!G440","v":{"v":0,"d":"0.00"}},{"$f":"Formulas!H440","v":{"v":0,"d":"0.00"}},{"$f":"Formulas!I440","v":{"v":0,"d":"0.00"}},{"$f":"Formulas!J440","v":{"v":0,"d":"0.00"}},{"$f":"Formulas!K440","v":{"v":0,"d":"0.00"}},{"$f":"Formulas!L440","v":{"v":0,"d":"0.00"}},{"$f":"Formulas!D468","v":{"v":0,"d":"0.00"}},{"$f":"Formulas!E468","v":{"v":0,"d":"0.00"}}]
[null,{"$f":"IF(Formulas!K422>0.001,((1/LOG10(Formulas!K422))*(LOG10(Formulas!K423))*Formulas!K421),\" \")","v":{"$error":"#VALUE!"}},{"$f":"IF(Formulas!L422>0.001,((1/LOG10(Formulas!L422))*(LOG10(Formulas!L423))*Formulas!L421),\" \")","v":{"$error":"#VALUE!"}},{"$f":"IF(Formulas!D451>0.001,((1/LOG10(Formulas!D451))*(LOG10(Formulas!D452))*Formulas!D450),\" \")","v":{"$error":"#VALUE!"}},{"$f":"IF(Formulas!E451>0.001,((1/LOG10(Formulas!E451))*(LOG10(Formulas!E452))*Formulas!E450),\" \")","v":{"$error":"#VALUE!"}},{"$f":"IF(Formulas!F451>0.001,((1/LOG10(Formulas!F451))*(LOG10(Formulas!F452))*Formulas!F450),\" \")","v":{"$error":"#VALUE!"}},{"$f":"IF(Formulas!G451>0.001,((1/LOG10(Formulas!G451))*(LOG10(Formulas!G452))*Formulas!G450),\" \")","v":{"$error":"#VALUE!"}},{"$f":"IF(Formulas!H451>0.001,((1/LOG10(Formulas!H451))*(LOG10(Formulas!H452))*Formulas!H450),\" \")","v":{"$error":"#VALUE!"}},{"$f":"IF(Formulas!I451>0.001,((1/LOG10(Formulas!I451))*(LOG10(Formulas!I452))*Formulas!I450),\" \")","v":{"$error":"#VALUE!"}},{"$f":"IF(Formulas!J451>0.001,((1/LOG10(Formulas!J451))*(LOG10(Formulas!J452))*Formulas!J450),\" \")","v":{"$error":"#VALUE!"}},{"$f":"IF(Formulas!K451>0.001,((1/LOG10(Formulas!K451))*(LOG10(Formulas!K452))*Formulas!K450),\" \")","v":{"$error":"#VALUE!"}},{"$f":"IF(Formulas!L451>0.001,((1/LOG10(Formulas!L451))*(LOG10(Formulas!L452))*Formulas!L450),\" \")","v":{"$error":"#VALUE!"}},{"$f":"IF(Formulas!D479>0.001,((1/LOG10(Formulas!D479))*(LOG10(Formulas!D480))*Formulas!D478),\" \")","v":{"$error":"#VALUE!"}},{"$f":"IF(Formulas!E479>0.001,((1/LOG10(Formulas!E479))*(LOG10(Formulas!E480))*Formulas!E478),\" \")","v":{"$error":"#VALUE!"}}]
[null,{"$f":"IF(Formulas!K432>0.001,(Formulas!K432*Formulas!K433*Formulas!K434),0)","v":{"v":0,"d":"0.00"}},{"$f":"IF(Formulas!L432>0.001,(Formulas!L432*Formulas!L433*Formulas!L434),0)","v":{"v":0,"d":"0.00"}},{"$f":"IF(Formulas!D461>0.001,(Formulas!D461*Formulas!D462*Formulas!D463),0)","v":{"v":0,"d":"0.00"}},{"$f":"IF(Formulas!E461>0.001,(Formulas!E461*Formulas!E462*Formulas!E463),0)","v":{"v":0,"d":"0.00"}},{"$f":"IF(Formulas!F461>0.001,(Formulas!F461*Formulas!F462*Formulas!F463),0)","v":{"v":0,"d":"0.00"}},{"$f":"IF(Formulas!G461>0.001,(Formulas!G461*Formulas!G462*Formulas!G463),0)","v":{"v":0,"d":"0.00"}},{"$f":"IF(Formulas!H461>0.001,(Formulas!H461*Formulas!H462*Formulas!H463),0)","v":{"v":0,"d":"0.00"}},{"$f":"IF(Formulas!I461>0.001,(Formulas!I461*Formulas!I462*Formulas!I463),0)","v":{"v":0,"d":"0.00"}},{"$f":"IF(Formulas!J461>0.001,(Formulas!J461*Formulas!J462*Formulas!J463),0)","v":{"v":0,"d":"0.00"}},{"$f":"IF(Formulas!K461>0.001,(Formulas!K461*Formulas!K462*Formulas!K463),0)","v":{"v":0,"d":"0.00"}},{"$f":"IF(Formulas!L461>0.001,(Formulas!L461*Formulas!L462*Formulas!L463),0)","v":{"v":0,"d":"0.00"}},{"$f":"IF(Formulas!D489>0.001,(Formulas!D489*Formulas!D490*Formulas!D491),0)","v":{"v":0,"d":"0.00"}},{"$f":"IF(Formulas!E489>0.001,(Formulas!E489*Formulas!E490*Formulas!E491),0)","v":{"v":0,"d":"0.00"}}]
[]
[null,{"$f":"IF(Formulas!K435>0.01,(Formulas!K435*Formulas!K425),\" \")","v":{"$error":"#VALUE!"}},{"$f":"IF(Formulas!L435>0.01,(Formulas!L435*Formulas!L425),\" \")","v":{"$error":"#VALUE!"}},{"$f":"IF(Formulas!D464>0.01,(Formulas!D464*Formulas!D454),\" \")","v":{"$error":"#VALUE!"}},{"$f":"IF(Formulas!E464>0.01,(Formulas!E464*Formulas!E454),\" \")","v":{"$error":"#VALUE!"}},{"$f":"IF(Formulas!F464>0.01,(Formulas!F464*Formulas!F454),\" \")","v":{"$error":"#VALUE!"}},{"$f":"IF(Formulas!G464>0.01,(Formulas!G464*Formulas!G454),\" \")","v":{"$error":"#VALUE!"}},{"$f":"IF(Formulas!H464>0.01,(Formulas!H464*Formulas!H454),\" \")","v":{"$error":"#VALUE!"}},{"$f":"IF(Formulas!I464>0.01,(Formulas!I464*Formulas!I454),\" \")","v":{"$error":"#VALUE!"}},{"$f":"IF(Formulas!J464>0.01,(Formulas!J464*Formulas!J454),\" \")","v":{"$error":"#VALUE!"}},{"$f":"IF(Formulas!K464>0.01,(Formulas!K464*Formulas!K454),\" \")","v":{"$error":"#VALUE!"}},{"$f":"IF(Formulas!L464>0.01,(Formulas!L464*Formulas!L454),\" \")","v":{"$error":"#VALUE!"}},{"$f":"IF(Formulas!D492>0.01,(Formulas!D492*Formulas!D482),\" \")","v":{"$error":"#VALUE!"}},{"$f":"IF(Formulas!E492>0.01,(Formulas!E492*Formulas!E482),\" \")","v":{"$error":"#VALUE!"}}]
[]
[null,{"$f":"Formulas!F468","v":{"v":0,"d":"0.00"}},{"$f":"Formulas!G468","v":{"v":0,"d":"0.00"}},{"$f":"Formulas!H468","v":{"v":0,"d":"0.00"}}]
[null,{"$f":"IF(Formulas!F479>0.001,((1/LOG10(Formulas!F479))*(LOG10(Formulas!F480))*Formulas!F478),\" \")","v":{"$error":"#VALUE!"}},{"$f":"IF(Formulas!G479>0.001,((1/LOG10(Formulas!G479))*(LOG10(Formulas!G480))*Formulas!G478),\" \")","v":{"$error":"#VALUE!"}},{"$f":"IF(Formulas!H479>0.001,((1/LOG10(Formulas!H479))*(LOG10(Formulas!H480))*Formulas!H478),\" \")","v":{"$error":"#VALUE!"}},{"$f":"IF(Formulas!I479>0.001,((1/LOG10(Formulas!I479))*(LOG10(Formulas!I480))*Formulas!I478),\" \")","v":{"$error":"#VALUE!"}}]
[null,{"$f":"IF(Formulas!F489>0.001,(Formulas!F489*Formulas!F490*Formulas!F491),0)","v":{"v":0,"d":"0.00"}},{"$f":"IF(Formulas!G489>0.001,(Formulas!G489*Formulas!G490*Formulas!G491),0)","v":{"v":0,"d":"0.00"}},{"$f":"IF(Formulas!H489>0.001,(Formulas!H489*Formulas!H490*Formulas!H491),0)","v":{"v":0,"d":"0.00"}},{"$f":"IF(Formulas!I489>0.001,(Formulas!I489*Formulas!I490*Formulas!I491),0)","v":{"v":0,"d":"0.00"}}]
[]
[null,{"$f":"IF(Formulas!F492>0.01,(Formulas!F492*Formulas!F482),\" \")","v":{"$error":"#VALUE!"}},{"$f":"IF(Formulas!G492>0.01,(Formulas!G492*Formulas!G482),\" \")","v":{"$error":"#VALUE!"}},{"$f":"IF(Formulas!H492>0.01,(Formulas!H492*Formulas!H482),\" \")","v":{"$error":"#VALUE!"}},{"$f":"IF(Formulas!I492>0.01,(Formulas!I492*Formulas!I482),\" \")","v":{"$error":"#VALUE!"}}]
[]
[]
[null,"Product's active principle (select)\t",{"$nulls":10},1]
[null,"Active ingredient (%)"]
[null,"Land use/crop description",{"$nulls":10},2]
[null,"Area (ha)\t",{"$nulls":10},3]
[null,"Volume applied  L/ha or kg/ha \t"]
[null,"Total volume applied",null,{"$f":"+D415*D414","v":{"v":0,"d":"0.0"}},{"v":0,"d":"0.0"},{"v":0,"d":"0.0"},{"v":0,"d":"0.0"},{"v":0,"d":"0.0"},{"v":0,"d":"0.0"},{"v":0,"d":"0.0"},{"v":0,"d":"0.0"},{"v":0,"d":"0.0"}]
[]
[null,"Product's active principle ",null,{"$f":"IF(D$414>0,(HLOOKUP(D$411,'Data base'!$B$5:$AIN$11,$M418,0)),\"\")","v":""},{"$f":"IF(E$414>0,(HLOOKUP(E$411,'Data base'!$B$5:$AIN$11,$M418,0)),\"\")","v":""},{"$f":"IF(F$414>0,(HLOOKUP(F$411,'Data base'!$B$5:$AIN$11,$M418,0)),\"\")","v":""},{"$f":"IF(G$414>0,(HLOOKUP(G$411,'Data base'!$B$5:$AIN$11,$M418,0)),\"\")","v":""},{"$f":"IF(H$414>0,(HLOOKUP(H$411,'Data base'!$B$5:$AIN$11,$M418,0)),\"\")","v":""},{"$f":"IF(I$414>0,(HLOOKUP(I$411,'Data base'!$B$5:$AIN$11,$M418,0)),\"\")","v":""},{"$f":"IF(J$414>0,(HLOOKUP(J$411,'Data base'!$B$5:$AIN$11,$M418,0)),\"\")","v":""},{"$f":"IF(K$414>0,(HLOOKUP(K$411,'Data base'!$B$5:$AIN$11,$M418,0)),\"\")","v":""},{"$f":"IF(L$414>0,(HLOOKUP(L$411,'Data base'!$B$5:$AIN$11,$M418,0)),\"\")","v":""},2]
[null,"Toxicity to fish - 96h LC50 (mg l-1)",null,{"$f":"IF(D$414>0,(HLOOKUP(D$411,'Data base'!$B$5:$AIN$11,$M419,0)),\"\")","v":""},{"$f":"IF(E$414>0,(HLOOKUP(E$411,'Data base'!$B$5:$AIN$11,$M419,0)),\"\")","v":""},{"$f":"IF(F$414>0,(HLOOKUP(F$411,'Data base'!$B$5:$AIN$11,$M419,0)),\"\")","v":""},{"$f":"IF(G$414>0,(HLOOKUP(G$411,'Data base'!$B$5:$AIN$11,$M419,0)),\"\")","v":""},{"$f":"IF(H$414>0,(HLOOKUP(H$411,'Data base'!$B$5:$AIN$11,$M419,0)),\"\")","v":""},{"$f":"IF(I$414>0,(HLOOKUP(I$411,'Data base'!$B$5:$AIN$11,$M419,0)),\"\")","v":""},{"$f":"IF(J$414>0,(HLOOKUP(J$411,'Data base'!$B$5:$AIN$11,$M419,0)),\"\")","v":""},{"$f":"IF(K$414>0,(HLOOKUP(K$411,'Data base'!$B$5:$AIN$11,$M419,0)),\"\")","v":""},{"$f":"IF(L$414>0,(HLOOKUP(L$411,'Data base'!$B$5:$AIN$11,$M419,0)),\"\")","v":""},3]
[null,"Toxicity - ADI (mg kg-1 day-1)",null,{"$f":"IF(D$414>0,(HLOOKUP(D$411,'Data base'!$B$5:$AIN$11,$M420,0)),\"\")","v":""},{"$f":"IF(E$414>0,(HLOOKUP(E$411,'Data base'!$B$5:$AIN$11,$M420,0)),\"\")","v":""},{"$f":"IF(F$414>0,(HLOOKUP(F$411,'Data base'!$B$5:$AIN$11,$M420,0)),\"\")","v":""},{"$f":"IF(G$414>0,(HLOOKUP(G$411,'Data base'!$B$5:$AIN$11,$M420,0)),\"\")","v":""},{"$f":"IF(H$414>0,(HLOOKUP(H$411,'Data base'!$B$5:$AIN$11,$M420,0)),\"\")","v":""},{"$f":"IF(I$414>0,(HLOOKUP(I$411,'Data base'!$B$5:$AIN$11,$M420,0)),\"\")","v":""},{"$f":"IF(J$414>0,(HLOOKUP(J$411,'Data base'!$B$5:$AIN$11,$M420,0)),\"\")","v":""},{"$f":"IF(K$414>0,(HLOOKUP(K$411,'Data base'!$B$5:$AIN$11,$M420,0)),\"\")","v":""},{"$f":"IF(L$414>0,(HLOOKUP(L$411,'Data base'!$B$5:$AIN$11,$M420,0)),\"\")","v":""},4]
[null,"Product Toxicity Index",null,{"$f":"IF(D$414>0,(HLOOKUP(D$411,'Data base'!$B$5:$AIN$11,$M421,0)),\"\")","v":""},{"$f":"IF(E$414>0,(HLOOKUP(E$411,'Data base'!$B$5:$AIN$11,$M421,0)),\"\")","v":""},{"$f":"IF(F$414>0,(HLOOKUP(F$411,'Data base'!$B$5:$AIN$11,$M421,0)),\"\")","v":""},{"$f":"IF(G$414>0,(HLOOKUP(G$411,'Data base'!$B$5:$AIN$11,$M421,0)),\"\")","v":""},{"$f":"IF(H$414>0,(HLOOKUP(H$411,'Data base'!$B$5:$AIN$11,$M421,0)),\"\")","v":""},{"$f":"IF(I$414>0,(HLOOKUP(I$411,'Data base'!$B$5:$AIN$11,$M421,0)),\"\")","v":""},{"$f":"IF(J$414>0,(HLOOKUP(J$411,'Data base'!$B$5:$AIN$11,$M421,0)),\"\")","v":""},{"$f":"IF(K$414>0,(HLOOKUP(K$411,'Data base'!$B$5:$AIN$11,$M421,0)),\"\")","v":""},{"$f":"IF(L$414>0,(HLOOKUP(L$411,'Data base'!$B$5:$AIN$11,$M421,0)),\"\")","v":""},5]
[null,"Koc",null,{"$f":"IF(D$414>0,(HLOOKUP(D$411,'Data base'!$B$5:$AIN$11,$M422,0)),\"\")","v":""},{"$f":"IF(E$414>0,(HLOOKUP(E$411,'Data base'!$B$5:$AIN$11,$M422,0)),\"\")","v":""},{"$f":"IF(F$414>0,(HLOOKUP(F$411,'Data base'!$B$5:$AIN$11,$M422,0)),\"\")","v":""},{"$f":"IF(G$414>0,(HLOOKUP(G$411,'Data base'!$B$5:$AIN$11,$M422,0)),\"\")","v":""},{"$f":"IF(H$414>0,(HLOOKUP(H$411,'Data base'!$B$5:$AIN$11,$M422,0)),\"\")","v":""},{"$f":"IF(I$414>0,(HLOOKUP(I$411,'Data base'!$B$5:$AIN$11,$M422,0)),\"\")","v":""},{"$f":"IF(J$414>0,(HLOOKUP(J$411,'Data base'!$B$5:$AIN$11,$M422,0)),\"\")","v":""},{"$f":"IF(K$414>0,(HLOOKUP(K$411,'Data base'!$B$5:$AIN$11,$M422,0)),\"\")","v":""},{"$f":"IF(L$414>0,(HLOOKUP(L$411,'Data base'!$B$5:$AIN$11,$M422,0)),\"\")","v":""},6]
[null,"t1/2 (DT50)",null,{"$f":"IF(D$414>0,(HLOOKUP(D$411,'Data base'!$B$5:$AIN$11,$M423,0)),\"\")","v":""},{"$f":"IF(E$414>0,(HLOOKUP(E$411,'Data base'!$B$5:$AIN$11,$M423,0)),\"\")","v":""},{"$f":"IF(F$414>0,(HLOOKUP(F$411,'Data base'!$B$5:$AIN$11,$M423,0)),\"\")","v":""},{"$f":"IF(G$414>0,(HLOOKUP(G$411,'Data base'!$B$5:$AIN$11,$M423,0)),\"\")","v":""},{"$f":"IF(H$414>0,(HLOOKUP(H$411,'Data base'!$B$5:$AIN$11,$M423,0)),\"\")","v":""},{"$f":"IF(I$414>0,(HLOOKUP(I$411,'Data base'!$B$5:$AIN$11,$M423,0)),\"\")","v":""},{"$f":"IF(J$414>0,(HLOOKUP(J$411,'Data base'!$B$5:$AIN$11,$M423,0)),\"\")","v":""},{"$f":"IF(K$414>0,(HLOOKUP(K$411,'Data base'!$B$5:$AIN$11,$M423,0)),\"\")","v":""},{"$f":"IF(L$414>0,(HLOOKUP(L$411,'Data base'!$B$5:$AIN$11,$M423,0)),\"\")","v":""},7]
[null,"Vulnerability index GUS (IUPAC)",null,{"$f":"IF(D414=0,\"\",IF(LOG10(D423)*(4-LOG10(D422))<=0,0,IF(OR(LOG10(D423)*(4-LOG10(D422))>0,),(LOG10(D423)*(4-LOG10(D422))),IF((LOG10(D423)*(4-LOG10(D422))>0),(LOG10(D423)*(4-LOG10(D422)))))))","v":""},{"$f":"IF(E414=0,\"\",IF(LOG10(E423)*(4-LOG10(E422))<=0,0,IF(OR(LOG10(E423)*(4-LOG10(E422))>0,),(LOG10(E423)*(4-LOG10(E422))),IF((LOG10(E423)*(4-LOG10(E422))>0),(LOG10(E423)*(4-LOG10(E422)))))))","v":""},"","","","","","",""]
[null,"Potential contamination (1, 2 or 3)",null,{"$f":"IF(D414>0,(IF(OR(Formulas!H387=0.83,Formulas!H387<0.83),1,IF(OR(AND(0.83<Formulas!H387,Formulas!H387<=1.66)),2,IF(Formulas!H387>1.66,3,\"\")))),\"\")","v":""},{"$f":"IF(E414>0,(IF(OR(Formulas!I387=0.83,Formulas!I387<0.83),1,IF(OR(AND(0.83<Formulas!I387,Formulas!I387<=1.66)),2,IF(Formulas!I387>1.66,3,\"\")))),\"\")","v":""},{"$f":"IF(F414>0,(IF(OR(Formulas!J387=0.83,Formulas!J387<0.83),1,IF(OR(AND(0.83<Formulas!J387,Formulas!J387<=1.66)),2,IF(Formulas!J387>1.66,3,\"\")))),\"\")","v":""},{"$f":"IF(G414>0,(IF(OR(Formulas!K387=0.83,Formulas!K387<0.83),1,IF(OR(AND(0.83<Formulas!K387,Formulas!K387<=1.66)),2,IF(Formulas!K387>1.66,3,\"\")))),\"\")","v":""},{"$f":"IF(H414>0,(IF(OR(Formulas!L387=0.83,Formulas!L387<0.83),1,IF(OR(AND(0.83<Formulas!L387,Formulas!L387<=1.66)),2,IF(Formulas!L387>1.66,3,\"\")))),\"\")","v":""},{"$f":"IF(I414>0,(IF(OR(Formulas!M387=0.83,Formulas!M387<0.83),1,IF(OR(AND(0.83<Formulas!M387,Formulas!M387<=1.66)),2,IF(Formulas!M387>1.66,3,\"\")))),\"\")","v":""},{"$f":"IF(J414>0,(IF(OR(Formulas!N387=0.83,Formulas!N387<0.83),1,IF(OR(AND(0.83<Formulas!N387,Formulas!N387<=1.66)),2,IF(Formulas!N387>1.66,3,\"\")))),\"\")","v":""},{"$f":"IF(K414>0,(IF(OR(B399=0.83,B399<0.83),1,IF(OR(AND(0.83<B399,B399<=1.66)),2,IF(B399>1.66,3,\"\")))),\"\")","v":""},{"$f":"IF(L414>0,(IF(OR(C399=0.83,C399<0.83),1,IF(OR(AND(0.83<C399,C399<=1.66)),2,IF(C399>1.66,3,\"\")))),\"\")","v":""}]
[null,"EIQ Farm worker  (<  80; 80 - 128; > 128)",null,{"$f":"IF(D$414>0,(HLOOKUP(D$411,'Data base'!$B$5:$AIN$18,$M426,0)),\"\")","v":""},{"$f":"IF(E$414>0,(HLOOKUP(E$411,'Data base'!$B$5:$AIN$18,$M426,0)),\"\")","v":""},{"$f":"IF(F$414>0,(HLOOKUP(F$411,'Data base'!$B$5:$AIN$18,$M426,0)),\"\")","v":""},{"$f":"IF(G$414>0,(HLOOKUP(G$411,'Data base'!$B$5:$AIN$18,$M426,0)),\"\")","v":""},{"$f":"IF(H$414>0,(HLOOKUP(H$411,'Data base'!$B$5:$AIN$18,$M426,0)),\"\")","v":""},{"$f":"IF(I$414>0,(HLOOKUP(I$411,'Data base'!$B$5:$AIN$18,$M426,0)),\"\")","v":""},{"$f":"IF(J$414>0,(HLOOKUP(J$411,'Data base'!$B$5:$AIN$18,$M426,0)),\"\")","v":""},{"$f":"IF(K$414>0,(HLOOKUP(K$411,'Data base'!$B$5:$AIN$18,$M426,0)),\"\")","v":""},{"$f":"IF(L$414>0,(HLOOKUP(L$411,'Data base'!$B$5:$AIN$18,$M426,0)),\"\")","v":""},12]
[null,"EIQ Consumer (< 20,5; 20,5 - 36,25; > 36,25)",null,{"$f":"IF(D$414>0,(HLOOKUP(D$411,'Data base'!$B$5:$AIN$18,$M427,0)),\"\")","v":""},{"$f":"IF(E$414>0,(HLOOKUP(E$411,'Data base'!$B$5:$AIN$18,$M427,0)),\"\")","v":""},{"$f":"IF(F$414>0,(HLOOKUP(F$411,'Data base'!$B$5:$AIN$18,$M427,0)),\"\")","v":""},{"$f":"IF(G$414>0,(HLOOKUP(G$411,'Data base'!$B$5:$AIN$18,$M427,0)),\"\")","v":""},{"$f":"IF(H$414>0,(HLOOKUP(H$411,'Data base'!$B$5:$AIN$18,$M427,0)),\"\")","v":""},{"$f":"IF(I$414>0,(HLOOKUP(I$411,'Data base'!$B$5:$AIN$18,$M427,0)),\"\")","v":""},{"$f":"IF(J$414>0,(HLOOKUP(J$411,'Data base'!$B$5:$AIN$18,$M427,0)),\"\")","v":""},{"$f":"IF(K$414>0,(HLOOKUP(K$411,'Data base'!$B$5:$AIN$18,$M427,0)),\"\")","v":""},{"$f":"IF(L$414>0,(HLOOKUP(L$411,'Data base'!$B$5:$AIN$18,$M427,0)),\"\")","v":""},13]
[null,"EIQ Ecological (< 75; 75 - 136,5; > 136,5)",null,{"$f":"IF(D$414>0,(HLOOKUP(D$411,'Data base'!$B$5:$AIN$18,$M428,0)),\"\")","v":""},{"$f":"IF(E$414>0,(HLOOKUP(E$411,'Data base'!$B$5:$AIN$18,$M428,0)),\"\")","v":""},{"$f":"IF(F$414>0,(HLOOKUP(F$411,'Data base'!$B$5:$AIN$18,$M428,0)),\"\")","v":""},{"$f":"IF(G$414>0,(HLOOKUP(G$411,'Data base'!$B$5:$AIN$18,$M428,0)),\"\")","v":""},{"$f":"IF(H$414>0,(HLOOKUP(H$411,'Data base'!$B$5:$AIN$18,$M428,0)),\"\")","v":""},{"$f":"IF(I$414>0,(HLOOKUP(I$411,'Data base'!$B$5:$AIN$18,$M428,0)),\"\")","v":""},{"$f":"IF(J$414>0,(HLOOKUP(J$411,'Data base'!$B$5:$AIN$18,$M428,0)),\"\")","v":""},{"$f":"IF(K$414>0,(HLOOKUP(K$411,'Data base'!$B$5:$AIN$18,$M428,0)),\"\")","v":""},{"$f":"IF(L$414>0,(HLOOKUP(L$411,'Data base'!$B$5:$AIN$18,$M428,0)),\"\")","v":""},14]
[null,"EIQ (<58,33; 58,33 - 94,46; > 94,46)",null,{"$f":"IF(D$414>0,(HLOOKUP(D$411,'Data base'!$B$5:$AIN$18,$M429,0)),\"\")","v":""},{"$f":"IF(E$414>0,(HLOOKUP(E$411,'Data base'!$B$5:$AIN$18,$M429,0)),\"\")","v":""},{"$f":"IF(F$414>0,(HLOOKUP(F$411,'Data base'!$B$5:$AIN$18,$M429,0)),\"\")","v":""},{"$f":"IF(G$414>0,(HLOOKUP(G$411,'Data base'!$B$5:$AIN$18,$M429,0)),\"\")","v":""},{"$f":"IF(H$414>0,(HLOOKUP(H$411,'Data base'!$B$5:$AIN$18,$M429,0)),\"\")","v":""},{"$f":"IF(I$414>0,(HLOOKUP(I$411,'Data base'!$B$5:$AIN$18,$M429,0)),\"\")","v":""},{"$f":"IF(J$414>0,(HLOOKUP(J$411,'Data base'!$B$5:$AIN$18,$M429,0)),\"\")","v":""},{"$f":"IF(K$414>0,(HLOOKUP(K$411,'Data base'!$B$5:$AIN$18,$M429,0)),\"\")","v":""},{"$f":"IF(L$414>0,(HLOOKUP(L$411,'Data base'!$B$5:$AIN$18,$M429,0)),\"\")","v":""},11]
[null,"Banned Pesticides - EU (may 2022) (X)",null,{"$f":"IF(D$414>0,(HLOOKUP(D$411,'Data base'!$B$5:$AIN$19,$M430,0)),\"\")","v":""},{"$f":"IF(E$414>0,(HLOOKUP(E$411,'Data base'!$B$5:$AIN$19,$M430,0)),\"\")","v":""},{"$f":"IF(F$414>0,(HLOOKUP(F$411,'Data base'!$B$5:$AIN$19,$M430,0)),\"\")","v":""},{"$f":"IF(G$414>0,(HLOOKUP(G$411,'Data base'!$B$5:$AIN$19,$M430,0)),\"\")","v":""},{"$f":"IF(H$414>0,(HLOOKUP(H$411,'Data base'!$B$5:$AIN$19,$M430,0)),\"\")","v":""},{"$f":"IF(I$414>0,(HLOOKUP(I$411,'Data base'!$B$5:$AIN$19,$M430,0)),\"\")","v":""},{"$f":"IF(J$414>0,(HLOOKUP(J$411,'Data base'!$B$5:$AIN$19,$M430,0)),\"\")","v":""},{"$f":"IF(K$414>0,(HLOOKUP(K$411,'Data base'!$B$5:$AIN$19,$M430,0)),\"\")","v":""},{"$f":"IF(L$414>0,(HLOOKUP(L$411,'Data base'!$B$5:$AIN$19,$M430,0)),\"\")","v":""},15]
[]
[null,"Clay content in the soil                                                               > 60% (1); 30% - 60% (2); <30% (3)\t"]
[null,"Distance to water course (edge ​​of field)                          >1.000m (1);  300 - 1.000m (2);  <300m (3)\t"]
[null,"Soil management type: No Till system with cover crops (1); No Till System (2); Plowed soil (3)\t"]
[null,"Field Vulnerability (1, 2 or 3)\t",null,{"$f":"IF(D415>0,(IF(OR(AND(1<=Formulas!H388,Formulas!H388<=3)),1,IF(OR(AND(3<Formulas!H388,Formulas!H388<=9)),2,IF(Formulas!H388>9,3)))),\"\")","v":""},{"$f":"IF(E415>0,(IF(OR(AND(1<=Formulas!I388,Formulas!I388<=3)),1,IF(OR(AND(3<Formulas!I388,Formulas!I388<=9)),2,IF(Formulas!I388>9,3)))),\"\")","v":""},{"$f":"IF(F415>0,(IF(OR(AND(1<=Formulas!J388,Formulas!J388<=3)),1,IF(OR(AND(3<Formulas!J388,Formulas!J388<=9)),2,IF(Formulas!J388>9,3)))),\"\")","v":""},{"$f":"IF(G415>0,(IF(OR(AND(1<=Formulas!K388,Formulas!K388<=3)),1,IF(OR(AND(3<Formulas!K388,Formulas!K388<=9)),2,IF(Formulas!K388>9,3)))),\"\")","v":""},{"$f":"IF(H415>0,(IF(OR(AND(1<=Formulas!L388,Formulas!L388<=3)),1,IF(OR(AND(3<Formulas!L388,Formulas!L388<=9)),2,IF(Formulas!L388>9,3)))),\"\")","v":""},{"$f":"IF(I415>0,(IF(OR(AND(1<=Formulas!M388,Formulas!M388<=3)),1,IF(OR(AND(3<Formulas!M388,Formulas!M388<=9)),2,IF(Formulas!M388>9,3)))),\"\")","v":""},{"$f":"IF(J415>0,(IF(OR(AND(1<=Formulas!N388,Formulas!N388<=3)),1,IF(OR(AND(3<Formulas!N388,Formulas!N388<=9)),2,IF(Formulas!N388>9,3)))),\"\")","v":""},{"$f":"IF(K415>0,(IF(OR(AND(1<=Formulas!B400,Formulas!B400<=3)),1,IF(OR(AND(3<Formulas!B400,Formulas!B400<=9)),2,IF(Formulas!B400>9,3)))),\"\")","v":""},{"$f":"IF(L415>0,(IF(OR(AND(1<=Formulas!C400,Formulas!C400<=3)),1,IF(OR(AND(3<Formulas!C400,Formulas!C400<=9)),2,IF(Formulas!C400>9,3)))),\"\")","v":""}]
[]
[null,"Contamination risk (1, 2 or 3)",null,{"$f":"IF(D415>0,(IF(OR(AND(1<=Formulas!H390,Formulas!H390<=2)),1,IF(OR(AND(2<Formulas!H390,Formulas!H390<=4)),2,IF(Formulas!H390>4,3)))),\"\")","v":""},{"$f":"IF(E415>0,(IF(OR(AND(1<=Formulas!I390,Formulas!I390<=2)),1,IF(OR(AND(2<Formulas!I390,Formulas!I390<=4)),2,IF(Formulas!I390>4,3)))),\"\")","v":""},{"$f":"IF(F415>0,(IF(OR(AND(1<=Formulas!J390,Formulas!J390<=2)),1,IF(OR(AND(2<Formulas!J390,Formulas!J390<=4)),2,IF(Formulas!J390>4,3)))),\"\")","v":""},{"$f":"IF(G415>0,(IF(OR(AND(1<=Formulas!K390,Formulas!K390<=2)),1,IF(OR(AND(2<Formulas!K390,Formulas!K390<=4)),2,IF(Formulas!K390>4,3)))),\"\")","v":""},{"$f":"IF(H415>0,(IF(OR(AND(1<=Formulas!L390,Formulas!L390<=2)),1,IF(OR(AND(2<Formulas!L390,Formulas!L390<=4)),2,IF(Formulas!L390>4,3)))),\"\")","v":""},{"$f":"IF(I415>0,(IF(OR(AND(1<=Formulas!M390,Formulas!M390<=2)),1,IF(OR(AND(2<Formulas!M390,Formulas!M390<=4)),2,IF(Formulas!M390>4,3)))),\"\")","v":""},{"$f":"IF(J415>0,(IF(OR(AND(1<=Formulas!N390,Formulas!N390<=2)),1,IF(OR(AND(2<Formulas!N390,Formulas!N390<=4)),2,IF(Formulas!N390>4,3)))),\"\")","v":""},{"$f":"IF(K415>0,(IF(OR(AND(1<=Formulas!B402,Formulas!B402<=2)),1,IF(OR(AND(2<Formulas!B402,Formulas!B402<=4)),2,IF(Formulas!B402>4,3)))),\"\")","v":""},{"$f":"IF(L415>0,(IF(OR(AND(1<=Formulas!C402,Formulas!C402<=2)),1,IF(OR(AND(2<Formulas!C402,Formulas!C402<=4)),2,IF(Formulas!C402>4,3)))),\"\")","v":""}]
[]
[]
[null,"Product's active principle (select)\t"]
[null,"Active ingredient (%)"]
[null,"Land use/crop description"]
[null,"Area (ha)\t"]
[null,"Volume applied  L/ha or kg/ha \t"]
[null,"Total volume applied",null,{"$f":"+D444*D443","v":{"v":0,"d":"0.0"}},{"v":0,"d":"0.0"},{"v":0,"d":"0.0"},{"v":0,"d":"0.0"},{"v":0,"d":"0.0"},{"v":0,"d":"0.0"},{"v":0,"d":"0.0"},{"v":0,"d":"0.0"},{"v":0,"d":"0.0"}]
[]
[null,"Product's active principle ",null,{"$f":"IF(D$443>0,(HLOOKUP(D$440,'Data base'!$B$5:$AIN$11,$M447,0)),\"\")","v":""},{"$f":"IF(E$443>0,(HLOOKUP(E$440,'Data base'!$B$5:$AIN$11,$M447,0)),\"\")","v":""},{"$f":"IF(F$443>0,(HLOOKUP(F$440,'Data base'!$B$5:$AIN$11,$M447,0)),\"\")","v":""},{"$f":"IF(G$443>0,(HLOOKUP(G$440,'Data base'!$B$5:$AIN$11,$M447,0)),\"\")","v":""},{"$f":"IF(H$443>0,(HLOOKUP(H$440,'Data base'!$B$5:$AIN$11,$M447,0)),\"\")","v":""},{"$f":"IF(I$443>0,(HLOOKUP(I$440,'Data base'!$B$5:$AIN$11,$M447,0)),\"\")","v":""},{"$f":"IF(J$443>0,(HLOOKUP(J$440,'Data base'!$B$5:$AIN$11,$M447,0)),\"\")","v":""},{"$f":"IF(K$443>0,(HLOOKUP(K$440,'Data base'!$B$5:$AIN$11,$M447,0)),\"\")","v":""},{"$f":"IF(L$443>0,(HLOOKUP(L$440,'Data base'!$B$5:$AIN$11,$M447,0)),\"\")","v":""},2]
[null,"Toxicity to fish - 96h LC50 (mg l-1)",null,{"$f":"IF(D$443>0,(HLOOKUP(D$440,'Data base'!$B$5:$AIN$11,$M448,0)),\"\")","v":""},{"$f":"IF(E$443>0,(HLOOKUP(E$440,'Data base'!$B$5:$AIN$11,$M448,0)),\"\")","v":""},{"$f":"IF(F$443>0,(HLOOKUP(F$440,'Data base'!$B$5:$AIN$11,$M448,0)),\"\")","v":""},{"$f":"IF(G$443>0,(HLOOKUP(G$440,'Data base'!$B$5:$AIN$11,$M448,0)),\"\")","v":""},{"$f":"IF(H$443>0,(HLOOKUP(H$440,'Data base'!$B$5:$AIN$11,$M448,0)),\"\")","v":""},{"$f":"IF(I$443>0,(HLOOKUP(I$440,'Data base'!$B$5:$AIN$11,$M448,0)),\"\")","v":""},{"$f":"IF(J$443>0,(HLOOKUP(J$440,'Data base'!$B$5:$AIN$11,$M448,0)),\"\")","v":""},{"$f":"IF(K$443>0,(HLOOKUP(K$440,'Data base'!$B$5:$AIN$11,$M448,0)),\"\")","v":""},{"$f":"IF(L$443>0,(HLOOKUP(L$440,'Data base'!$B$5:$AIN$11,$M448,0)),\"\")","v":""},3]
[null,"Toxicity - ADI (mg kg-1 day-1)",null,{"$f":"IF(D$443>0,(HLOOKUP(D$440,'Data base'!$B$5:$AIN$11,$M449,0)),\"\")","v":""},{"$f":"IF(E$443>0,(HLOOKUP(E$440,'Data base'!$B$5:$AIN$11,$M449,0)),\"\")","v":""},{"$f":"IF(F$443>0,(HLOOKUP(F$440,'Data base'!$B$5:$AIN$11,$M449,0)),\"\")","v":""},{"$f":"IF(G$443>0,(HLOOKUP(G$440,'Data base'!$B$5:$AIN$11,$M449,0)),\"\")","v":""},{"$f":"IF(H$443>0,(HLOOKUP(H$440,'Data base'!$B$5:$AIN$11,$M449,0)),\"\")","v":""},{"$f":"IF(I$443>0,(HLOOKUP(I$440,'Data base'!$B$5:$AIN$11,$M449,0)),\"\")","v":""},{"$f":"IF(J$443>0,(HLOOKUP(J$440,'Data base'!$B$5:$AIN$11,$M449,0)),\"\")","v":""},{"$f":"IF(K$443>0,(HLOOKUP(K$440,'Data base'!$B$5:$AIN$11,$M449,0)),\"\")","v":""},{"$f":"IF(L$443>0,(HLOOKUP(L$440,'Data base'!$B$5:$AIN$11,$M449,0)),\"\")","v":""},4]
[null,"Product Toxicity Index",null,{"$f":"IF(D$443>0,(HLOOKUP(D$440,'Data base'!$B$5:$AIN$11,$M450,0)),\"\")","v":""},{"$f":"IF(E$443>0,(HLOOKUP(E$440,'Data base'!$B$5:$AIN$11,$M450,0)),\"\")","v":""},{"$f":"IF(F$443>0,(HLOOKUP(F$440,'Data base'!$B$5:$AIN$11,$M450,0)),\"\")","v":""},{"$f":"IF(G$443>0,(HLOOKUP(G$440,'Data base'!$B$5:$AIN$11,$M450,0)),\"\")","v":""},{"$f":"IF(H$443>0,(HLOOKUP(H$440,'Data base'!$B$5:$AIN$11,$M450,0)),\"\")","v":""},{"$f":"IF(I$443>0,(HLOOKUP(I$440,'Data base'!$B$5:$AIN$11,$M450,0)),\"\")","v":""},{"$f":"IF(J$443>0,(HLOOKUP(J$440,'Data base'!$B$5:$AIN$11,$M450,0)),\"\")","v":""},{"$f":"IF(K$443>0,(HLOOKUP(K$440,'Data base'!$B$5:$AIN$11,$M450,0)),\"\")","v":""},{"$f":"IF(L$443>0,(HLOOKUP(L$440,'Data base'!$B$5:$AIN$11,$M450,0)),\"\")","v":""},5]
[null,"Koc",null,{"$f":"IF(D$443>0,(HLOOKUP(D$440,'Data base'!$B$5:$AIN$11,$M451,0)),\"\")","v":""},{"$f":"IF(E$443>0,(HLOOKUP(E$440,'Data base'!$B$5:$AIN$11,$M451,0)),\"\")","v":""},{"$f":"IF(F$443>0,(HLOOKUP(F$440,'Data base'!$B$5:$AIN$11,$M451,0)),\"\")","v":""},{"$f":"IF(G$443>0,(HLOOKUP(G$440,'Data base'!$B$5:$AIN$11,$M451,0)),\"\")","v":""},{"$f":"IF(H$443>0,(HLOOKUP(H$440,'Data base'!$B$5:$AIN$11,$M451,0)),\"\")","v":""},{"$f":"IF(I$443>0,(HLOOKUP(I$440,'Data base'!$B$5:$AIN$11,$M451,0)),\"\")","v":""},{"$f":"IF(J$443>0,(HLOOKUP(J$440,'Data base'!$B$5:$AIN$11,$M451,0)),\"\")","v":""},{"$f":"IF(K$443>0,(HLOOKUP(K$440,'Data base'!$B$5:$AIN$11,$M451,0)),\"\")","v":""},{"$f":"IF(L$443>0,(HLOOKUP(L$440,'Data base'!$B$5:$AIN$11,$M451,0)),\"\")","v":""},6]
[null,"t1/2 (DT50)",null,{"$f":"IF(D$443>0,(HLOOKUP(D$440,'Data base'!$B$5:$AIN$11,$M452,0)),\"\")","v":""},{"$f":"IF(E$443>0,(HLOOKUP(E$440,'Data base'!$B$5:$AIN$11,$M452,0)),\"\")","v":""},{"$f":"IF(F$443>0,(HLOOKUP(F$440,'Data base'!$B$5:$AIN$11,$M452,0)),\"\")","v":""},{"$f":"IF(G$443>0,(HLOOKUP(G$440,'Data base'!$B$5:$AIN$11,$M452,0)),\"\")","v":""},{"$f":"IF(H$443>0,(HLOOKUP(H$440,'Data base'!$B$5:$AIN$11,$M452,0)),\"\")","v":""},{"$f":"IF(I$443>0,(HLOOKUP(I$440,'Data base'!$B$5:$AIN$11,$M452,0)),\"\")","v":""},{"$f":"IF(J$443>0,(HLOOKUP(J$440,'Data base'!$B$5:$AIN$11,$M452,0)),\"\")","v":""},{"$f":"IF(K$443>0,(HLOOKUP(K$440,'Data base'!$B$5:$AIN$11,$M452,0)),\"\")","v":""},{"$f":"IF(L$443>0,(HLOOKUP(L$440,'Data base'!$B$5:$AIN$11,$M452,0)),\"\")","v":""},7]
[null,"Vulnerability index GUS (IUPAC)",null,{"$f":"IF(D443=0,\"\",IF(LOG10(D452)*(4-LOG10(D451))<=0,0,IF(OR(LOG10(D452)*(4-LOG10(D451))>0,),(LOG10(D452)*(4-LOG10(D451))),IF((LOG10(D452)*(4-LOG10(D451))>0),(LOG10(D452)*(4-LOG10(D451)))))))","v":""},{"$f":"IF(E443=0,\"\",IF(LOG10(E452)*(4-LOG10(E451))<=0,0,IF(OR(LOG10(E452)*(4-LOG10(E451))>0,),(LOG10(E452)*(4-LOG10(E451))),IF((LOG10(E452)*(4-LOG10(E451))>0),(LOG10(E452)*(4-LOG10(E451)))))))","v":""},"","","","","","",""]
[null,"Potential contamination (1, 2 or 3)",null,{"$f":"IF(D443>0,(IF(OR(D399=0.83,D399<0.83),1,IF(OR(AND(0.83<D399,D399<=1.66)),2,IF(D399>1.66,3,\"\")))),\"\")","v":""},{"$f":"IF(E443>0,(IF(OR(E399=0.83,E399<0.83),1,IF(OR(AND(0.83<E399,E399<=1.66)),2,IF(E399>1.66,3,\"\")))),\"\")","v":""},"","","","","","",""]
[null,"EIQ Farm worker  (<  80; 80 - 128; > 128)",null,{"$f":"IF(D$443>0,(HLOOKUP(D$440,'Data base'!$B$5:$AIN$18,$M455,0)),\"\")","v":""},{"$f":"IF(E$443>0,(HLOOKUP(E$440,'Data base'!$B$5:$AIN$18,$M455,0)),\"\")","v":""},{"$f":"IF(F$443>0,(HLOOKUP(F$440,'Data base'!$B$5:$AIN$18,$M455,0)),\"\")","v":""},{"$f":"IF(G$443>0,(HLOOKUP(G$440,'Data base'!$B$5:$AIN$18,$M455,0)),\"\")","v":""},{"$f":"IF(H$443>0,(HLOOKUP(H$440,'Data base'!$B$5:$AIN$18,$M455,0)),\"\")","v":""},{"$f":"IF(I$443>0,(HLOOKUP(I$440,'Data base'!$B$5:$AIN$18,$M455,0)),\"\")","v":""},{"$f":"IF(J$443>0,(HLOOKUP(J$440,'Data base'!$B$5:$AIN$18,$M455,0)),\"\")","v":""},{"$f":"IF(K$443>0,(HLOOKUP(K$440,'Data base'!$B$5:$AIN$18,$M455,0)),\"\")","v":""},{"$f":"IF(L$443>0,(HLOOKUP(L$440,'Data base'!$B$5:$AIN$18,$M455,0)),\"\")","v":""},12]
[null,"EIQ Consumer (< 20,5; 20,5 - 36,25; > 36,25)",null,{"$f":"IF(D$443>0,(HLOOKUP(D$440,'Data base'!$B$5:$AIN$18,$M456,0)),\"\")","v":""},{"$f":"IF(E$443>0,(HLOOKUP(E$440,'Data base'!$B$5:$AIN$18,$M456,0)),\"\")","v":""},{"$f":"IF(F$443>0,(HLOOKUP(F$440,'Data base'!$B$5:$AIN$18,$M456,0)),\"\")","v":""},{"$f":"IF(G$443>0,(HLOOKUP(G$440,'Data base'!$B$5:$AIN$18,$M456,0)),\"\")","v":""},{"$f":"IF(H$443>0,(HLOOKUP(H$440,'Data base'!$B$5:$AIN$18,$M456,0)),\"\")","v":""},{"$f":"IF(I$443>0,(HLOOKUP(I$440,'Data base'!$B$5:$AIN$18,$M456,0)),\"\")","v":""},{"$f":"IF(J$443>0,(HLOOKUP(J$440,'Data base'!$B$5:$AIN$18,$M456,0)),\"\")","v":""},{"$f":"IF(K$443>0,(HLOOKUP(K$440,'Data base'!$B$5:$AIN$18,$M456,0)),\"\")","v":""},{"$f":"IF(L$443>0,(HLOOKUP(L$440,'Data base'!$B$5:$AIN$18,$M456,0)),\"\")","v":""},13]
[null,"EIQ Ecological (< 75; 75 - 136,5; > 136,5)",null,{"$f":"IF(D$443>0,(HLOOKUP(D$440,'Data base'!$B$5:$AIN$18,$M457,0)),\"\")","v":""},{"$f":"IF(E$443>0,(HLOOKUP(E$440,'Data base'!$B$5:$AIN$18,$M457,0)),\"\")","v":""},{"$f":"IF(F$443>0,(HLOOKUP(F$440,'Data base'!$B$5:$AIN$18,$M457,0)),\"\")","v":""},{"$f":"IF(G$443>0,(HLOOKUP(G$440,'Data base'!$B$5:$AIN$18,$M457,0)),\"\")","v":""},{"$f":"IF(H$443>0,(HLOOKUP(H$440,'Data base'!$B$5:$AIN$18,$M457,0)),\"\")","v":""},{"$f":"IF(I$443>0,(HLOOKUP(I$440,'Data base'!$B$5:$AIN$18,$M457,0)),\"\")","v":""},{"$f":"IF(J$443>0,(HLOOKUP(J$440,'Data base'!$B$5:$AIN$18,$M457,0)),\"\")","v":""},{"$f":"IF(K$443>0,(HLOOKUP(K$440,'Data base'!$B$5:$AIN$18,$M457,0)),\"\")","v":""},{"$f":"IF(L$443>0,(HLOOKUP(L$440,'Data base'!$B$5:$AIN$18,$M457,0)),\"\")","v":""},14]
[null,"EIQ (<58,33; 58,33 - 94,46; > 94,46)",null,{"$f":"IF(D$443>0,(HLOOKUP(D$440,'Data base'!$B$5:$AIN$18,$M458,0)),\"\")","v":""},{"$f":"IF(E$443>0,(HLOOKUP(E$440,'Data base'!$B$5:$AIN$18,$M458,0)),\"\")","v":""},{"$f":"IF(F$443>0,(HLOOKUP(F$440,'Data base'!$B$5:$AIN$18,$M458,0)),\"\")","v":""},{"$f":"IF(G$443>0,(HLOOKUP(G$440,'Data base'!$B$5:$AIN$18,$M458,0)),\"\")","v":""},{"$f":"IF(H$443>0,(HLOOKUP(H$440,'Data base'!$B$5:$AIN$18,$M458,0)),\"\")","v":""},{"$f":"IF(I$443>0,(HLOOKUP(I$440,'Data base'!$B$5:$AIN$18,$M458,0)),\"\")","v":""},{"$f":"IF(J$443>0,(HLOOKUP(J$440,'Data base'!$B$5:$AIN$18,$M458,0)),\"\")","v":""},{"$f":"IF(K$443>0,(HLOOKUP(K$440,'Data base'!$B$5:$AIN$18,$M458,0)),\"\")","v":""},{"$f":"IF(L$443>0,(HLOOKUP(L$440,'Data base'!$B$5:$AIN$18,$M458,0)),\"\")","v":""},11]
[null,"Banned Pesticides - EU (may 2022) (X)",null,{"$f":"IF(D$443>0,(HLOOKUP(D$440,'Data base'!$B$5:$AIN$19,$M459,0)),\"\")","v":""},{"$f":"IF(E$443>0,(HLOOKUP(E$440,'Data base'!$B$5:$AIN$19,$M459,0)),\"\")","v":""},{"$f":"IF(F$443>0,(HLOOKUP(F$440,'Data base'!$B$5:$AIN$19,$M459,0)),\"\")","v":""},{"$f":"IF(G$443>0,(HLOOKUP(G$440,'Data base'!$B$5:$AIN$19,$M459,0)),\"\")","v":""},{"$f":"IF(H$443>0,(HLOOKUP(H$440,'Data base'!$B$5:$AIN$19,$M459,0)),\"\")","v":""},{"$f":"IF(I$443>0,(HLOOKUP(I$440,'Data base'!$B$5:$AIN$19,$M459,0)),\"\")","v":""},{"$f":"IF(J$443>0,(HLOOKUP(J$440,'Data base'!$B$5:$AIN$19,$M459,0)),\"\")","v":""},{"$f":"IF(K$443>0,(HLOOKUP(K$440,'Data base'!$B$5:$AIN$19,$M459,0)),\"\")","v":""},{"$f":"IF(L$443>0,(HLOOKUP(L$440,'Data base'!$B$5:$AIN$19,$M459,0)),\"\")","v":""},15]
[]
[null,"Clay content in the soil                                                               > 60% (1); 30% - 60% (2); <30% (3)\t"]
[null,"Distance to water course (edge ​​of field)                          >1.000m (1);  300 - 1.000m (2);  <300m (3)\t"]
[null,"Soil management type: No Till system with cover crops (1); No Till System (2); Plowed soil (3)\t"]
[null,"Field Vulnerability (1, 2 or 3)\t",null,{"$f":"IF(D444>0,(IF(OR(AND(1<=Formulas!D400,Formulas!D400<=3)),1,IF(OR(AND(3<Formulas!D400,Formulas!D400<=9)),2,IF(Formulas!D400>9,3)))),\"\")","v":""},{"$f":"IF(E444>0,(IF(OR(AND(1<=Formulas!E400,Formulas!E400<=3)),1,IF(OR(AND(3<Formulas!E400,Formulas!E400<=9)),2,IF(Formulas!E400>9,3)))),\"\")","v":""},{"$f":"IF(F444>0,(IF(OR(AND(1<=Formulas!F400,Formulas!F400<=3)),1,IF(OR(AND(3<Formulas!F400,Formulas!F400<=9)),2,IF(Formulas!F400>9,3)))),\"\")","v":""},{"$f":"IF(G444>0,(IF(OR(AND(1<=Formulas!G400,Formulas!G400<=3)),1,IF(OR(AND(3<Formulas!G400,Formulas!G400<=9)),2,IF(Formulas!G400>9,3)))),\"\")","v":""},{"$f":"IF(H444>0,(IF(OR(AND(1<=Formulas!H400,Formulas!H400<=3)),1,IF(OR(AND(3<Formulas!H400,Formulas!H400<=9)),2,IF(Formulas!H400>9,3)))),\"\")","v":""},{"$f":"IF(I444>0,(IF(OR(AND(1<=Formulas!I400,Formulas!I400<=3)),1,IF(OR(AND(3<Formulas!I400,Formulas!I400<=9)),2,IF(Formulas!I400>9,3)))),\"\")","v":""},{"$f":"IF(J444>0,(IF(OR(AND(1<=Formulas!J400,Formulas!J400<=3)),1,IF(OR(AND(3<Formulas!J400,Formulas!J400<=9)),2,IF(Formulas!J400>9,3)))),\"\")","v":""},{"$f":"IF(K444>0,(IF(OR(AND(1<=Formulas!K400,Formulas!K400<=3)),1,IF(OR(AND(3<Formulas!K400,Formulas!K400<=9)),2,IF(Formulas!K400>9,3)))),\"\")","v":""},{"$f":"IF(L444>0,(IF(OR(AND(1<=Formulas!L400,Formulas!L400<=3)),1,IF(OR(AND(3<Formulas!L400,Formulas!L400<=9)),2,IF(Formulas!L400>9,3)))),\"\")","v":""}]
[]
[null,"Contamination risk (1, 2 or 3)",null,{"$f":"IF(D444>0,(IF(OR(AND(1<=Formulas!D402,Formulas!D402<=2)),1,IF(OR(AND(2<Formulas!D402,Formulas!D402<=4)),2,IF(Formulas!D402>4,3)))),\"\")","v":""},{"$f":"IF(E444>0,(IF(OR(AND(1<=Formulas!E402,Formulas!E402<=2)),1,IF(OR(AND(2<Formulas!E402,Formulas!E402<=4)),2,IF(Formulas!E402>4,3)))),\"\")","v":""},{"$f":"IF(F444>0,(IF(OR(AND(1<=Formulas!F402,Formulas!F402<=2)),1,IF(OR(AND(2<Formulas!F402,Formulas!F402<=4)),2,IF(Formulas!F402>4,3)))),\"\")","v":""},{"$f":"IF(G444>0,(IF(OR(AND(1<=Formulas!G402,Formulas!G402<=2)),1,IF(OR(AND(2<Formulas!G402,Formulas!G402<=4)),2,IF(Formulas!G402>4,3)))),\"\")","v":""},{"$f":"IF(H444>0,(IF(OR(AND(1<=Formulas!H402,Formulas!H402<=2)),1,IF(OR(AND(2<Formulas!H402,Formulas!H402<=4)),2,IF(Formulas!H402>4,3)))),\"\")","v":""},{"$f":"IF(I444>0,(IF(OR(AND(1<=Formulas!I402,Formulas!I402<=2)),1,IF(OR(AND(2<Formulas!I402,Formulas!I402<=4)),2,IF(Formulas!I402>4,3)))),\"\")","v":""},{"$f":"IF(J444>0,(IF(OR(AND(1<=Formulas!J402,Formulas!J402<=2)),1,IF(OR(AND(2<Formulas!J402,Formulas!J402<=4)),2,IF(Formulas!J402>4,3)))),\"\")","v":""},{"$f":"IF(K444>0,(IF(OR(AND(1<=Formulas!K402,Formulas!K402<=2)),1,IF(OR(AND(2<Formulas!K402,Formulas!K402<=4)),2,IF(Formulas!K402>4,3)))),\"\")","v":""},{"$f":"IF(L444>0,(IF(OR(AND(1<=Formulas!L402,Formulas!L402<=2)),1,IF(OR(AND(2<Formulas!L402,Formulas!L402<=4)),2,IF(Formulas!L402>4,3)))),\"\")","v":""}]
[]
[null,"Product's active principle (select)\t"]
[null,"Active ingredient (%)"]
[null,"Land use/crop description"]
[null,"Area (ha)\t"]
[null,"Volume applied  L/ha or kg/ha \t"]
[null,"Total volume applied",null,{"$f":"+D472*D471","v":{"v":0,"d":"0.0"}},{"v":0,"d":"0.0"},{"v":0,"d":"0.0"},{"v":0,"d":"0.0"},{"v":0,"d":"0.0"},{"v":0,"d":"0.0"}]
[]
[null,"Product's active principle ",null,{"$f":"IF(D$471>0,(HLOOKUP(D$468,'Data base'!$B$5:$AIN$11,$J475,0)),\"\")","v":""},{"$f":"IF(E$471>0,(HLOOKUP(E$468,'Data base'!$B$5:$AIN$11,$J475,0)),\"\")","v":""},{"$f":"IF(F$471>0,(HLOOKUP(F$468,'Data base'!$B$5:$AIN$11,$J475,0)),\"\")","v":""},{"$f":"IF(G$471>0,(HLOOKUP(G$468,'Data base'!$B$5:$AIN$11,$J475,0)),\"\")","v":""},{"$f":"IF(H$471>0,(HLOOKUP(H$468,'Data base'!$B$5:$AIN$11,$J475,0)),\"\")","v":""},{"$f":"IF(I$471>0,(HLOOKUP(I$468,'Data base'!$B$5:$AIN$11,$J475,0)),\"\")","v":""},2]
[null,"Toxicity to fish - 96h LC50 (mg l-1)",null,{"$f":"IF(D$471>0,(HLOOKUP(D$468,'Data base'!$B$5:$AIN$11,$J476,0)),\"\")","v":""},{"$f":"IF(E$471>0,(HLOOKUP(E$468,'Data base'!$B$5:$AIN$11,$J476,0)),\"\")","v":""},{"$f":"IF(F$471>0,(HLOOKUP(F$468,'Data base'!$B$5:$AIN$11,$J476,0)),\"\")","v":""},{"$f":"IF(G$471>0,(HLOOKUP(G$468,'Data base'!$B$5:$AIN$11,$J476,0)),\"\")","v":""},{"$f":"IF(H$471>0,(HLOOKUP(H$468,'Data base'!$B$5:$AIN$11,$J476,0)),\"\")","v":""},{"$f":"IF(I$471>0,(HLOOKUP(I$468,'Data base'!$B$5:$AIN$11,$J476,0)),\"\")","v":""},3]
[null,"Toxicity - ADI (mg kg-1 day-1)",null,{"$f":"IF(D$471>0,(HLOOKUP(D$468,'Data base'!$B$5:$AIN$11,$J477,0)),\"\")","v":""},{"$f":"IF(E$471>0,(HLOOKUP(E$468,'Data base'!$B$5:$AIN$11,$J477,0)),\"\")","v":""},{"$f":"IF(F$471>0,(HLOOKUP(F$468,'Data base'!$B$5:$AIN$11,$J477,0)),\"\")","v":""},{"$f":"IF(G$471>0,(HLOOKUP(G$468,'Data base'!$B$5:$AIN$11,$J477,0)),\"\")","v":""},{"$f":"IF(H$471>0,(HLOOKUP(H$468,'Data base'!$B$5:$AIN$11,$J477,0)),\"\")","v":""},{"$f":"IF(I$471>0,(HLOOKUP(I$468,'Data base'!$B$5:$AIN$11,$J477,0)),\"\")","v":""},4]
[null,"Product Toxicity Index",null,{"$f":"IF(D$471>0,(HLOOKUP(D$468,'Data base'!$B$5:$AIN$11,$J478,0)),\"\")","v":""},{"$f":"IF(E$471>0,(HLOOKUP(E$468,'Data base'!$B$5:$AIN$11,$J478,0)),\"\")","v":""},{"$f":"IF(F$471>0,(HLOOKUP(F$468,'Data base'!$B$5:$AIN$11,$J478,0)),\"\")","v":""},{"$f":"IF(G$471>0,(HLOOKUP(G$468,'Data base'!$B$5:$AIN$11,$J478,0)),\"\")","v":""},{"$f":"IF(H$471>0,(HLOOKUP(H$468,'Data base'!$B$5:$AIN$11,$J478,0)),\"\")","v":""},{"$f":"IF(I$471>0,(HLOOKUP(I$468,'Data base'!$B$5:$AIN$11,$J478,0)),\"\")","v":""},5]
[null,"Koc",null,{"$f":"IF(D$471>0,(HLOOKUP(D$468,'Data base'!$B$5:$AIN$11,$J479,0)),\"\")","v":""},{"$f":"IF(E$471>0,(HLOOKUP(E$468,'Data base'!$B$5:$AIN$11,$J479,0)),\"\")","v":""},{"$f":"IF(F$471>0,(HLOOKUP(F$468,'Data base'!$B$5:$AIN$11,$J479,0)),\"\")","v":""},{"$f":"IF(G$471>0,(HLOOKUP(G$468,'Data base'!$B$5:$AIN$11,$J479,0)),\"\")","v":""},{"$f":"IF(H$471>0,(HLOOKUP(H$468,'Data base'!$B$5:$AIN$11,$J479,0)),\"\")","v":""},{"$f":"IF(I$471>0,(HLOOKUP(I$468,'Data base'!$B$5:$AIN$11,$J479,0)),\"\")","v":""},6]
[null,"t1/2 (DT50)",null,{"$f":"IF(D$471>0,(HLOOKUP(D$468,'Data base'!$B$5:$AIN$11,$J480,0)),\"\")","v":""},{"$f":"IF(E$471>0,(HLOOKUP(E$468,'Data base'!$B$5:$AIN$11,$J480,0)),\"\")","v":""},{"$f":"IF(F$471>0,(HLOOKUP(F$468,'Data base'!$B$5:$AIN$11,$J480,0)),\"\")","v":""},{"$f":"IF(G$471>0,(HLOOKUP(G$468,'Data base'!$B$5:$AIN$11,$J480,0)),\"\")","v":""},{"$f":"IF(H$471>0,(HLOOKUP(H$468,'Data base'!$B$5:$AIN$11,$J480,0)),\"\")","v":""},{"$f":"IF(I$471>0,(HLOOKUP(I$468,'Data base'!$B$5:$AIN$11,$J480,0)),\"\")","v":""},7]
[null,"Vulnerability index GUS (IUPAC)",null,{"$f":"IF(D471=0,\"\",IF(LOG10(D480)*(4-LOG10(D479))<=0,0,IF(OR(LOG10(D480)*(4-LOG10(D479))>0,),(LOG10(D480)*(4-LOG10(D479))),IF((LOG10(D480)*(4-LOG10(D479))>0),(LOG10(D480)*(4-LOG10(D479)))))))","v":""},{"$f":"IF(E471=0,\"\",IF(LOG10(E480)*(4-LOG10(E479))<=0,0,IF(OR(LOG10(E480)*(4-LOG10(E479))>0,),(LOG10(E480)*(4-LOG10(E479))),IF((LOG10(E480)*(4-LOG10(E479))>0),(LOG10(E480)*(4-LOG10(E479)))))))","v":""},{"$f":"IF(F471=0,\"\",IF(LOG10(F480)*(4-LOG10(F479))<=0,0,IF(OR(LOG10(F480)*(4-LOG10(F479))>0,),(LOG10(F480)*(4-LOG10(F479))),IF((LOG10(F480)*(4-LOG10(F479))>0),(LOG10(F480)*(4-LOG10(F479)))))))","v":""},"","",""]
[null,"Potential contamination (1, 2 or 3)",null,{"$f":"IF(D471>0,(IF(OR(M399=0.83,M399<0.83),1,IF(OR(AND(0.83<M399,M399<=1.66)),2,IF(M399>1.66,3,\"\")))),\"\")","v":""},{"$f":"IF(E471>0,(IF(OR(Formulas!I438=0.83,Formulas!I438<0.83),1,IF(OR(AND(0.83<Formulas!I438,Formulas!I438<=1.66)),2,IF(Formulas!I438>1.66,3,\"\")))),\"\")","v":""},{"$f":"IF(F471>0,(IF(OR(Formulas!J438=0.83,Formulas!J438<0.83),1,IF(OR(AND(0.83<Formulas!J438,Formulas!J438<=1.66)),2,IF(Formulas!J438>1.66,3,\"\")))),\"\")","v":""},{"$f":"IF(G471>0,(IF(OR(Formulas!K438=0.83,Formulas!K438<0.83),1,IF(OR(AND(0.83<Formulas!K438,Formulas!K438<=1.66)),2,IF(Formulas!K438>1.66,3,\"\")))),\"\")","v":""},{"$f":"IF(H471>0,(IF(OR(Formulas!L438=0.83,Formulas!L438<0.83),1,IF(OR(AND(0.83<Formulas!L438,Formulas!L438<=1.66)),2,IF(Formulas!L438>1.66,3,\"\")))),\"\")","v":""},{"$f":"IF(I471>0,(IF(OR(Formulas!M438=0.83,Formulas!M438<0.83),1,IF(OR(AND(0.83<Formulas!M438,Formulas!M438<=1.66)),2,IF(Formulas!M438>1.66,3,\"\")))),\"\")","v":""}]
[null,"EIQ Farm worker  (<  80; 80 - 128; > 128)",null,{"$f":"IF(D$471>0,(HLOOKUP(D$468,'Data base'!$B$5:$AIN$18,$J483,0)),\"\")","v":""},{"$f":"IF(E$471>0,(HLOOKUP(E$468,'Data base'!$B$5:$AIN$18,$J483,0)),\"\")","v":""},{"$f":"IF(F$471>0,(HLOOKUP(F$468,'Data base'!$B$5:$AIN$18,$J483,0)),\"\")","v":""},{"$f":"IF(G$471>0,(HLOOKUP(G$468,'Data base'!$B$5:$AIN$18,$J483,0)),\"\")","v":""},{"$f":"IF(H$471>0,(HLOOKUP(H$468,'Data base'!$B$5:$AIN$18,$J483,0)),\"\")","v":""},{"$f":"IF(I$471>0,(HLOOKUP(I$468,'Data base'!$B$5:$AIN$18,$J483,0)),\"\")","v":""},12]
[null,"EIQ Consumer (< 20,5; 20,5 - 36,25; > 36,25)",null,{"$f":"IF(D$471>0,(HLOOKUP(D$468,'Data base'!$B$5:$AIN$18,$J484,0)),\"\")","v":""},{"$f":"IF(E$471>0,(HLOOKUP(E$468,'Data base'!$B$5:$AIN$18,$J484,0)),\"\")","v":""},{"$f":"IF(F$471>0,(HLOOKUP(F$468,'Data base'!$B$5:$AIN$18,$J484,0)),\"\")","v":""},{"$f":"IF(G$471>0,(HLOOKUP(G$468,'Data base'!$B$5:$AIN$18,$J484,0)),\"\")","v":""},{"$f":"IF(H$471>0,(HLOOKUP(H$468,'Data base'!$B$5:$AIN$18,$J484,0)),\"\")","v":""},{"$f":"IF(I$471>0,(HLOOKUP(I$468,'Data base'!$B$5:$AIN$18,$J484,0)),\"\")","v":""},13]
[null,"EIQ Ecological (< 75; 75 - 136,5; > 136,5)",null,{"$f":"IF(D$471>0,(HLOOKUP(D$468,'Data base'!$B$5:$AIN$18,$J485,0)),\"\")","v":""},{"$f":"IF(E$471>0,(HLOOKUP(E$468,'Data base'!$B$5:$AIN$18,$J485,0)),\"\")","v":""},{"$f":"IF(F$471>0,(HLOOKUP(F$468,'Data base'!$B$5:$AIN$18,$J485,0)),\"\")","v":""},{"$f":"IF(G$471>0,(HLOOKUP(G$468,'Data base'!$B$5:$AIN$18,$J485,0)),\"\")","v":""},{"$f":"IF(H$471>0,(HLOOKUP(H$468,'Data base'!$B$5:$AIN$18,$J485,0)),\"\")","v":""},{"$f":"IF(I$471>0,(HLOOKUP(I$468,'Data base'!$B$5:$AIN$18,$J485,0)),\"\")","v":""},14]
[null,"EIQ (<58,33; 58,33 - 94,46; > 94,46)",null,{"$f":"IF(D$471>0,(HLOOKUP(D$468,'Data base'!$B$5:$AIN$18,$J486,0)),\"\")","v":""},{"$f":"IF(E$471>0,(HLOOKUP(E$468,'Data base'!$B$5:$AIN$18,$J486,0)),\"\")","v":""},{"$f":"IF(F$471>0,(HLOOKUP(F$468,'Data base'!$B$5:$AIN$18,$J486,0)),\"\")","v":""},{"$f":"IF(G$471>0,(HLOOKUP(G$468,'Data base'!$B$5:$AIN$18,$J486,0)),\"\")","v":""},{"$f":"IF(H$471>0,(HLOOKUP(H$468,'Data base'!$B$5:$AIN$18,$J486,0)),\"\")","v":""},{"$f":"IF(I$471>0,(HLOOKUP(I$468,'Data base'!$B$5:$AIN$18,$J486,0)),\"\")","v":""},11]
[null,"Banned Pesticides - EU (may 2022) (X)",null,{"$f":"IF(D$471>0,(HLOOKUP(D$468,'Data base'!$B$5:$AIN$19,$J487,0)),\"\")","v":""},{"$f":"IF(E$471>0,(HLOOKUP(E$468,'Data base'!$B$5:$AIN$19,$J487,0)),\"\")","v":""},{"$f":"IF(F$471>0,(HLOOKUP(F$468,'Data base'!$B$5:$AIN$19,$J487,0)),\"\")","v":""},{"$f":"IF(G$471>0,(HLOOKUP(G$468,'Data base'!$B$5:$AIN$19,$J487,0)),\"\")","v":""},{"$f":"IF(H$471>0,(HLOOKUP(H$468,'Data base'!$B$5:$AIN$19,$J487,0)),\"\")","v":""},{"$f":"IF(I$471>0,(HLOOKUP(I$468,'Data base'!$B$5:$AIN$19,$J487,0)),\"\")","v":""},15,{"$f":"COUNTIF('2 Indicators'!D359:F359,\"x\")","v":0},{"$f":"COUNTIF(D430:L430,\"x\")","v":0},{"$f":"COUNTIF(D459:L459,\"x\")","v":0},{"$f":"COUNTIF(D487:I487,\"x\")","v":0}]
[{"$nulls":13},{"$f":"SUM(K487:N487)","v":0}]
[null,"Clay content in the soil                                                               > 60% (1); 30% - 60% (2); <30% (3)\t"]
[null,"Distance to water course (edge ​​of field)                          >1.000m (1);  300 - 1.000m (2);  <300m (3)\t"]
[null,"Soil management type: No Till system with cover crops (1); No Till System (2); Plowed soil (3)\t"]
[null,"Field Vulnerability (1, 2 or 3)\t",null,{"$f":"IF(D472>0,(IF(OR(AND(1<=Formulas!M400,Formulas!M400<=3)),1,IF(OR(AND(3<Formulas!M400,Formulas!M400<=9)),2,IF(Formulas!M400>9,3)))),\"\")","v":""},{"$f":"IF(E472>0,(IF(OR(AND(1<=Formulas!N400,Formulas!N400<=3)),1,IF(OR(AND(3<Formulas!N400,Formulas!N400<=9)),2,IF(Formulas!N400>9,3)))),\"\")","v":""},{"$f":"IF(F472>0,(IF(OR(AND(1<=Formulas!B406,Formulas!B406<=3)),1,IF(OR(AND(3<Formulas!B406,Formulas!B406<=9)),2,IF(Formulas!B406>9,3)))),\"\")","v":""},{"$f":"IF(G472>0,(IF(OR(AND(1<=Formulas!C406,Formulas!C406<=3)),1,IF(OR(AND(3<Formulas!C406,Formulas!C406<=9)),2,IF(Formulas!C406>9,3)))),\"\")","v":""},{"$f":"IF(H472>0,(IF(OR(AND(1<=Formulas!D406,Formulas!D406<=3)),1,IF(OR(AND(3<Formulas!D406,Formulas!D406<=9)),2,IF(Formulas!D406>9,3)))),\"\")","v":""},{"$f":"IF(I472>0,(IF(OR(AND(1<=Formulas!E406,Formulas!E406<=3)),1,IF(OR(AND(3<Formulas!E406,Formulas!E406<=9)),2,IF(Formulas!E406>9,3)))),\"\")","v":""}]
[]
[null,"Contamination risk (1, 2 or 3)",null,{"$f":"IF(D472>0,(IF(OR(AND(1<=Formulas!M402,Formulas!M402<=2)),1,IF(OR(AND(2<Formulas!M402,Formulas!M402<=4)),2,IF(Formulas!M402>4,3)))),\"\")","v":""},{"$f":"IF(E472>0,(IF(OR(AND(1<=Formulas!N402,Formulas!N402<=2)),1,IF(OR(AND(2<Formulas!N402,Formulas!N402<=4)),2,IF(Formulas!N402>4,3)))),\"\")","v":""},{"$f":"IF(F472>0,(IF(OR(AND(1<=Formulas!B408,Formulas!B408<=2)),1,IF(OR(AND(2<Formulas!B408,Formulas!B408<=4)),2,IF(Formulas!B408>4,3)))),\"\")","v":""},{"$f":"IF(G472>0,(IF(OR(AND(1<=Formulas!C408,Formulas!C408<=2)),1,IF(OR(AND(2<Formulas!C408,Formulas!C408<=4)),2,IF(Formulas!C408>4,3)))),\"\")","v":""},{"$f":"IF(H472>0,(IF(OR(AND(1<=Formulas!D408,Formulas!D408<=2)),1,IF(OR(AND(2<Formulas!D408,Formulas!D408<=4)),2,IF(Formulas!D408>4,3)))),\"\")","v":""},{"$f":"IF(I472>0,(IF(OR(AND(1<=Formulas!E408,Formulas!E408<=2)),1,IF(OR(AND(2<Formulas!E408,Formulas!E408<=4)),2,IF(Formulas!E408>4,3)))),\"\")","v":""}]
[]
[null,"Description of the crop\t",null,{"$f":"+'2 Indicators'!D367","v":0},{"$f":"+'2 Indicators'!E367","v":0},{"$f":"+'2 Indicators'!F367","v":0},{"$f":"'2 Indicators'!H367","v":0},{"$f":"+'2 Indicators'!H367","v":0}]
[null,"Area (ha)",null,{"$f":"+'2 Indicators'!D368","v":0},{"$f":"+'2 Indicators'!E368","v":0},{"$f":"+'2 Indicators'!F368","v":0},{"$f":"'2 Indicators'!H368","v":0},{"$f":"+'2 Indicators'!H368","v":0}]
[null,"Maximum risk identified (1 - low), (2 - medium) ou (3 - high)",null,{"$f":"+'2 Indicators'!D369","v":0},{"$f":"+'2 Indicators'!E369","v":0},{"$f":"+'2 Indicators'!F369","v":0},{"$f":"'2 Indicators'!H369","v":0},{"$f":"+'2 Indicators'!H369","v":0}]
[null,"Average risk of contamination",null,{"$f":"IF('2 Indicators'!D345>0,((Formulas!E502*'2 Indicators'!D368+Formulas!F502*'2 Indicators'!E368+Formulas!G502*'2 Indicators'!F368+Formulas!H502*'2 Indicators'!G368+Formulas!H503*'2 Indicators'!H368)/D501),\"\")","v":""},{"$f":"IF(AND('2 Indicators'!D344>0,D498=1),0.6,\"\")","v":""},{"$f":"IF(AND('2 Indicators'!D344>0,E498=1),0.6,\"\")","v":""},{"$f":"IF(AND('2 Indicators'!D344>0,F498=1),0.6,\"\")","v":""},{"$f":"IF(AND('2 Indicators'!D344>0,G498=1),0.6,\"\")","v":""}]
[null,"Anual volume of pesticides used in crops",null,{"$f":"IF('2 Indicators'!D345>0,'2 Indicators'!D346+'2 Indicators'!E346+'2 Indicators'!F346+'2 Indicators'!G346+'2 Indicators'!H346+Formulas!D416+Formulas!E416+Formulas!F416+Formulas!G416+Formulas!H416+Formulas!I416+Formulas!J416+Formulas!K416+Formulas!L416+Formulas!D445+Formulas!E445+Formulas!F445+Formulas!G445+Formulas!H445+Formulas!I445+Formulas!J445+Formulas!K445+Formulas!L445+Formulas!D473+Formulas!E473+Formulas!F473+Formulas!G473+Formulas!H473+Formulas!I473,\"\")","v":""},{"$f":"IF(AND('2 Indicators'!D344>0,D498=2),0.3,\"\")","v":""},{"$f":"IF(AND('2 Indicators'!D344>0,E498=2),0.3,\"\")","v":""},{"$f":"IF(AND('2 Indicators'!D344>0,F498=2),0.3,\"\")","v":""},{"$f":"IF(AND('2 Indicators'!D344>0,G498=2),0.3,\"\")","v":""}]
[null,"Total crop area (including rotations)",null,{"$f":"IF('2 Indicators'!D368>0,(SUM('2 Indicators'!D368:H368)),\"\")","v":""},{"$f":"IF(AND('2 Indicators'!D344>0,D498=3),0.1,\"\")","v":""},{"$f":"IF(AND('2 Indicators'!D344>0,E498=3),0.1,\"\")","v":""},{"$f":"IF(AND('2 Indicators'!D344>0,F498=3),0.1,\"\")","v":""},{"$f":"IF(AND('2 Indicators'!D344>0,G498=3),0.1,\"\")","v":""}]
[null,"Total volume / area identified in the crops",null,{"$f":"IF('2 Indicators'!D345>0,(D500/D501),\"\")","v":""},{"$f":"SUM(E499:E501)","v":0},{"$f":"SUM(F499:F501)","v":0},{"$f":"SUM(G499:G501)","v":0},{"$f":"SUM(H499:H501)","v":0}]
[null,"Total volume / area with agricultural use",null,{"$f":"IF('2 Indicators'!D345>0,D500/('1 Survey'!D84+'1 Survey'!D85+'1 Survey'!D86+'1 Survey'!D87),\"\")","v":""},{"$f":"IF(AND('2 Indicators'!D344>0,H498=1),0.6,\"\")","v":""},{"$f":"IF(AND('2 Indicators'!D344>0,H498=2),0.3,\"\")","v":""},{"$f":"IF(AND('2 Indicators'!D344>0,H498=2),0.3,\"\")","v":""},{"$f":"SUM(E503:G503)","v":0}]
[null,{"$f":"IF(AND('2 Indicators'!D344>0,'2 Indicators'!D369=1),0.6,\"\")","v":""},{"$f":"IF(AND('2 Indicators'!D344>0,'2 Indicators'!E369=1),0.6,\"\")","v":""},{"$f":"IF(AND('2 Indicators'!D344>0,'2 Indicators'!F369=1),0.6,\"\")","v":""},{"$f":"IF(AND('2 Indicators'!D344>0,'2 Indicators'!G369=1),0.6,\"\")","v":""}]
[null,{"$f":"IF(AND('2 Indicators'!D344>0,'2 Indicators'!D369=3),0.1,\"\")","v":""},{"$f":"IF(AND('2 Indicators'!D344>0,'2 Indicators'!E369=3),0.1,\"\")","v":""},{"$f":"IF(AND('2 Indicators'!D344>0,'2 Indicators'!F369=3),0.1,\"\")","v":""},{"$f":"IF(AND('2 Indicators'!D344>0,'2 Indicators'!G369=3),0.1,\"\")","v":""}]
[]
[null,"Weighting factor",{"$nulls":3},"Fórmulas"]
[null,{"$f":"+'2 Indicators'!B374:D374","v":"13.4 Number of people handling pesticides\t\t"},{"v":1,"d":"1.0"},null,null,"Formula: 0.7, meets all the rules, according to current environmental legislation (EPI, storage and return of package)"]
[null,{"$f":"+'2 Indicators'!B375:D375","v":"13.5 Number of people using properly individual protective equipment \t\t"},{"v":1,"d":"1.0"}]
[null,{"$f":"+'2 Indicators'!B377:D377","v":"13.6 Proper storage of pesticides\t\t"},{"v":1,"d":"1.0"},null,null,{"$f":"IF('2 Indicators'!E374>0,('2 Indicators'!E375/'2 Indicators'!E374),0.7)","v":{"v":0.7,"d":"0.70"}},{"$f":"IF('2 Indicators'!E374>0,(H510+H511+F510)/3*0.7,0.7)","v":{"v":0.7,"d":"0.70"}},{"$f":"IF('2 Indicators'!E377=\"Yes\",1,0)","v":0}]
[null,{"$f":"+'2 Indicators'!B378:D378","v":"13.7 Return of pesticide packaging"},{"v":1,"d":"1.0"},{"$nulls":4},{"$f":"IF('2 Indicators'!E378=\"Yes\",1,0)","v":0}]
[]
[]
[]
[14,"Weighting factor",null,null,"Formulas",{"$nulls":6},"Units X"]
[null,"High",{"v":1,"d":"1.0"},null,{"$f":"'2 Indicators'!D388/Formulas!J520","v":{"$error":"#DIV/0!"}},{"$f":"'2 Indicators'!E388/Formulas!J520","v":{"$error":"#DIV/0!"}},{"$f":"'2 Indicators'!F388/Formulas!J520","v":{"$error":"#DIV/0!"}},{"$f":"'2 Indicators'!G388/Formulas!J520","v":{"$error":"#DIV/0!"}},null,{"$f":"Formulas!E516+Formulas!F516+Formulas!G516+Formulas!H516","v":{"$error":"#DIV/0!"}},null,"Sufficient"]
[null,"Moderate",0.6,null,{"$f":"'2 Indicators'!D389/Formulas!J520","v":{"$error":"#DIV/0!"}},{"$f":"'2 Indicators'!E389/Formulas!J520","v":{"$error":"#DIV/0!"}},{"$f":"'2 Indicators'!F389/Formulas!J520","v":{"$error":"#DIV/0!"}},{"$f":"'2 Indicators'!G389/Formulas!J520","v":{"$error":"#DIV/0!"}},null,{"$f":"Formulas!E517+Formulas!F517+Formulas!G517+Formulas!H517","v":{"$error":"#DIV/0!"}},null,"Insufficient"]
[null,"Incipient",0.3,null,{"$f":"'2 Indicators'!D390/Formulas!J520","v":{"$error":"#DIV/0!"}},{"$f":"'2 Indicators'!E390/Formulas!J520","v":{"$error":"#DIV/0!"}},{"$f":"'2 Indicators'!F390/Formulas!J520","v":{"$error":"#DIV/0!"}},{"$f":"'2 Indicators'!G390/Formulas!J520","v":{"$error":"#DIV/0!"}},null,{"$f":"Formulas!E518+Formulas!F518+Formulas!G518+Formulas!H518","v":{"$error":"#DIV/0!"}},null,"Critical situation"]
[null,"Critical situation",0.1,null,{"$f":"'2 Indicators'!D391/Formulas!J520","v":{"$error":"#DIV/0!"}},{"$f":"'2 Indicators'!E391/Formulas!J520","v":{"$error":"#DIV/0!"}},{"$f":"'2 Indicators'!F391/Formulas!J520","v":{"$error":"#DIV/0!"}},{"$f":"'2 Indicators'!G391/Formulas!J520","v":{"$error":"#DIV/0!"}},null,{"$f":"Formulas!E519+Formulas!F519+Formulas!G519+Formulas!H519","v":{"$error":"#DIV/0!"}}]
[{"$nulls":4},"Total area of the farm (ha) =>",{"$nulls":3},{"$f":"+'1 Survey'!I93","v":0},{"$f":"'2 Indicators'!D388+'2 Indicators'!D389+'2 Indicators'!D390+'2 Indicators'!D391+'2 Indicators'!E388+'2 Indicators'!E389+'2 Indicators'!E390+'2 Indicators'!E391+'2 Indicators'!F388+'2 Indicators'!F389+'2 Indicators'!F390+'2 Indicators'!F391+'2 Indicators'!G388+'2 Indicators'!G389+'2 Indicators'!G390+'2 Indicators'!G391","v":{"v":0,"d":"0.0"}}]
[]
[null,"Weighting",{"$nulls":5},{"$f":"IF('2 Indicators'!D395=\"Sufficient\",Formulas!B523,0)","v":0}]
[null,{"$f":"+'2 Indicators'!E395","v":{"v":1,"d":"1.0"}},null,null,{"$f":"(Formulas!J516*Formulas!C516)+(J517*C517)+(Formulas!J518*Formulas!C518)+(Formulas!J519*Formulas!C519)","v":{"$error":"#DIV/0!"}},{"$f":"SUM(H522:H524)","v":{"v":0,"d":"0.00"}},null,{"$f":"IF('2 Indicators'!D395=\"Insufficient\",Formulas!B524,0)","v":0}]
[null,{"$f":"+'2 Indicators'!E396","v":0.4},{"$nulls":5},{"$f":"IF('2 Indicators'!D395=\"Critical situation\",Formulas!B525,0)","v":0}]
[null,{"$f":"+'2 Indicators'!E397","v":0.1}]
[]
[15,"Weighting matrix",null,null,15.1,"Formulas"]
[null,"High",{"v":1,"d":"1.0"},null,{"$f":"'2 Indicators'!D404/Formulas!M532","v":{"$error":"#DIV/0!"}},{"$f":"'2 Indicators'!E404/Formulas!M532","v":{"$error":"#DIV/0!"}},{"$f":"'2 Indicators'!F404/Formulas!M532","v":{"$error":"#DIV/0!"}},{"$f":"'2 Indicators'!G404/Formulas!M532","v":{"$error":"#DIV/0!"}},{"$nulls":4},{"$f":"Formulas!E528+Formulas!F528+Formulas!G528+Formulas!H528","v":{"$error":"#DIV/0!"}}]
[null,"Moderate",0.6,null,{"$f":"'2 Indicators'!D405/Formulas!M532","v":{"$error":"#DIV/0!"}},{"$f":"'2 Indicators'!E405/Formulas!M532","v":{"$error":"#DIV/0!"}},{"$f":"'2 Indicators'!F405/Formulas!M532","v":{"$error":"#DIV/0!"}},{"$f":"'2 Indicators'!G405/Formulas!M532","v":{"$error":"#DIV/0!"}},{"$nulls":4},{"$f":"Formulas!E529+Formulas!F529+Formulas!G529+Formulas!H529","v":{"$error":"#DIV/0!"}}]
[null,"Incipient",0.3,null,{"$f":"'2 Indicators'!D406/Formulas!M532","v":{"$error":"#DIV/0!"}},{"$f":"'2 Indicators'!E406/Formulas!M532","v":{"$error":"#DIV/0!"}},{"$f":"'2 Indicators'!F406/Formulas!M532","v":{"$error":"#DIV/0!"}},{"$f":"'2 Indicators'!G406/Formulas!M532","v":{"$error":"#DIV/0!"}},{"$nulls":4},{"$f":"Formulas!E530+Formulas!F530+Formulas!G530+Formulas!H530","v":{"$error":"#DIV/0!"}}]
[null,"Critical situation",0.1,null,{"$f":"'2 Indicators'!D407/Formulas!M532","v":{"$error":"#DIV/0!"}},{"$f":"'2 Indicators'!E407/Formulas!M532","v":{"$error":"#DIV/0!"}},{"$f":"'2 Indicators'!F407/Formulas!M532","v":{"$error":"#DIV/0!"}},{"$f":"'2 Indicators'!G407/Formulas!M532","v":{"$error":"#DIV/0!"}},{"$nulls":4},{"$f":"Formulas!E531+Formulas!F531+Formulas!G531+Formulas!H531","v":{"$error":"#DIV/0!"}}]
[{"$nulls":12},{"$f":"'2 Indicators'!D404+'2 Indicators'!D405+'2 Indicators'!D406+'2 Indicators'!D407+'2 Indicators'!E404+'2 Indicators'!E405+'2 Indicators'!E406+'2 Indicators'!E407+'2 Indicators'!F404+'2 Indicators'!F405+'2 Indicators'!F406+'2 Indicators'!F407+'2 Indicators'!G404+'2 Indicators'!G405+'2 Indicators'!G406+'2 Indicators'!G407","v":{"v":0,"d":"0.0"}}]
[null,"Weighting matrix"]
[null,0,{"v":0,"d":"0.0"}]
[null,5,0.1]
[null,10,0.2]
[null,20,0.4,{"$nulls":4},"Land use",null,"Area","% relative","pi*Loge"]
[null,40,0.6,{"$nulls":4},"Shannon-Wiener Index - productive areas and natural habitats"]
[null,60,0.7,{"$nulls":4},"Permanent crops",null,{"$f":"+'1 Survey'!D84","v":{"v":0,"d":"0.00"}},{"$f":"J539/$J$548","v":{"$error":"#DIV/0!"}},{"$f":"IF(K539>0,K539*LOG10(K539),0)","v":{"$error":"#DIV/0!"}}]
[null,70,0.8,null,15.2,"Formulas",null,"Anual crops",null,{"$f":"+'1 Survey'!D85","v":{"v":0,"d":"0.00"}},{"$error":"#DIV/0!"},{"$error":"#DIV/0!"}]
[null,80,0.9,null,"Formula =  y=a(1-exp(-bx))",null,null,"Pastures",null,{"$f":"+'1 Survey'!D86","v":{"v":0,"d":"0.00"}},{"$error":"#DIV/0!"},{"$error":"#DIV/0!"}]
[null,100,{"v":1,"d":"1.0"},null,"r2",0.9914,null,"Forestry",null,{"$f":"+'1 Survey'!D87","v":{"v":0,"d":"0.00"}},{"$error":"#DIV/0!"},{"$error":"#DIV/0!"}]
[{"$nulls":4},"a",{"v":1.168,"d":"1.1680"},null,"Fallow",null,{"$f":"+'1 Survey'!D89","v":{"v":0,"d":"0.00"}},{"$error":"#DIV/0!"},{"$error":"#DIV/0!"}]
[{"$nulls":4},"b",{"v":0.017645063,"d":"0.0176"},null,"Native vegetation 1",null,{"$f":"SUM('2 Indicators'!D423:D425)","v":{"v":0,"d":"0.00"}},{"$error":"#DIV/0!"},{"$error":"#DIV/0!"}]
[{"$nulls":4},"x"," - Σpi loge pi",null,"Native vegetation 2",null,{"$f":"SUM('2 Indicators'!E423:E425)","v":{"v":0,"d":"0.00"}},{"$error":"#DIV/0!"},{"$error":"#DIV/0!"}]
[{"$nulls":7},"Native vegetation 3",null,{"$f":"SUM('2 Indicators'!F423:F425)","v":{"v":0,"d":"0.00"}},{"$error":"#DIV/0!"},{"$error":"#DIV/0!"}]
[{"$nulls":7},"Native vegetation 4",null,{"$f":"SUM('2 Indicators'!G423:G425)","v":{"v":0,"d":"0.00"}},{"$error":"#DIV/0!"},{"$error":"#DIV/0!"}]
[{"$nulls":7},"Sum",null,{"$f":"SUM(J539:J547)","v":{"v":0,"d":"0.00"}},{"$f":"SUM(K539:K547)","v":{"$error":"#DIV/0!"}},{"$f":"-(SUM(L539:L547))","v":{"$error":"#DIV/0!"}}]
[]
[]
[{"$nulls":8},"Units XI"]
[16,"Formulas",{"$nulls":6},"Dense savanna",null,"Weighting"]
[null,"16.1 - Formulas: If the total area with native vegetation exceeds 20% of the total area of the farm, an increase of 10% in the final result.",{"$nulls":6},"Gallery forest",null,"Advanced stage",null,null,{"v":1,"d":"1.0"}]
[{"$nulls":8},"Hygrophilous field ",null,"Middle stage ",null,null,0.9]
[null,{"$f":"'2 Indicators'!D423/Formulas!E576","v":{"$error":"#DIV/0!"}},{"$f":"'2 Indicators'!E423/Formulas!E576","v":{"$error":"#DIV/0!"}},{"$f":"'2 Indicators'!F423/Formulas!E576","v":{"$error":"#DIV/0!"}},{"$f":"'2 Indicators'!G423/Formulas!E576","v":{"$error":"#DIV/0!"}},{"$f":"IF('1 Survey'!$I$91=0,\"\",Formulas!B555+Formulas!C555+Formulas!D555+Formulas!E555)","v":""},null,null,"Natural field / altitude field",null,"Early stage",null,null,0.7]
[null,{"$f":"'2 Indicators'!D424/Formulas!E576","v":{"$error":"#DIV/0!"}},{"$f":"'2 Indicators'!E424/Formulas!E576","v":{"$error":"#DIV/0!"}},{"$f":"'2 Indicators'!F424/Formulas!E576","v":{"$error":"#DIV/0!"}},{"$f":"'2 Indicators'!G424/Formulas!E576","v":{"$error":"#DIV/0!"}},{"$f":"IF('1 Survey'!$I$91=0,\"\",Formulas!B556+Formulas!C556+Formulas!D556+Formulas!E556)","v":""},null,null,"Rain forest/Deciduous wood"]
[null,{"$f":"'2 Indicators'!D425/Formulas!E576","v":{"$error":"#DIV/0!"}},{"$f":"'2 Indicators'!E425/Formulas!E576","v":{"$error":"#DIV/0!"}},{"$f":"'2 Indicators'!F425/Formulas!E576","v":{"$error":"#DIV/0!"}},{"$f":"'2 Indicators'!G425/Formulas!E576","v":{"$error":"#DIV/0!"}},{"$f":"IF('1 Survey'!$I$91=0,\"\",Formulas!B557+Formulas!C557+Formulas!D557+Formulas!E557)","v":""},null,null,"Semi arid vegetatiom"]
[null,{"$f":"IF(Formulas!E577>20%,(((Formulas!F555*Formulas!N553)+(Formulas!F556*Formulas!N554)+(Formulas!F557*Formulas!N555))*1.1),(Formulas!F555*Formulas!N553)+(Formulas!F556*Formulas!N554)+(Formulas!F557*Formulas!N555))","v":{"$error":"#DIV/0!"}},{"$f":"IF(B558>1,1,B558)","v":{"$error":"#DIV/0!"}},{"$nulls":5},"Sparse savanna, prairie",null,"Weighting"]
[null,{"$f":"'1 Survey'!I91","v":{"v":0,"d":"0.00"}},{"$nulls":6},"Typical savannah",null,"Number of fragments"]
[null,{"$f":"IF('2 Indicators'!F432=\"Yes\",(('2 Indicators'!C426+'2 Indicators'!C430)/2*1.1),(('2 Indicators'!C430+'2 Indicators'!C426)/2))","v":{"$error":"#VALUE!"}},{"$f":"IF(B560>1,1,B560)","v":{"$error":"#VALUE!"}},{"$nulls":5},"Other types",null,1,null,null,{"v":1,"d":"1.0"}]
[null,{"$f":"IF('2 Indicators'!F434=\"Yes\",Formulas!C560,Formulas!C560*0.75)","v":{"$error":"#VALUE!"}},{"$nulls":8},2,null,null,0.9]
[{"$nulls":10},3,null,null,0.8]
[null,"Native vegetation area (%)",{"$f":"B559/Formulas!I520","v":{"$error":"#DIV/0!"}},"16.2 - If the area with native vegetation < 5% of the total area, rebates 35% in the final result",{"$nulls":6},4,null,null,0.7]
[{"$nulls":10},5,null,null,0.6]
[{"$nulls":10},6,null,null,0.5]
[null,{"$f":"1.1-0.1*'2 Indicators'!F429","v":1.1},{"$f":"IF(C563<5%,B566*0.65,B566)","v":{"$error":"#DIV/0!"}},{"$f":"IF('1 Survey'!I91=0,0.1,Formulas!C566)","v":0.1}]
[null,"16.2 - Formula= 1,1 - 0,1x"]
[]
[null,"Advanced stage - 3 strata: canopy under and understory; upper canopy 1 m high with frequent occurrence of emergent trees; sub-forest less expressive than the average stage; lower density of vines and shrubs, epiphyte richness; woody creepers; DBP greater than 18 cm."]
[]
[null,"Middle stage  - incipient stratification - 2 strata: canopy and understory; trees from 5 to 12 m in height, gradual reduction of shrubs and trees; presence of vines; greater richness and abundance of epiphytes; present litter; DBP between 10 and 20 cm; predominance of trees."]
[]
[null,"Early stage - absence of defined stratification / predominance of young individuals up to 5 m, DBP 10 cm; litter thin layer."]
[]
[]
[null,"Native vegetation area  (ha)",null,null,{"$f":"'1 Survey'!I91","v":{"v":0,"d":"0.00"}}]
[null,"Native vegetation area / Farm area",null,null,{"$f":"E576/'1 Survey'!I93","v":{"$error":"#DIV/0!"}}]
[]
[]
[17,"Weighting matrix",{"$nulls":3},"Formulas"]
[null,"Suitable use + native vegetation",null,0.7,null,null,{"$f":"(((J582*Formulas!D581)+(J583*Formulas!D582))/100)","v":{"$error":"#DIV/0!"}},{"$f":"G581*('2 Indicators'!F445)","v":{"$error":"#DIV/0!"}},{"$f":"IF('2 Indicators'!F445=\"\",Formulas!G581,Formulas!H581)","v":{"$error":"#DIV/0!"}},"%"]
[null,"Inappropriate use",null,0.1,null,{"$f":"IF('1 Survey'!D97>0,Formulas!I582,0.7)","v":{"v":0.7,"d":"0.70"}},null,null,{"$f":"IF(Formulas!I581>1,1,Formulas!I581)","v":{"$error":"#DIV/0!"}},{"$f":"+'2 Indicators'!F441/'2 Indicators'!$F$443*100","v":{"$error":"#DIV/0!"}}]
[{"$nulls":9},{"$f":"+'2 Indicators'!F442/'2 Indicators'!$F$443*100","v":{"$error":"#DIV/0!"}}]
[]
[null,"Proportion of PAs in relation to total area (%)  =>",{"$nulls":4},{"$f":"('2 Indicators'!F441+'2 Indicators'!F442)/Formulas!I520","v":{"$error":"#DIV/0!"}}]
[]
[]
[null,"Weighting factor",{"$nulls":3},"Formulas"]
[null,"Surplus native vegetation",null,{"v":1,"d":"1.0"},null,null,{"$f":"IF('2 Indicators'!F453>0,L593,0)","v":{"v":0,"d":"0.00"}},{"$f":"IF('2 Indicators'!F454>0,+'2 Indicators'!F454/'2 Indicators'!D450*100,0)","v":{"v":0,"d":"0.00"}},{"$f":"IF('2 Indicators'!F455>0,+'2 Indicators'!F455/'2 Indicators'!D450*100,0)","v":{"v":0,"d":"0.00"}},null,{"$f":"'2 Indicators'!F453/'1 Survey'!D72","v":{"$error":"#DIV/0!"}},{"$f":"IF(K589>0.2,1,0)","v":{"$error":"#DIV/0!"}}]
[null,"CRA located outside the farm",null,0.7,null,null,{"$f":"IF('2 Indicators'!F456>0,+'2 Indicators'!F456/'2 Indicators'!D450*100,0)","v":{"v":0,"d":"0.00"}},{"$f":"SUM(F592:F593)","v":{"v":0.7,"d":"0.70"}},{"$nulls":3},{"$f":"IF(AND(K589>=0.1,K589<=0.2),0.67,0)","v":{"$error":"#DIV/0!"}}]
[null,"Areas of Conservation Reserve not subject to recomposition",null,0.7,null,{"$f":"IF(AND('2 Indicators'!D452=0,G592=0),0.7,G592)","v":{"v":0.7,"d":"0.70"}},{"$f":"IF('2 Indicators'!F454>0,I592,F591)","v":{"v":0.7,"d":"0.70"}},{"$f":"Formulas!C598","v":0},{"$f":"IF(Formulas!G603>20%,0,Formulas!C598)","v":{"$error":"#DIV/0!"}},null,null,{"$f":"IF(AND(K589<0.1,K589>0),0.34,0)","v":{"$error":"#DIV/0!"}}]
[null,"Areas from/to Conservation Reserve that require recomposition",null,0.1,null,{"$f":"IF(G591>1,1,G591)","v":{"v":0.7,"d":"0.70"}},{"$f":"IF('2 Indicators'!F456=0,((((H589*Formulas!D590)+(I589*Formulas!D591)+(G590*Formulas!D592))/100)+G589*0.3),(((H589*Formulas!D590)+(I589*Formulas!D591)+(G590*Formulas!D592))/100))","v":{"v":0,"d":"0.00"}},null,{"$f":"IF(AND('2 Indicators'!F455=\"\",'2 Indicators'!F456=0),0.7,Formulas!F591)","v":0.7},null,null,{"$f":"IF(K589=0,0,0)","v":{"$error":"#DIV/0!"}}]
[{"$nulls":11},{"$f":"SUM(L589:L592)","v":{"$error":"#DIV/0!"}}]
[null,"CRA",{"$nulls":3},{"$f":"+Formulas!M598","v":{"v":0,"d":"0.00"}}]
[]
[null,"CRA"]
[{"$nulls":12},{"$f":"'3 Report'!H5","v":{"v":0,"d":"0.00"}}]
[null,"CRA",{"$f":"IF('1 Survey'!E103>0,'1 Survey'!D72*'1 Survey'!E103,0)","v":{"v":0,"d":"0.00"}},{"$nulls":9},{"$f":"+M597*'1 Survey'!E103","v":0}]
[]
[{"$nulls":5},"Area (ha) ","% (farm area)"]
[null,"(crops + pastures + Forestry) ",{"$nulls":3},{"$f":"+'1 Survey'!I88","v":{"v":0,"d":"0.00"}},{"$f":"F601/'1 Survey'!$I$93","v":{"$error":"#DIV/0!"}},null,"Conservation Reserve Area (ha)  =>",null,null,{"$f":"'2 Indicators'!D450","v":{"v":0,"d":"0.00"}}]
[null,"Native vegetation",{"$nulls":3},{"$f":"+'1 Survey'!I91","v":{"v":0,"d":"0.00"}},{"$f":"F602/'1 Survey'!$I$93","v":{"$error":"#DIV/0!"}},null,"Conservation Reserve Area that requires recomposition",null,null,{"$f":"IF('1 Survey'!D74=\"Yes\",0,IF('1 Survey'!E104=0,L601-'1 Survey'!I91,0))","v":{"v":0,"d":"0.00"}}]
[null,"PPA",{"$nulls":3},{"$f":"'1 Survey'!D97","v":{"v":0,"d":"0.00"}},{"$f":"F603/'1 Survey'!$I$93","v":{"$error":"#DIV/0!"}}]
[null,"Area with vegetal suppression with obligation of recomposition of native vegetation",{"$nulls":3},{"$f":"+'1 Survey'!D98","v":{"v":0,"d":"0.00"}},{"$f":"F604/'1 Survey'!$I$93","v":{"$error":"#DIV/0!"}}]
[null,"Area with surplus native vegetation",{"$nulls":3},{"$f":"F602-L601","v":{"v":0,"d":"0.00"}},{"$f":"F605/'1 Survey'!$I$93","v":{"$error":"#DIV/0!"}}]

{"sheet":"Data base","index":12,"n_rows":47,"n_cols":1065,"rows_kept":47}
["ISA",null,"DATA BASE"]
["PESTICIDES",null,{"$f":"COUNTA(C3:IQ3)","v":249},{"$nulls":887}," "]
["Action",null,"Herbicide","Insecticide","Insecticide","Insecticide","Herbicide","Fungicide","Herbicide","Insecticide","Insecticide","Herbicide","Insecticide","Insecticide","Fungicide","Herbicide","Herbicide","Herbicide","Insecticide","Herbicide","Herbicide","Insecticide","Herbicide","Fungicide","Fungicide","Insecticide","Herbicide","Fungicide","Fungicide","Insecticide","Insecticide","Herbicide","Insecticide","Fungicide","Herbicide","Fungicide","Insecticide","Insecticide","Fungicide","Insecticide","Fungicide","Insecticide","Fungicide","Herbicide","Insecticide","Insecticide","Insecticide","Insecticide","Herbicide","Fungicide","Insecticide","Herbicide","Herbicide","Herbicide","Herbicide","Insecticide","Fungicide","Fungicide","Fungicide","Insecticide","Fungicide","Insecticide","Herbicide","Insecticide","Fungicide","Insecticide","Fungicide","Fungicide","Insecticide","Fungicide","Insecticide","Insecticide","Herbicide","Herbicide","Fungicide","Insecticide","Insecticide","Fungicide","Insecticide","Herbicide","Herbicide","Fungicide","Herbicide","Fungicide","Insecticide","Fungicide","Insecticide","Herbicide","Insecticide","Insecticide","Fungicide","Fungicide","Fungicide","Insecticide","Herbicide","Insecticide","Fungicide","Fungicide","Insecticide","Fungicide","Insecticide","Herbicide","Insecticide","Herbicide","Herbicide","Fungicide","Insecticide","Fungicide","Insecticide","Herbicide","Herbicide","Herbicide","Fungicide","Fungicide","Insecticide","Fungicide","Herbicide","Fungicide","Fungicide","Fungicide","Fungicide","Herbicide","Herbicide","Fungicide","Insecticide","Insecticide","Herbicide","Herbicide","Herbicide","Herbicide","Herbicide","Herbicide","Insecticide","Fungicide","Herbicide","Herbicide","Herbicide","Herbicide","Herbicide","Fungicide","Insecticide","Herbicide","Insecticide","Fungicide","Herbicide","Fungicide","Fungicide","Fungicide","Herbicide","Fungicide","Herbicide","Insecticide","Herbicide","Insecticide","Insecticide","Fungicide","Fungicide","Herbicide","Fungicide","Herbicide","Insecticide","Fungicide","Herbicide","Fungicide","Insecticide","Insecticide","Insecticide","Fungicide","Fungicide","Herbicide","Herbicide","Herbicide","Herbicide","Fungicide","Herbicide","Insecticide","Herbicide","Herbicide","Fungicide","Herbicide","Herbicide","Fungicide","Herbicide","Herbicide","Insecticide","Insecticide","Herbicide","Fungicide","Insecticide","Fungicide","Fungicide","Insecticide","Herbicide","Herbicide","Fungicide","Herbicide","Insecticide","Fungicide","Fungicide","Fungicide","Fungicide","Insecticide","Fungicide","Insecticide","Fungicide","Insecticide","Herbicide","Herbicide","Herbicide","Herbicide","Herbicide","Herbicide","Herbicide","Herbicide","Insecticide","Insecticide","Insecticide","Insecticide","Herbicide","Insecticide","Herbicide","Insecticide","Fungicide","Fungicide","Insecticide","Herbicide","Insecticide","Herbicide","Herbicide","Insecticide","Herbicide","Fungicide","Fungicide","Insecticide","Insecticide","Herbicide","Insecticide","Fungicide","Fungicide","Insecticide","Fungicide","Herbicide","Fungicide","Fungicide","Herbicide","Fungicide","Insecticide","Herbicide","Herbicide","Fungicide","Fungicide",{"$nulls":813},{"$f":"COUNTA(AIP3:ANW3)","v":0}]
["Substance groups",null,"Phenoxy herbicide; Phenoxy PGR; Auxin PGR","Avermectin","Organophosphate insecticide; Phosphoramidothioate insecticide","Neonicotinoid insecticide; Pyridylmethylamine neonicotinoid insecticide","Chloroacetanilide herbicide","Benzotiadiazol","Nitrophenyl ether herbicide","Pyrethroid insecticide; Pyrethroid acaricide","Pyropene insecticide; Organic heterotetracyclic compound","Chloroacetanilide herbicide","Pyrethroid insecticide","Inorganic compound","Triazolopyrimidine fungicide","Triazine herbicide","Triazolone herbicide; Amide herbicide","Pyridine herbicide; Picolinic acid herbicide","Amidine insecticide; Formamidine insecticide"," Carbamate herbicide; Sulphonamide herbicide","Triazine herbicide; Chlorotriazine herbicide","Tetranortriterpenoid limonoide insecticide from Neen seeds","Sulfonylurea herbicide; Pyridine compound; Pyrazole herbicide","Strobilurin fungicide","Acylamino acid fungicide; Anilide fungicide; Aromatic amide fungicide","Carbamate insecticide; Methylcarbamate insecticide","Benzothiazinone herbicide","Carbamate fungicide; Valinamide fungicide; Benzothiazole fungicide","Amide fungicide; Pyrolecarboxamide fungicide","Pyrethroid ester insecticide","Pyrethroid ester acaricide; Pyrethroid ester insecticide","Pyrimidinyl carboxy compound; Benzoic acid herbicide","Benzoylurea insecticide","Carboxamide fungicide; Anilide fungicide; Pyridine fungicide","Uracil herbicide","Triazole fungicide; Conazole fungicide","Unclassified IGR","Organophosphate insecticide; Organothiophosphate insecticide; Organophosphate nematicide; Organothiophosphate nematticide","Phthalimide fungicidea","Carbamate insecticide; Carbamate acaricide","Benzimidazole fungicide; Carbamate fungicide","metilcarbamato de benzofuranila","Oxathiin fungicide; Anilide fungicide"," Triazolone herbicide","hydrochloride ","Diamide insecticide; Pyridylpyrazole insecticide","Pyrrole insecticide; Pyrrole acaricide","Benzoylurea insecticide; Urea insecticide","  Sulfonylurea herbicide; Pyrimidinylsulfonylurea herbicide","Chloronitrile fungicide; Nitrile fungicide","Organophosphate insecticide; Organophosphate acaricide; Organothiophosphate insecticide; Organothiophosphate acaricide","Cyclohexanedione herbicide; Cyclohexene oxime herbicide","Aryloxyphenoxypropionate herbicide","Oxazole fungicide","Sulfonanilide herbicide; Triazolopyrimidine herbicide","Neonicotinoid insecticide; Thiazole insecticide; Nitroguanidine insecticide","Inorganic compound","Inorganic compound","Inorganic compound","Diamide insecticide; Pyridylpyrazole insecticide","Imidazole fungicide; Sulfonamide fungicide","Diamide insecticide; Pyridylpyrazole insecticide","Sulfonylurea herbicide; Pyrimidinylulfonurea herbicide","Bridged diphenyl insecticide","Cyanoacetamide oxime fungicide; Urea fungicide; Nitrile fungicide","Pyrethroid Insecticide; Pyrethroid acaricide; Pyrethroid ester insecticide; Pyrethroid ester acaricide","Conazole fungicide; Triazole fungicide","Anilinopyrimidine fungicide; Aminopyrimidine fungicide","Triazine insecticide; Triazine acaricide","Dithiocarbamate insecticide; Carbamate insecticide; Dithiocarbamate herbicide; Carbamate herbicide; Dithiocarbamate fungicide; Carbamate fungicide; Fumigant pesticide","Pyrethroid insecticide; Pyrethroid ester insecticide","Thiourea insecticide; Urea insecticide; Thiourea acaricide; Urea acaricide","Benzoic acid herbicide; Benzoic acid PGR","Sulfonanilide herbicide; Triazolopyrimidine herbicide","Conazole fungicide","Benzoylphenylurea herbicide; Benzoylurea herbicde; Urea herbicide","Organophosphate insecticide; Organophosphate acaricide; Organothiophosphate insecticide; Organothiophosphate acaricide","Morpholine fungicide","Neonicotinoid insecticide; Nitroguanidine neonicotinoid insecticide","Quarternary ammonium herbicide","Quarternary ammonium herbicide","Quinone fungicide","Phenylurea herbicide; Urea herbicide","Guanidine fungicide; Aliphatic nitrogen fungicide","avermectine","Triazole fungicide; Conazole fungicide","Pyrethroid insecticide","Sulfonylurea herbicide; Pyrimidinylsulonyurea herbicide; Urea herbicide","Pyrethroid insecticide; Pyrethrid ether insecticide","difenil oxazoline","Thiadiazole fungicide","Oxazole fungicide; Dicarboximide fungicide","Imidazole fungicide","Organophosphate insecticide; Organothiophosphate insecticide; Phenyl organothiophosphate insecticide","Aryloxyphenoxypropionat herbicide","Pyrethroid insecticide","Morpholine fungicide","Pyrazolium fungicide","Pyrazolium insecticide; Pyrazolium acaricide","Organometal fungicide; Organotin fungicide","Phenylpyrazole insecticide; Phenylpyrazole acaricide; Pyrazole insecticide; Prazole acaricide","Sulfonylurea herbicide; Pyrimidinylsulfonlurea herbicide","Pyridine insecticide","Pyridine herbicide; Picolinic acid herbicide","Aryloxyphenoxypropionate herbicide","Pyridine fungicide; Aminopyridine fungicide; Chloropyridine fungicide","Phthalamide insecticide; Organofluoride insecticide","Phenylpyrrole fungicide; Pyrrole fungicide","Benzoylurea insecticide; Benzoylurea acaricide; Urea insecticide; Urea acaricide","Sulfonanilide herbicide; Triazolopyrimidine herbicide","Dicarboximide herbicide","Flumioxazin herbicide","Benzamide fungicide; Pyridine fungicide","Benzamide fungicide; Pyridine fungicide; Unclassified nematicide","Organofluoride insecticide; Monochloropyridine insecticide; butenolide Insecticide","Triazole fungicide; Conazole fungicide","Pyridine herbicide","Benzanilide fungicide","Triazole fungicide; Conazole fungicide","Pyrazole fungicide; Anilide fungicide; Carboxamide fungicide; Pyrazolecarboximide fungicide","Phthalimide fungicide","Organochloride fungicide; Organofluoride fungicide; Amide fungicide; Nitrophenol etther fungicide","Pyrimidinylsulfonylurea herbicide; Sulfonylurea herbicide","Organophosphate fungicide","Organophosphate insecticide; Organophosphate nematicide; Organothiophosphate insecticide; Organothiophosphate nematicide","Pyrethroid insecticide; Pyrethroid ester insecticide","Organophosphate herbicide","Organophosphate herbicide; Phosphonoglycine herbicide","Picolinic acid herbicide; Pyridine herbicide","Pyrazole herbicide; Sulfonylurea herbicide; Urea herbicide; Pyrimidinylsulfonylurea herbicide","Aryloxyphenoxypropionate herbicide","Triazinone herbicide","Carboxamide acaricide; Carboximide insecticide; Thiazolidine acaricide; Thiazolidine insecticide","Imidazole fungicide; Conazole fungicide","Imidazolinone herbicide","Imidazolinone herbicide","Imidazolinone herbicide","Imidazolinone herbicide","Imidazolinone herbicide","Triazole fungicide; Conazole fungicide","Neonicotinoid insecticide; Guanidine insecticide","Fluoroalkyltriazine herbicide","Oxadiazine insecticide","Pyrazolecarboxamide fungicide; Pyrazole fungicide; Carboximide fungicide","Triazinylsulfonylurea herbicide; Sulfonylurea herbicide","Triazole fungicide","Dicarboximide fungicide; Dichlorophenyl fungicide; Dichlorophenyl dicarboximide fungicide","Amide fungicide; Thiophene fungicide","Isoxazol herbicide","Kasugamycin hydrochloride hydrate","Nitrophenyl ether herbicide","Pyrethroid insecticide; Pyrethroid ester insecticide","Urea herbicide; Phenylurea herbicide","Benzoylurea insecticide; Benzoylphenylurea insecticide","Organophosphate insectide; Organophosphate acaricide; Organothiophosphate insecticide; Organothiophosphate acaricide","Carbamate fungicide; Dithiocarbamate fungicide; Organometal fungicide; Organozinc fungicide","Amide fungicide","Aryloxyalkanoic acid herbicide; Phenoxyacetic herbicide","Conazole fungicide; Triazole fungicide","Aroylcyclohexanedione herbicide","Semicarbazone compound; Unclassified pesticide","Anilide fungicide; Acylamino acid fungicide","Carbamate fungicide; Dithiocarbamate fungicide; Carbamate herbicide; Dithiocarbamate herbicide; Carbamate nematicide; Dithiocarbamate nematicide","Triazole fungicide; Conazole fungicide","Organophosphate insecticide; Organothiophosphate inseticide; Organophosphate acaricide; Organothiophosphate acaricide","Carbamate insecticide; Oxime carbamate insecticide; Carbamate acariicide; Oxime carbamate acaricide","Carbohydrazide compound; Monomethoxybenzene compound","Organobromine","Carbamate fungicide; Dithiocarbamate fungicide; Organometal compound; Organozinc fungicide","Chloroacetanilide herbicide","Triazinone herbicide","Sulfonylurea Herbicide; Triazinylsulfonylurea herbicide","organoarsenic herbicide","Triazole fungicide; Conazole fungicide","Sulfonylurea herbicide; Pyrimidinylsulfonylurea herbicide","Benzoylurea insecticide","Pyrimidinylsulfonylurea herbicide; Sulfonylurea herbicide","Oxadiazolone herbicide","Oxazole fungicide; Pyrazole fungicide; Thiazole fungicide","Nitrophenol ether herbicide; Diphenyl ether herbicide","Quarternary ammonium herbicide","Phenylurea fungicide; Urea fungicide","Dinitroaniline herbicide","Sulfonamide herbicide;Trazoloprimidine herbicide","Pyrethroid insecticide; Pyrethroid ester insecticide","Organophosphate insecticide; Organophosphate acaricide; Organothiophosphate insecticide; Organothiophosphate acaricide; Phthalimide insecticide; Phthalimide acaricide","Pyridine herbicide; Picolinic acid herbicide","Strobilurin fungicide; Methoxyacrylate strobiluron fungicide","Organophosphate insecticide; Organophosphate acaricide; Organothiophosphate insecticide; Organothiophosphate acaricide; Pyrimidine insecticide; Pyrimidine acaricide","Inorganic compound","Dicarboximide fungicide; Dichlorophenyl dicarboximide fungicide","Organophosphate insecticide; Organophosphate acaricide; Organothiophosphate insecticide; Organothiophosphate acaricide","Cyclohexadione herbicide; Cyclohexene herbicide","Triazine herbicide; Methylthiotriazine herbicide","Carbamate fungicide","Anilide herbicide","Sulfite ester insecticide; Sulfite ester acaricide","Triazole fungicide; Conazole fungicide","Carbamate fungicide; Dithiocarbamate fungicide; Organometal fungicide; Organozinc fungicide","Conazole fungicide","Carboxamide fungicide; Pyrazole fungicide; Pyrazolecarboximide fungicide","Pyridine insecticide; Azomethine insecticide","Strobilurin fungicide; Carbanilate fungicide; Phenylpyrazole fungicide","Pyridazinone insecticide; Pyridazinone acaricide","Anilinopyrimidine fungicide","Juvenile hormone mimic insecticide","Pyrimidinyloxybenzoic acid herbicide","Oxazole herbicide; Pyrzole herbicide","Quinolinecarboxylic acid herbicide","Aryloxyphenoxypropionate herbicide","Aryloxyphenoxypropionate herbicide","pyrimidinadione","Cyclohexene herbicide; Cyclohexene oxime herbicide","Triazine herbicide; Chlorotriazine herbicide","Spinosyn insecticide","Spinosyn insecticide","Tetronic acid acaricide; Tetronic acid insecticide","Tetronic acid insecticide; Tetronic acid acaricide","Anilide herbicide; Triazolone herbicide","Sulfonamide insecticide; Organofluoride insecticide","Sulfonylurea herbicide; Pyrimidinylsulfonylurea herbicide","Sulfoximine insecticide","Inorganic compound","Triazole fungicide; Conazole fungicide","Carbohydrazide compound","Urea herbicide; Thiadiazolylurea herbicide","Benzoylphenylurea insecticide; Phenylurea insecticide; Urea insecticide","Aroylcyclohexanedione herbicide","Cyclohexene oxime herbicide","Organophosphate insecticide; Organophosphate nematicide; Organothiophosphate insecticide; Organothiophosphate nematicide","Triazine herbicide; Methoxytriazine herbicide","Triazole fungicide; Conazole fungicide","Benzimidazole fungicide; Thiazole fungicide","Neonicotinoid insecticide; Pyridylmethylamine neonicotinoid insecticide; Thiazolidine insecticide","Neonicotinoid insecticide; Nitroguanidine insecticids; Thiazole insecticide; Nitroguanidine neonicotinoid insecticide","Triazolone herbicide","Carbamate insecticide; Oxime carbamate insecticide","Carbamate fungicide","Carbamate fungicide; Dithiocarbamate fungicide","Pyrazole insecticide; Carboxamide insecticide; Pyrazolecarboxamide fungicide","Triazole fungicide; Conazole fungicide","Pyridine herbicide","benzotiazol","Strobilurin fungicide; Methoxyiminoacetate strobilurin fungicide","Sulfonylurea herbicide; Pyrimidinylsulfonylurea herbicide","Conazole fungicide","Benzoylurea insecticide; Urea insecticide","Dinitroaniline herbicide"," Dioxociclohexan carboxilic acid herbicide","Triazole fungicide; Conazole fungicide","Benzamide fungicide"]
["PRODUCT",null,"2,4 D ","Abamectin","Acephate","Acetamiprid","Acetochlor","acibenzolar S-methyl","Acifluorfen-sodium ","Acrinathrin","Afidopyropen","Alachlor","Alpha-cypermethrin","Aluminium phosphide","Ametoctradin","Ametryn","Amicarbazone","Aminopyralid","Amitraz","Asulam ","Atrazine","Azadirachtin","Azimsulfuron","Azoxystrobin","Benalaxyl-M","Benfuracarb","Bentazone","Benthiavalicarb-isopropyl","Benzovindiflupyr","Beta-cyfluthrin","Bifenthrin","Bispyribac","Bistrifluron","Boscalid","Bromacil ","Bromuconazole","Buprofezin","Cadusafos ","Captan ","Carbaryl","Carbendazim","Carbosulfan","Carboxin","Carfentrazone-ethyl","cartap-hydrochloride","Chlorantraniliprole ","Chlorfenapyr","Chlorfluazuron ","Chlorimuron-ethyl ","Chlorothalonil","Chlorpyrifos ","Clethodim","Clodinafop propargyl","Clomazone","Cloransulam-methyl ","Clothianidin","Copper (II) hydroxide","Copper oxychloride","Copper sulphate","Cyantraniliprole","Cyazofamid","Cyclaniliprole","Cyclosulfamuron","Cyflumetofen ","Cymoxanil","Cypermethrin","Cyproconazole","Cyprodinil ","Cyromazine","Dazomet ","Deltamethrin","Diafenthiuron","Dicamba ","Diclosulam","Difenoconazole ","Diflubenzuron","Dimethoate","Dimethomorph","Dinotefuran","Diquat","Diquat dibromide","Dithianon","Diuron","Dodine","Emamectin benzoate","Epoxiconazole","Esfenvalerate","Ethoxysulfuron","Etofenprox","Etoxazole","Etridiazole","Famoxadone","Fenamidone","Fenitrothion ","Fenoxaprop-P-ethyl","Fenpropathrin","Fenpropimorph","Fenpyrazamine","Fenpyroximate","Fentin hydroxide","Fipronil","Flazasulfuron","Flonicamid","Florpyrauxifen-benzyl","Fluazifop-P-butyl","Fluazinam ","Flubendiamide","Fludioxonil","Flufenoxuron","Flumetsulam","Flumiclorac-pentyl ","Flumioxazin","Fluopicolide","Fluopyram","Flupyradifurone","Fluquinconazole","Fluroxypyr","Flutolanil","Flutriafol ","Fluxapyroxad","Folpet","Fomesafen","Foramsulfuron ","Fosetyl","Fosthiazate","Gamma-cyhalothrin","Glufosinate-ammonium","Glyphosate ","Halauxifen-methyl","Halosulfuron-methyl","Haloxyfop-P-methyl","Hexazinone","Hexythiazox","Imazalil","Imazamox ","Imazapic ","Imazapyr","Imazaquin","Imazethapyr","Imibenconazole","Imidacloprid","Indaziflam","Indoxacarb","Inpyrfluxam","Iodosulfuron-methyl-sodium ","Ipconazole","Iprodione","Isofetamid","Isoxaflutole","Kasugamycin","Lactofen","Lambda-cyhalothrin","Linuron","Lufenuron","Malathion","Mancozeb","Mandipropamid ","MCPA ","Mefentrifluconazole","Mesotrione","Metaflumizone","Metalaxyl-M ","Metam-sodium","Metconazole","Methidathion","Methomyl ","Methoxyfenozide ","methyl bromide","Metiram","Metolachlor","Metribuzin","Metsulfuron-methyl","MSMA ","Myclobutanil","Nicosulfuron","Novaluron","Orthosulfamuron","Oxadiazon","Oxathiapiprolin","Oxyfluorfen","Paraquat dichloride","Pencycuron","Pendimethalin ","Penoxsulam","Permethrin","Phosmet","Picloram","Picoxystrobin","Pirimiphos-methyl ","Potassium bicarbonate","Procymidone","Profenofos","Profoxydim ","Prometryn","Propamocarb hydrochloride","Propanil","Propargite","Propiconazole","Propineb","Prothioconazole","Pydiflumetofen","Pymetrozine","Pyraclostrobin ","Pyridaben","Pyrimethanil","Pyriproxyfen ","Pyrithiobac-sodium","Pyroxasulfone ","Quinclorac","Quizalofop-P-ethyl","Quizalofop-P-tefuryl ","Saflufenacil","Sethoxydim","Simazine ","Spinetoram ","Spinosad","Spirodiclofen","Spiromesifen ","Sulfentrazone","Sulfluramid","Sulfometuron-methyl ","Sulfoxaflor","Sulphur","Tebuconazole ","Tebufenozide","Tebuthiuron","Teflubenzuron","Tembotrione","Tepraloxidim ","Terbufos ","Terbuthylazine","Tetraconazole","Thiabendazole","Thiacloprid ","Thiamethoxam","Thiencarbazone","Thiodicarb","Thiophanate-methyl ","Thiram","Tolfenpyrad","Triadimenol ","Triclopyr-butotyl","Tricyclazole ","Trifloxystrobin ","Trifloxysulfuron","Triflumizole ","Triflumuron","Trifluralin ","trinexapac-ethyl","Triticonazole","Zoxamide"]
["14.5 - Product's active principle ",null," 2,4 D","Abamectin","Acephate","Acetamiprid","Acetochlor","acibenzolar S-methyl","Acifluorfen-sodium ","Acrinathrin","Afidopyropen","Alachlor","Alpha-cypermethrin","Aluminium phosphide","Ametoctradin","Ametryn","Amicarbazone","Aminopyralid","Amitraz","Asulam ","Atrazine","Azadirachtin","Azimsulfuron","Azoxystrobin","Benalaxyl-M","Benfuracarb","Bentazone","Benthiavalicarb-isopropyl","Benzovindiflupyr","Beta-cyfluthrin","Bifenthrin","Bispyribac","Bistrifluron","Boscalid","Bromacil ","Bromuconazole","Buprofezin","Cadusafos ","Captan ","Carbaryl","Carbendazim","Carbosulfan","Carboxin","Carfentrazone-ethyl","cartap-hydrochloride","Chlorantraniliprole ","Chlorfenapyr","Chlorfluazuron ","Chlorimuron-ethyl ","Chlorothalonil","Chlorpyrifos ","Clethodim","Clodinafop propargyl","Clomazone","Cloransulam-methyl ","Clothianidin","Copper (II) hydroxide","Copper oxychloride","Copper sulphate","Cyantraniliprole","Cyazofamid","Cyclaniliprole","Cyclosulfamuron","Cyflumetofen ","Cymoxanil","Cypermethrin","Cyproconazole","Cyprodinil ","Cyromazine","Dazomet ","Deltamethrin","Diafenthiuron","Dicamba ","Diclosulam","Difenoconazole ","Diflubenzuron","Dimethoate","Dimethomorph","Dinotefuran","Diquat","Diquat dibromide","Dithianon","Diuron","Dodine","Emamectin benzoate","Epoxiconazole","Esfenvalerate","Ethoxysulfuron","Etofenprox","Etoxazole","Etridiazole","Famoxadone","Fenamidone","Fenitrothion ","Fenoxaprop-P-ethyl","Fenpropathrin","Fenpropimorph","Fenpyrazamine","Fenpyroximate","Fentin hydroxide","Fipronil","Flazasulfuron","Flonicamid","Florpyrauxifen-benzyl","Fluazifop-P-butyl","Fluazinam ","Flubendiamide","Fludioxonil","Flufenoxuron","Flumetsulam","Flumiclorac-pentyl ","Flumioxazin","Fluopicolide","Fluopyram","Flupyradifurone","Fluquinconazole","Fluroxypyr","Flutolanil","Flutriafol ","Fluxapyroxad","Folpet","Fomesafen","Foramsulfuron ","Fosetyl","Fosthiazate","Gamma-cyhalothrin","Glufosinate-ammonium","Glyphosate ","Halauxifen-methyl","Halosulfuron-methyl","Haloxyfop-P-methyl","Hexazinone","Hexythiazox","Imazalil","Imazamox ","Imazapic ","Imazapyr","Imazaquin","Imazethapyr","Imibenconazole","Imidacloprid","Indaziflam","Indoxacarb","Inpyrfluxam","Iodosulfuron-methyl-sodium ","Ipconazole","Iprodione","Isofetamid","Isoxaflutole","Kasugamycin","Lactofen","Lambda-cyhalothrin","Linuron","Lufenuron","Malathion","Mancozeb","Mandipropamid ","MCPA ","Mefentrifluconazole","Mesotrione","Metaflumizone","Metalaxyl-M ","Metam-sodium","Metconazole","Methidathion","Methomyl ","Methoxyfenozide ","methyl bromide","Metiram","Metolachlor","Metribuzin","Metsulfuron-methyl","MSMA ","Myclobutanil","Nicosulfuron","Novaluron","Orthosulfamuron","Oxadiazon","Oxathiapiprolin","Oxyfluorfen","Paraquat dichloride","Pencycuron","Pendimethalin ","Penoxsulam","Permethrin","Phosmet","Picloram","Picoxystrobin","Pirimiphos-methyl ","Potassium bicarbonate","Procymidone","Profenofos","Profoxydim ","Prometryn","Propamocarb hydrochloride","Propanil","Propargite","Propiconazole","Propineb","Prothioconazole","Pydiflumetofen","Pymetrozine","Pyraclostrobin ","Pyridaben","Pyrimethanil","Pyriproxyfen ","Pyrithiobac-sodium","Pyroxasulfone ","Quinclorac","Quizalofop-P-ethyl","Quizalofop-P-tefuryl ","Saflufenacil","Sethoxydim","Simazine ","Spinetoram ","Spinosad","Spirodiclofen","Spiromesifen ","Sulfentrazone","Sulfluramid","Sulfometuron-methyl ","Sulfoxaflor","Sulphur","Tebuconazole ","Tebufenozide","Tebuthiuron","Teflubenzuron","Tembotrione","Tepraloxidim ","Terbufos ","Terbuthylazine","Tetraconazole","Thiabendazole","Thiacloprid ","Thiamethoxam","Thiencarbazone","Thiodicarb","Thiophanate-methyl ","Thiram","Tolfenpyrad","Triadimenol ","Triclopyr-butotyl","Tricyclazole ","Trifloxystrobin ","Trifloxysulfuron","Triflumizole ","Triflumuron","Trifluralin ","trinexapac-ethyl","Triticonazole","Zoxamide"]
["14.6 - Toxicity to fish - 96h LC50 (mg l-1)",null,63.4,0.0036,0.63,100,0.36,null,17,0.0061,18.3,1.8,1.8000000000000002E-3,0.0097,0.065,5,120,100,0.74,91.3,4.5,null,154,0.47,3.75,0.038,100,10,0.0035,6.8e-05,0.00026,95,0.5,2.7,36,1.7,0.33,0.13,0.186,2.6,0.19,0.015,2.3,1.6,1.6,12,0.007,300,8.4,0.038,0.0013,25,0.21,14.4,86,104.2,0.017,43.8,13.2,12.6,0.56,0.195,7.7,0.63,29,2.8E-3,19,2.41,100,0.3,0.00026,0.007,98.85,110,1.1,0.13,30.2,6.1,100,21,67,0.07,6.7,0.57,null,3.14,1E-4,80,0.0027,null,2.4,0.011,0.74,1.3,0.19,2.3E-3,2.3,5.2,0.00105,0.05,0.248,22,100,100,1.41,0.055,0.06,0.23,0.0049,300,1.1,2.3,0.36,0.98,70.5,1.9,14.3,5.4,33,546,0.233,170,100,122,114,3.5E-4,710,38,1.33,118,0.088,320,3.2,1.48,122,100,100,100,340,0.0085,211,0.42,0.17,null,100,1.5,36.2,2.27,null,null,0.1,0.00021,3.15,29,0.018,0.074,2.9,100,0.532,120,0.228,100,0.175,2.1,0.01,0.63,4.2,null,0.336,1.23,74.6,150,null,2,65.7,1,100,1.2,0.69,0.25,19,0.3,"0,196",100,0.0125,0.24,8.8,0.075,0.404,1200,7.22,0.08,15,5.5,99,5.4,0.043,2.6,0.33,1.83,0.18,100,0.006,0.0007,10.56,0.27,930,2.2,100,0.21,0.23,98,170,90,2.69,null,0.035,0.016,93.8,8,12.5,101,0.063,4.4,3,87,0.0065,100,82.5,0.004,2.2,4.3,0.55,90.1,125,104,1.4,11,0.171,0.049,21.3,1.3,7.3,0.022,730,0.57,0.021,0.088,null,3.6,0.16]
["14.7 - Toxicity - ADI (mg kg-1 day-1)\t",null,{"v":0.05,"d":"0.050"},{"v":0.0025,"d":"0.003"},{"v":0.0025,"d":"0.003"},0.025,{"v":0.0036,"d":"0.004"},null,null,{"v":0.01,"d":"0.010"},null,{"v":0.01,"d":"0.010"},0.015,0.019,{"v":10,"d":"10.000"},0.015,null,{"v":0.26,"d":"0.260"},0.003,{"v":0.36,"d":"0.360"},{"v":0.02,"d":"0.020"},null,{"v":0.1,"d":"0.100"},{"v":0.2,"d":"0.200"},{"v":0.04,"d":"0.040"},{"v":0.01,"d":"0.010"},{"v":0.1,"d":"0.100"},{"v":0.1,"d":"0.100"},{"v":0.05,"d":"0.050"},0.003,0.015,{"v":0.01,"d":"0.010"},null,{"v":0.04,"d":"0.040"},null,{"v":0.01,"d":"0.010"},{"v":0.01,"d":"0.010"},{"v":0.0004,"d":"0.000"},{"v":0.1,"d":"0.100"},{"v":0.007500000000000001,"d":"0.008"},{"v":0.02,"d":"0.020"},0.005,0.008,{"v":0.03,"d":"0.030"},null,{"v":1.58,"d":"1.580"},0.015,null,{"v":0.02,"d":"0.020"},0.015,{"v":0.01,"d":"0.010"},{"v":0.16,"d":"0.160"},0.003,0.133,null,0.097,{"v":0.15,"d":"0.150"},{"v":0.15,"d":"0.150"},{"v":0.15,"d":"0.150"},{"v":0.01,"d":"0.010"},{"v":0.17,"d":"0.170"},null,null,{"v":0.17,"d":"0.170"},0.013,{"v":0.05,"d":"0.050"},{"v":0.02,"d":"0.020"},{"v":0.03,"d":"0.030"},{"v":0.06,"d":"0.060"},{"v":0.01,"d":"0.010"},{"v":0.01,"d":"0.010"},null,{"v":0.3,"d":"0.300"},{"v":0.05,"d":"0.050"},{"v":0.01,"d":"0.010"},{"v":0.1,"d":"0.100"},null,{"v":0.05,"d":"0.050"},null,{"v":2E-3,"d":"0.002"},"0,0024",{"v":0.01,"d":"0.010"},0.007,{"v":0.1,"d":"0.100"},null,0.008,{"v":0.0175,"d":"0.018"},{"v":0.04,"d":"0.040"},{"v":0.03,"d":"0.030"},null,0.015,0.006,{"v":0.03,"d":"0.030"},0.005,{"v":0.01,"d":"0.010"},{"v":0.03,"d":"0.030"},0.003,{"v":0.13,"d":"0.130"},{"v":0.01,"d":"0.010"},{"v":0.0005,"d":"0.001"},{"v":0.0002,"d":"0.000"},0.013,0.025,{"v":0.5,"d":"0.500"},{"v":0.01,"d":"0.010"},{"v":0.01,"d":"0.010"},0.017,{"v":0.37,"d":"0.370"},{"v":0.01,"d":"0.010"},{"v":1E-4,"d":"0.000"},{"v":1E-4,"d":"0.000"},0.009,{"v":0.08,"d":"0.080"},0.012,{"v":64,"d":"64.000"},{"v":2E-3,"d":"0.002"},{"v":0.8,"d":"0.800"},{"v":0.09,"d":"0.090"},{"v":0.01,"d":"0.010"},{"v":0.02,"d":"0.020"},{"v":0.1,"d":"0.100"},0.003,{"v":0.25,"d":"0.250"},{"v":1,"d":"1.000"},0.004,{"v":0.0012,"d":"0.001"},0.021,{"v":0.3,"d":"0.300"},0.058,0.063,{"v":0.00065,"d":"0.001"},{"v":0.05,"d":"0.050"},{"v":0.03,"d":"0.030"},0.025,{"v":9,"d":"9.000"},{"v":0.5,"d":"0.500"},{"v":1E-4,"d":"0.000"},{"v":0.25,"d":"0.250"},null,{"v":0.67,"d":"0.670"},{"v":0.06,"d":"0.060"},null,0.005,null,{"v":0.03,"d":"0.030"},0.015,{"v":0.06,"d":"0.060"},{"v":0.02,"d":"0.020"},null,null,{"v":1.5E-3,"d":"0.002"},0.005,0.003,{"v":0.0155,"d":"0.016"},{"v":0.03,"d":"0.030"},{"v":0.05,"d":"0.050"},{"v":0.15,"d":"0.150"},{"v":0.05,"d":"0.050"},0.035,{"v":0.01,"d":"0.010"},{"v":0.03,"d":"0.030"},{"v":0.08,"d":"0.080"},{"v":1E-3,"d":"0.001"},{"v":0.01,"d":"0.010"},{"v":1E-3,"d":"0.001"},{"v":0.0025,"d":"0.003"},{"v":0.1,"d":"0.100"},null,{"v":0.03,"d":"0.030"},{"v":0.1,"d":"0.100"},0.013,{"v":0.22,"d":"0.220"},null,0.025,{"v":2,"d":"2.000"},{"v":0.01,"d":"0.010"},null,{"v":0.0036,"d":"0.004"},{"v":1.04,"d":"1.040"},{"v":3,"d":"3.000"},0.004,{"v":0.2,"d":"0.200"},"0,125",{"v":0.05,"d":"0.050"},null,{"v":1E-3,"d":"0.001"},{"v":0.3,"d":"0.300"},null,0.004,null,{"v":2.8E-3,"d":"0.003"},{"v":0.03,"d":"0.030"},0.005,null,{"v":0.29,"d":"0.290"},{"v":0.02,"d":"0.020"},{"v":0.03,"d":"0.030"},{"v":0.04,"d":"0.040"},0.025,{"v":0.05,"d":"0.050"},0.092,{"v":0.03,"d":"0.030"},{"v":0.03,"d":"0.030"},{"v":0.01,"d":"0.010"},{"v":0.17,"d":"0.170"},{"v":0.1,"d":"0.100"},{"$nulls":3},{"v":0.0013,"d":"0.001"},0.013,{"$nulls":3},0.025,null,0.015,{"v":0.03,"d":"0.030"},{"v":1E-4,"d":"0.000"},null,null,{"v":0.04,"d":"0.040"},null,{"v":0.03,"d":"0.030"},{"v":0.02,"d":"0.020"},{"v":0.07,"d":"0.070"},{"v":0.01,"d":"0.010"},{"v":0.01,"d":"0.010"},0.025,{"v":0.0006,"d":"0.001"},0.004,0.004,{"v":0.1,"d":"0.100"},{"v":0.01,"d":"0.010"},0.026,{"v":0.23,"d":"0.230"},"0,01",{"v":0.08,"d":"0.080"},{"v":0.01,"d":"0.010"},null,{"v":0.05,"d":"0.050"},{"v":0.03,"d":"0.030"},null,{"v":0.1,"d":"0.100"},{"v":0.04,"d":"0.040"},{"v":0.05,"d":"0.050"},0.014,{"v":15,"d":"15.000"},null,0.025,{"v":0.5,"d":"0.500"}]
["Product Toxicity Index (>2,5 - high alert)",null,{"v":1.7494703688911244,"d":"1.75"},{"v":4.522878745280337,"d":"4.52"},{"v":3.40135972093719,"d":"3.40"},{"v":1.8010299956639813,"d":"1.80"},{"v":3.4436974992327123,"d":"3.44"},null,null,{"$f":"IF(J7>0,(((4-LOG10(J7))+(-LOG(J8)))/2),\"\")","v":{"v":4.107335082494616,"d":"4.11"}},null,{"v":2.8723637474483468,"d":"2.87"},{"v":4.284318117920506,"d":"4.28"},{"$f":"IF(N7>0,(((4-LOG10(N7))+(-LOG(N8)))/2),\"\")","v":{"v":3.867237332390463,"d":"3.87"}},{"$f":"IF(O7>0,(((4-LOG10(O7))+(-LOG(O8)))/2),\"\")","v":{"v":2.093543321678572,"d":"2.09"}},{"v":2.56246936830415,"d":"2.56"},null,{"$f":"IF(R7>0,(((4-LOG10(R7))+(-LOG(R8)))/2),\"\")","v":{"v":1.292513326014591,"d":"1.29"}},{"$f":"IF(S7>0,(((4-LOG10(S7))+(-LOG(S8)))/2),\"\")","v":{"v":3.3268235127746806,"d":"3.33"}},{"$f":"IF(T7>0,(((4-LOG10(T7))+(-LOG(T8)))/2),\"\")","v":{"v":1.2416133608492068,"d":"1.24"}},{"v":2.5228787452803374,"d":"2.52"},null,{"$f":"IF(W7>0,(((4-LOG10(W7))+(-LOG(W8)))/2),\"\")","v":{"v":1.4062396395817685,"d":"1.41"}},{"v":2.513436073200151,"d":"2.51"},{"$f":"IF(Y7>0,(((4-LOG10(Y7))+(-LOG(Y8)))/2),\"\")","v":{"v":2.4119543704721593,"d":"2.41"}},{"v":3.710108201691595,"d":"3.71"},{"v":1.5,"d":"1.50"},{"$f":"IF(AB7>0,(((4-LOG10(AB7))+(-LOG(AB8)))/2),\"\")","v":{"v":2,"d":"2.00"}},{"$f":"IF(AC7>0,(((4-LOG10(AC7))+(-LOG(AC8)))/2),\"\")","v":{"v":3.878480975656853,"d":"3.88"}},{"v":5.34518491628705,"d":"5.35"},{"$f":"IF(AE7>0,(((4-LOG10(AE7))+(-LOG(AE8)))/2),\"\")","v":{"v":4.70446769648675,"d":"4.70"}},{"$f":"IF(AF7>0,(((4-LOG10(AF7))+(-LOG(AF8)))/2),\"\")","v":{"v":2.011138197355576,"d":"2.01"}},null,{"v":2.483288122256525,"d":"2.48"},null,{"$f":"IF(AJ7>0,(((4-LOG10(AJ7))+(-LOG(AJ8)))/2),\"\")","v":{"v":2.884775539310863,"d":"2.88"}},{"$f":"IF(AK7>0,(((4-LOG10(AK7))+(-LOG(AK8)))/2),\"\")","v":{"v":3.240743030061056,"d":"3.24"}},{"$f":"IF(AL7>0,(((4-LOG10(AL7))+(-LOG(AL8)))/2),\"\")","v":{"v":4.1419983281826,"d":"4.14"}},{"v":2.865243527891042,"d":"2.87"},{"v":2.854982694318741,"d":"2.85"},{"v":3.210108201691595,"d":"3.21"},{"$f":"IF(AP7>0,(((4-LOG10(AP7))+(-LOG(AP8)))/2),\"\")","v":{"v":4.06246936830415,"d":"4.06"}},{"$f":"IF(AQ7>0,(((4-LOG10(AQ7))+(-LOG(AQ8)))/2),\"\")","v":{"v":2.8675910884952316,"d":"2.87"}},{"v":2.659379381312206,"d":"2.66"},null,{"v":1.3610808334989761,"d":"1.36"},{"$f":"IF(AU7>0,(((4-LOG10(AU7))+(-LOG(AU8)))/2),\"\")","v":{"v":3.989405350465031,"d":"3.99"}},null,{"v":2.3873453591370684,"d":"2.39"},{"v":3.6220625721637543,"d":"3.62"},{"v":4.4430283238465815,"d":"4.44"},{"v":1.6989700043360187,"d":"1.70"},{"$f":"IF(BA7>0,(((4-LOG10(BA7))+(-LOG(BA8)))/2),\"\")","v":{"v":3.600329725273209,"d":"3.60"}},{"$f":"IF(BB7>0,(((4-LOG10(BB7))+(-LOG(BB8)))/2),\"\")","v":{"v":1.8588929334688322,"d":"1.86"}},null,{"$f":"IF(BD7>0,(((4-LOG10(BD7))+(-LOG(BD8)))/2),\"\")","v":{"v":1.4976802733851249,"d":"1.50"}},{"v":3.2967299097830223,"d":"3.30"},{"$f":"IF(BF7>0,(((4-LOG10(BF7))+(-LOG(BF8)))/2),\"\")","v":{"v":1.5912173152201095,"d":"1.59"}},{"$f":"IF(BG7>0,(((4-LOG10(BG7))+(-LOG(BG8)))/2),\"\")","v":{"v":1.8516674048692345,"d":"1.85"}},{"v":2.4498147274412183,"d":"2.45"},{"$f":"IF(BI7>0,(((4-LOG10(BI7))+(-LOG(BI8)))/2),\"\")","v":{"v":2.5106815258077626,"d":"2.51"}},null,null,{"$f":"IF(BL7>0,(((4-LOG10(BL7))+(-LOG(BL8)))/2),\"\")","v":{"v":2.485105264584072,"d":"2.49"}},{"$f":"IF(BM7>0,(((4-LOG10(BM7))+(-LOG(BM8)))/2),\"\")","v":{"v":2.2118293248971037,"d":"2.21"}},{"v":3.926935982160881,"d":"3.93"},{"v":2.210108201691595,"d":"2.21"},{"$f":"IF(BP7>0,(((4-LOG10(BP7))+(-LOG(BP8)))/2),\"\")","v":{"v":2.5704308513527345,"d":"2.57"}},{"v":1.610924374808178,"d":"1.61"},{"$f":"IF(BR7>0,(((4-LOG10(BR7))+(-LOG(BR8)))/2),\"\")","v":{"v":3.2614393726401687,"d":"3.26"}},{"v":4.792513326014591,"d":"4.79"},null,{"$f":"IF(BU7>0,(((4-LOG10(BU7))+(-LOG(BU8)))/2),\"\")","v":{"v":1.2639510358153232,"d":"1.26"}},{"v":1.6298186552528782,"d":"1.63"},{"v":2.9793036574208873,"d":"2.98"},{"v":2.9430283238465815,"d":"2.94"},null,{"$f":"IF(BZ7>0,(((4-LOG10(BZ7))+(-LOG(BZ8)))/2),\"\")","v":{"v":2.257850080326607,"d":"2.26"}},null,{"$f":"IF(CB7>0,(((4-LOG10(CB7))+(-LOG(CB8)))/2),\"\")","v":{"v":2.6883753548010496,"d":"2.69"}},{"v":2.396856977793784,"d":"2.40"},{"$f":"IF(CD7>0,(((4-LOG10(CD7))+(-LOG(CD8)))/2),\"\")","v":{"v":3.5774509799928715,"d":"3.58"}},{"v":2.664413578642458,"d":"2.66"},{"$f":"IF(CF7>0,(((4-LOG10(CF7))+(-LOG(CF8)))/2),\"\")","v":{"v":2.6220625721637543,"d":"2.62"}},null,{"v":2.799990182467421,"d":"2.80"},{"v":4.878480975656853,"d":"4.88"},{"$f":"IF(CJ7>0,(((4-LOG10(CJ7))+(-LOG(CJ8)))/2),\"\")","v":{"v":1.7474250108400469,"d":"1.75"}},{"v":4.045757490560675,"d":"4.05"},null,{"$f":"IF(CM7>0,(((4-LOG10(CM7))+(-LOG(CM8)))/2),\"\")","v":{"v":2.7218487496163566,"d":"2.72"}},{"$f":"IF(CN7>0,(((4-LOG10(CN7))+(-LOG(CN8)))/2),\"\")","v":{"v":4.090228032229065,"d":"4.09"}},{"v":2.8268235127746806,"d":"2.83"},{"$f":"IF(CP7>0,(((4-LOG10(CP7))+(-LOG(CP8)))/2),\"\")","v":{"v":3.093543321678572,"d":"3.09"}},{"v":3.3606231995235856,"d":"3.36"},{"v":4.080575454631372,"d":"4.08"},{"$f":"IF(CS7>0,(((4-LOG10(CS7))+(-LOG(CS8)))/2),\"\")","v":{"v":3.080575454631372,"d":"3.08"}},{"$f":"IF(CT7>0,(((4-LOG10(CT7))+(-LOG(CT8)))/2),\"\")","v":{"v":2.085026652029182,"d":"2.09"}},{"$f":"IF(CU7>0,(((4-LOG10(CU7))+(-LOG(CU8)))/2),\"\")","v":{"v":4.489405350465031,"d":"4.49"}},{"v":4.301029995663981,"d":"4.30"},{"v":4.152259161754902,"d":"4.15"},{"v":2.2718169834354787,"d":"2.27"},{"$f":"IF(CY7>0,(((4-LOG10(CY7))+(-LOG(CY8)))/2),\"\")","v":{"v":1.8010299956639813,"d":"1.80"}},{"$f":"IF(CZ7>0,(((4-LOG10(CZ7))+(-LOG(CZ8)))/2),\"\")","v":{"v":1.1505149978319906,"d":"1.15"}},{"v":2.92539044367231,"d":"2.93"},{"v":3.629818655252878,"d":"3.63"},{"v":3.495699914119041,"d":"3.50"},{"$f":"IF(DD7>0,(((4-LOG10(DD7))+(-LOG(DD8)))/2),\"\")","v":{"v":2.535035219957706,"d":"2.54"}},{"v":4.154901959985743,"d":"4.15"},{"v":2.7614393726401687,"d":"2.76"},{"v":3.9793036574208873,"d":"3.98"},{"v":2.842014827271541,"d":"2.84"},{"$f":"IF(DI7>0,(((4-LOG10(DI7))+(-LOG(DI8)))/2),\"\")","v":{"v":2.7703037561203843,"d":"2.77"}},{"$f":"IF(DJ7>0,(((4-LOG10(DJ7))+(-LOG(DJ8)))/2),\"\")","v":{"v":2.96479633912994,"d":"2.96"}},{"v":0.17281545451235725,"d":"0.17"},{"$f":"IF(DL7>0,(((4-LOG10(DL7))+(-LOG(DL8)))/2),\"\")","v":{"v":3.210108201691595,"d":"3.21"}},{"$f":"IF(DM7>0,(((4-LOG10(DM7))+(-LOG(DM8)))/2),\"\")","v":{"v":1.4707869877714972,"d":"1.47"}},{"$f":"IF(DN7>0,(((4-LOG10(DN7))+(-LOG(DN8)))/2),\"\")","v":{"v":2.1566818653688533,"d":"2.16"}},{"v":2.240743030061056,"d":"2.24"},{"v":1.4808886808156407,"d":"1.48"},{"v":2.8163220394869906,"d":"2.82"},{"v":2.1462149119510316,"d":"2.15"},{"v":1.3010299956639813,"d":"1.30"},{"$f":"IF(DT7>0,(((4-LOG10(DT7))+(-LOG(DT8)))/2),\"\")","v":{"v":0.9568200846626258,"d":"0.96"}},{"$f":"IF(DU7>0,(((4-LOG10(DU7))+(-LOG(DU8)))/2),\"\")","v":{"v":2.1705175786677824,"d":"2.17"}},{"$f":"IF(DV7>0,(((4-LOG10(DV7))+(-LOG(DV8)))/2),\"\")","v":{"v":5.18837535480105,"d":"5.19"}},{"v":1.4132611782735025,"d":"1.41"},{"v":1.4715475743317636,"d":"1.47"},{"$f":"IF(DY7>0,(((4-LOG10(DY7))+(-LOG(DY8)))/2),\"\")","v":{"v":2.5563601827349887,"d":"2.56"}},{"$f":"IF(DZ7>0,(((4-LOG10(DZ7))+(-LOG(DZ8)))/2),\"\")","v":{"v":1.5643887216201464,"d":"1.56"}},{"$f":"IF(EA7>0,(((4-LOG10(EA7))+(-LOG(EA8)))/2),\"\")","v":{"v":4.121301985603488,"d":"4.12"}},{"v":1.3979400086720377,"d":"1.40"},{"$f":"IF(EC7>0,(((4-LOG10(EC7))+(-LOG(EC8)))/2),\"\")","v":{"v":2.5088643834802156,"d":"2.51"}},{"v":2.7158991379665025,"d":"2.72"},{"v":0.47969882994296337,"d":"0.48"},{"v":1.1505149978319906,"d":"1.15"},{"v":3,"d":"3.00"},{"v":1.3010299956639813,"d":"1.30"},null,{"v":3.12225313579244,"d":"3.12"},{"v":1.448783147159332,"d":"1.45"},null,{"$f":"IF(EM7>0,(((4-LOG10(EM7))+(-LOG(EM8)))/2),\"\")","v":{"v":3.5352905371428536,"d":"3.54"}},null,{"v":1.7614393726401687,"d":"1.76"},{"$f":"IF(EP7>0,(((4-LOG10(EP7))+(-LOG(EP8)))/2),\"\")","v":{"v":2.8239087409443187,"d":"2.82"}},{"v":1.8315700895415952,"d":"1.83"},{"$f":"IF(ER7>0,(((4-LOG10(ER7))+(-LOG(ER8)))/2),\"\")","v":{"v":2.671472073571448,"d":"2.67"}},null,null,{"v":3.9119543704721593,"d":"3.91"},{"v":4.989405350465031,"d":"4.99"},{"v":3.0122840957453683,"d":"3.01"},{"v":2.1736351519653763,"d":"2.17"},{"v":3.6338031200885155,"d":"3.63"},{"v":3.2158991379665025,"d":"3.22"},{"$f":"IF(FA7>0,(((4-LOG10(FA7))+(-LOG(FA8)))/2),\"\")","v":{"v":2.1807553715226815,"d":"2.18"}},{"$f":"IF(FB7>0,(((4-LOG10(FB7))+(-LOG(FB8)))/2),\"\")","v":{"v":1.6505149978319906,"d":"1.65"}},{"$f":"IF(FC7>0,(((4-LOG10(FC7))+(-LOG(FC8)))/2),\"\")","v":{"v":2.865010161677338,"d":"2.87"}},{"v":1.9604093769761877,"d":"1.96"},{"v":3.0824719491399417,"d":"3.08"},{"v":1.5484550065040281,"d":"1.55"},{"$f":"IF(FG7>0,(((4-LOG10(FG7))+(-LOG(FG8)))/2),\"\")","v":{"v":3.878480975656853,"d":"3.88"}},{"$f":"IF(FH7>0,(((4-LOG10(FH7))+(-LOG(FH8)))/2),\"\")","v":{"v":2.8388903526330402,"d":"2.84"}},{"$f":"IF(FI7>0,(((4-LOG10(FI7))+(-LOG(FI8)))/2),\"\")","v":{"v":4.5,"d":"4.50"}},{"v":3.40135972093719,"d":"3.40"},{"v":2.1883753548010496,"d":"2.19"},null,{"$f":"IF(FM7>0,(((4-LOG10(FM7))+(-LOG(FM8)))/2),\"\")","v":{"v":2.9982697339452464,"d":"3.00"}},{"v":2.455047444280301,"d":"2.46"},{"v":2.006658910110247,"d":"2.01"},{"v":1.2407430300610562,"d":"1.24"},null,{"v":2.6505149978319906,"d":"2.65"},{"v":0.9407023173881188,"d":"0.94"},{"v":3,"d":"3.00"},null,{"$f":"IF(FV7>0,(((4-LOG10(FV7))+(-LOG(FV8)))/2),\"\")","v":{"v":3.182258126592544,"d":"3.18"}},{"$f":"IF(FW7>0,(((4-LOG10(FW7))+(-LOG(FW8)))/2),\"\")","v":{"v":2.072058784981982,"d":"2.07"}},{"v":2.06246936830415,"d":"2.06"},{"v":2.5595932038596043,"d":"2.56"},{"$f":"IF(FZ7>0,(((4-LOG10(FZ7))+(-LOG(FZ8)))/2),\"\")","v":{"v":2.610924374808178,"d":"2.61"}},{"v":2.8054169578177337,"d":"2.81"},{"$f":"IF(GB7>0,(((4-LOG10(GB7))+(-LOG(GB8)))/2),\"\")","v":{"v":1.6505149978319906,"d":"1.65"}},null,{"$f":"IF(GD7>0,(((4-LOG10(GD7))+(-LOG(GD8)))/2),\"\")","v":{"v":3.809894379144197,"d":"3.81"}},{"$f":"IF(GE7>0,(((4-LOG10(GE7))+(-LOG(GE8)))/2),\"\")","v":{"v":1.7891980365650846,"d":"1.79"}},null,{"v":3.3957793217807164,"d":"3.40"},null,{"v":2.847152385544071,"d":"2.85"},{"$f":"IF(GJ7>0,(((4-LOG10(GJ7))+(-LOG(GJ8)))/2),\"\")","v":{"v":3.309894379144197,"d":"3.31"}},{"$f":"IF(GK7>0,(((4-LOG10(GK7))+(-LOG(GK8)))/2),\"\")","v":{"v":2.56246936830415,"d":"2.56"}},null,{"$f":"IF(GM7>0,(((4-LOG10(GM7))+(-LOG(GM8)))/2),\"\")","v":{"v":1.2709834037517471,"d":"1.27"}},{"$f":"IF(GN7>0,(((4-LOG10(GN7))+(-LOG(GN8)))/2),\"\")","v":{"v":2.483288122256525,"d":"2.48"}},{"$f":"IF(GO7>0,(((4-LOG10(GO7))+(-LOG(GO8)))/2),\"\")","v":{"v":3.4447051448503756,"d":"3.44"}},{"v":2.4914833303506096,"d":"2.49"},{"$f":"IF(GQ7>0,(((4-LOG10(GQ7))+(-LOG(GQ8)))/2),\"\")","v":{"v":3.0417730257250373,"d":"3.04"}},{"v":2.5192894529667758,"d":"2.52"},{"$f":"IF(GS7>0,(((4-LOG10(GS7))+(-LOG(GS8)))/2),\"\")","v":{"v":2.890469833775569,"d":"2.89"}},{"$f":"IF(GT7>0,(((4-LOG10(GT7))+(-LOG(GT8)))/2),\"\")","v":{"v":1.7614393726401687,"d":"1.76"}},{"v":3.8723637474483468,"d":"3.87"},{"$f":"IF(GV7>0,(((4-LOG10(GV7))+(-LOG(GV8)))/2),\"\")","v":{"v":4.5774509799928715,"d":"4.58"}},{"$f":"IF(GW7>0,(((4-LOG10(GW7))+(-LOG(GW8)))/2),\"\")","v":{"v":1.8729435802119663,"d":"1.87"}},{"v":2.784318117920506,"d":"2.78"},{"$nulls":3},{"v":3.7819186764796218,"d":"3.78"},{"$f":"IF(HC7>0,(((4-LOG10(HC7))+(-LOG(HC8)))/2),\"\")","v":{"v":3.262164405837785,"d":"3.26"}},{"$nulls":3},{"$f":"IF(HG7>0,(((4-LOG10(HG7))+(-LOG(HG8)))/2),\"\")","v":{"v":2.586153855662777,"d":"2.59"}},null,{"$f":"IF(HI7>0,(((4-LOG10(HI7))+(-LOG(HI8)))/2),\"\")","v":{"v":3.6399203482970215,"d":"3.64"}},{"$f":"IF(HJ7>0,(((4-LOG10(HJ7))+(-LOG(HJ8)))/2),\"\")","v":{"v":3.659379381312206,"d":"3.66"}},{"v":3.013898580810468,"d":"3.01"},null,null,{"$f":"IF(HN7>0,(((4-LOG10(HN7))+(-LOG(HN8)))/2),\"\")","v":{"v":1.6968093174446974,"d":"1.70"}},null,{"v":2.439713034397075,"d":"2.44"},{"$f":"IF(HQ7>0,(((4-LOG10(HQ7))+(-LOG(HQ8)))/2),\"\")","v":{"v":2.610924374808178,"d":"2.61"}},{"v":1.6076913536835624,"d":"1.61"},{"v":4.093543321678572,"d":"4.09"},{"v":2,"d":"2.00"},{"$f":"IF(HU7>0,(((4-LOG10(HU7))+(-LOG(HU8)))/2),\"\")","v":{"v":1.8428030213890185,"d":"1.84"}},{"$f":"IF(HV7>0,(((4-LOG10(HV7))+(-LOG(HV8)))/2),\"\")","v":{"v":4.809894379144197,"d":"4.81"}},{"$f":"IF(HW7>0,(((4-LOG10(HW7))+(-LOG(HW8)))/2),\"\")","v":{"v":3.0277586639249154,"d":"3.03"}},{"v":2.882235776546225,"d":"2.88"},{"$f":"IF(HY7>0,(((4-LOG10(HY7))+(-LOG(HY8)))/2),\"\")","v":{"v":2.629818655252878,"d":"2.63"}},{"$f":"IF(HZ7>0,(((4-LOG10(HZ7))+(-LOG(HZ8)))/2),\"\")","v":{"v":2.0226376045104684,"d":"2.02"}},{"v":1.7440583195105628,"d":"1.74"},{"$f":"IF(IB7>0,(((4-LOG10(IB7))+(-LOG(IB8)))/2),\"\")","v":{"v":1.3106194123418133,"d":"1.31"}},{"v":2.926935982160881,"d":"2.93"},{"v":2.0277586639249154,"d":"2.03"},{"v":3.383501944803923,"d":"3.38"},null,{"v":1.9863251961126216,"d":"1.99"},{"$f":"IF(IH7>0,(((4-LOG10(IH7))+(-LOG(IH8)))/2),\"\")","v":{"v":2.7044676964867502,"d":"2.70"}},null,{"v":3.3287886595888967,"d":"3.33"},{"$f":"IF(IK7>0,(((4-LOG10(IK7))+(-LOG(IK8)))/2),\"\")","v":{"v":1.2673085742757908,"d":"1.27"}},{"$f":"IF(IL7>0,(((4-LOG10(IL7))+(-LOG(IL8)))/2),\"\")","v":{"v":2.772577569995745,"d":"2.77"}},{"v":3.765826334793921,"d":"3.77"},{"v":1.9397130343970748,"d":"1.94"},null,{"$f":"IF(IP7>0,(((4-LOG10(IP7))+(-LOG(IP8)))/2),\"\")","v":{"v":2.5228787452803374,"d":"2.52"}},{"$f":"IF(IQ7>0,(((4-LOG10(IQ7))+(-LOG(IQ8)))/2),\"\")","v":{"v":2.548455006504028,"d":"2.55"}}]
["14.8 - Soil adsorption and mobility - Koc",null,242,{"v":6631,"d":"6,631"},72,200,156,null,null,744,null,335,{"v":288735,"d":"288,735"},null,{"v":89.6,"d":"90"},316,30,null,{"v":1000,"d":"1,000"},null,174,null,{"v":73.8,"d":"74"},589,{"v":4998,"d":"4,998"},{"v":9100,"d":"9,100"},86,{"v":245.2,"d":"245"},null,{"v":64300,"d":"64,300"},{"v":236610,"d":"236,610"},null,{"v":37480,"d":"37,480"},772,32,872,{"v":5363,"d":"5,363"},null,200,300,225,null,{"v":99.4,"d":"99"},866,null,301,{"v":12000,"d":"12,000"},{"v":20800,"d":"20,800"},106,850,{"v":8151,"d":"8,151"},{"v":22.7,"d":"23"},null,300,30,123,{"v":12000,"d":"12,000"},{"v":1000,"d":"1,000"},{"v":9500,"d":"9,500"},241,null,null,{"v":1440,"d":"1,440"},{"v":173900,"d":"173,900"},null,{"v":156250,"d":"156,250"},364,null,409,10,{"v":10240000,"d":"10,240,000"},{"v":43546,"d":"43,546"},"-",90,{"v":3760,"d":"3,760"},{"v":4620,"d":"4,620"},null,null,26,{"v":2185000,"d":"2,185,000"},{"v":2184750,"d":"2,184,750"},{"v":3627,"d":"3,627"},{"v":1067,"d":"1,067"},{"v":4236500,"d":"4,236,500"},null,{"v":1073,"d":"1,073"},{"v":251717,"d":"251,717"},134,{"v":17757,"d":"17,757"},null,{"v":1000,"d":"1,000"},{"v":3847,"d":"3,847"},388,{"v":2000,"d":"2,000"},{"v":11354,"d":"11,354"},{"v":35660,"d":"35,660"},{"$nulls":3},{"v":3104,"d":"3,104"},727,{"v":46.2,"d":"46"},{"v":1.6,"d":"2"},{"v":105.2,"d":"105"},{"v":3394,"d":"3,394"},220,{"v":2197,"d":"2,197"},{"v":145600,"d":"145,600"},{"v":157643,"d":"157,643"},28,30,889,null,null,{"v":98.4,"d":"98"},null,{"v":1E-4,"d":"0"},null,205,728,304,228,{"v":78.4,"d":"78"},null,239,{"v":59677,"d":"59,677"},600,{"v":28700,"d":"28,700"},{"v":1417,"d":"1,417"},109,null,54,null,{"v":4753,"d":"4,753"},{"v":11.6,"d":"12"},137,125,{"v":17.96,"d":"18"},52,{"v":13120,"d":"13,120"},225,{"v":1000,"d":"1,000"},{"v":4483,"d":"4,483"},null,45,null,700,{"$nulls":3},{"v":10000,"d":"10,000"},{"v":157450,"d":"157,450"},620,{"v":41182,"d":"41,182"},217,998,null,{"v":73.88,"d":"74"},null,112,{"v":30714,"d":"30,714"},{"v":78.9,"d":"79"},{"v":17.8,"d":"18"},null,400,{"v":25.2,"d":"25"},402,null,{"v":903012,"d":"903,012"},{"v":226.1,"d":"226"},{"v":37.92,"d":"38"},{"v":39.5,"d":"40"},null,517,30,{"v":9598,"d":"9,598"},{"v":352.5,"d":"353"},{"v":3200,"d":"3,200"},{"v":165.4,"d":"165"},{"v":7566,"d":"7,566"},{"v":1000000,"d":"1,000,000"},null,{"v":17491,"d":"17,491"},{"v":73.2,"d":"73"},{"v":100000,"d":"100,000"},{"v":3534,"d":"3,534"},13,965,{"v":1100,"d":"1,100"},null,378,{"v":2016,"d":"2,016"},null,400,null,149,null,{"v":2252,"d":"2,252"},null,{"v":2556,"d":"2,556"},null,null,{"v":9315,"d":"9,315"},null,null,{"v":21175,"d":"21,175"},null,223,50,{"v":1816,"d":"1,816"},477,20,75,130,{"v":22836,"d":"22,836"},null,{"v":31037,"d":"31,037"},{"v":30900,"d":"30,900"},43,{"v":3500000,"d":"3,500,000"},85,{"v":40.8,"d":"41"},{"v":1950,"d":"1,950"},769,null,80,{"v":26062,"d":"26,062"},66,null,500,null,{"v":1152,"d":"1,152"},{"v":3983,"d":"3,983"},null,{"v":56.2,"d":"56"},null,{"v":1.4,"d":"1"},220,{"v":9629,"d":"9,629"},{"v":63300,"d":"63,300"},750,null,169,{"v":2287,"d":"2,287"},null,{"v":1373,"d":"1,373"},{"v":2967,"d":"2,967"},{"v":15800,"d":"15,800"},null,374,{"v":1224,"d":"1,224"}]
["14.9 - Soil degradation - t1/2 (DT50)",null,{"v":10,"d":"10.0"},{"v":30,"d":"30.0"},{"v":7,"d":"7.0"},1.6,{"v":14,"d":"14.0"},null,{"v":59,"d":"59.0"},39.2,8.8,{"v":14,"d":"14.0"},{"v":23,"d":"23.0"},null,1.8,{"v":37,"d":"37.0"},{"v":21,"d":"21.0"},{"v":35,"d":"35.0"},0.2,3.2,{"v":75,"d":"75.0"},null,{"v":64,"d":"64.0"},{"v":78,"d":"78.0"},33.2,0.5,{"v":13,"d":"13.0"},13.8,{"v":908,"d":"908.0"},{"v":13,"d":"13.0"},{"v":26,"d":"26.0"},{"v":13,"d":"13.0"},80.5,{"v":200,"d":"200.0"},{"v":60,"d":"60.0"},{"v":190,"d":"190.0"},55.4,{"v":38,"d":"38.0"},0.8,{"v":16,"d":"16.0"},{"v":40,"d":"40.0"},{"v":21,"d":"21.0"},0.5,{"v":1,"d":"1.0"},null,{"v":597,"d":"597.0"},1.4,{"v":90,"d":"90.0"},{"v":40,"d":"40.0"},{"v":22,"d":"22.0"},{"v":50,"d":"50.0"},{"v":0.55,"d":"0.6"},0.8,22.6,{"v":11,"d":"11.0"},{"v":545,"d":"545.0"},{"v":10000,"d":"10,000.0"},0.1,0.1,34.4,{"v":10,"d":"10.0"},{"v":1161,"d":"1,161.0"},{"v":15,"d":"15.0"},{"v":9,"d":"9.0"},1.7,{"v":60,"d":"60.0"},{"v":142,"d":"142.0"},{"v":37,"d":"37.0"},{"v":93,"d":"93.0"},{"v":0.52,"d":"0.5"},{"v":13,"d":"13.0"},0.5,{"v":9.62,"d":"9.6"},{"v":49,"d":"49.0"},{"v":130,"d":"130.0"},{"v":3,"d":"3.0"},2.5,72.7,{"v":82,"d":"82.0"},{"v":2345,"d":"2,345.0"},{"v":2345,"d":"2,345.0"},10.5,75.5,4.7,null,{"v":354,"d":"354.0"},66.6,{"v":18,"d":"18.0"},{"v":11,"d":"11.0"},null,{"v":20,"d":"20.0"},41.1,8.5,2.7,0.4,{"v":34,"d":"34.0"},{"v":35,"d":"35.0"},99.6,135.1,{"v":26,"d":"26.0"},{"v":142,"d":"142.0"},41.2,3.1,39.8,{"v":1,"d":"1.0"},{"v":11,"d":"11.0"},{"v":8,"d":"8.0"},{"v":164,"d":"164.0"},{"v":42,"d":"42.0"},{"v":45,"d":"45.0"},2.5,21.9,{"v":271,"d":"271.0"},{"v":309,"d":"309.0"},57.1,{"v":350,"d":"350.0"},13.1,{"v":400,"d":"400.0"},{"v":1358,"d":"1,358.0"},{"v":183,"d":"183.0"},4.7,{"v":86,"d":"86.0"},25.4,0.1,{"v":13,"d":"13.0"},26.8,7.4,{"v":12,"d":"12.0"},1.3,26.7,0.5,{"v":105,"d":"105.0"},{"v":30,"d":"30.0"},76.3,200.2,{"v":120,"d":"120.0"},{"v":11,"d":"11.0"},{"v":60,"d":"60.0"},{"v":90,"d":"90.0"},{"v":15,"d":"15.0"},{"v":191,"d":"191.0"},{"v":150,"d":"150.0"},113.2,null,2.7,{"v":50,"d":"50.0"},3.7,37.1,null,null,{"v":4,"d":"4.0"},{"v":25,"d":"25.0"},{"v":48,"d":"48.0"},16.3,{"v":0.17,"d":"0.2"},0.1,49.1,{"v":12.07,"d":"12.1"},{"v":268,"d":"268.0"},19.6,{"v":141,"d":"141.0"},6.5,{"v":7,"d":"7.0"},142.2,{"v":10,"d":"10.0"},{"v":7,"d":"7.0"},{"v":146,"d":"146.0"},null,1.3,{"v":15,"d":"15.0"},11.5,{"v":10,"d":"10.0"},null,{"v":560,"d":"560.0"},{"v":26,"d":"26.0"},{"v":72,"d":"72.0"},12.5,{"v":502,"d":"502.0"},121.2,{"v":35,"d":"35.0"},{"v":3000,"d":"3,000.0"},82.4,182.3,21.7,{"v":13,"d":"13.0"},3.2,{"v":23,"d":"23.0"},24.4,{"v":39,"d":"39.0"},0.1,{"v":7,"d":"7.0"},{"v":7,"d":"7.0"},{"v":8,"d":"8.0"},{"v":41,"d":"41.0"},39.3,0.4,{"v":56,"d":"56.0"},{"v":214,"d":"214.0"},4.3,0.5,{"v":2416,"d":"2,416.0"},{"v":5,"d":"5.0"},{"v":32,"d":"32.0"},{"v":55,"d":"55.0"},50.9,{"v":10,"d":"10.0"},{"v":60,"d":"60.0"},{"v":22,"d":"22.0"},{"v":450,"d":"450.0"},{"v":2,"d":"2.0"},0.2,null,1.2,{"v":60,"d":"60.0"},16.1,null,{"v":7,"d":"7.0"},4.1,{"v":541,"d":"541.0"},null,{"v":24,"d":"24.0"},2.2,{"v":30,"d":"30.0"},{"v":63,"d":"63.0"},{"v":400,"d":"400.0"},{"v":400,"d":"400.0"},{"v":92,"d":"92.0"},{"v":30,"d":"30.0"},{"v":10,"d":"10.0"},{"v":8,"d":"8.0"},{"v":72,"d":"72.0"},{"v":61,"d":"61.0"},{"v":500,"d":"500.0"},{"v":0.88,"d":"0.9"},{"v":50,"d":"50.0"},11.6,{"v":0.67,"d":"0.7"},0.5,{"v":4.89,"d":"4.9"},{"v":4,"d":"4.0"},{"v":250,"d":"250.0"},1.5,{"v":450,"d":"450.0"},{"v":0.34,"d":"0.3"},6.5,{"v":13,"d":"13.0"},{"v":22,"d":"22.0"},{"v":181,"d":"181.0"},null,{"v":237,"d":"237.0"},5.5]
["Leaching Potential Index GUS (IUPAC)  (>2 - high alert)",null,1.62,0.26,1.81,2.18,1.58,null,3.15,-0.92,null,1.08,{"v":-2,"d":"-2.00"},null,0.55,0.52,4.89,3.34,{"v":0,"d":"0.00"},2.58,{"v":3.3,"d":"3.30"},null,1.18,2.65,2.29,"-0.03",{"v":2.3,"d":"2.30"},1.99,0.91,{"v":-0.9,"d":"-0.90"},-2.66,1.21,-1.09,2.66,3.44,2.23,1.21,2.62,{"v":0,"d":"0.00"},2.02,2.53,0.89,2.01,{"v":0,"d":"0.00"},null,4.22,-0.01,-0.62,3.16,{"v":1.4371723157801364,"d":"1.44"},0.15,-0.69,-0.08,2.72,2.52,3.74,-0.32,{"v":-1,"d":"-1.00"},-0.02,2.63,0.57,2.56,0.99,-1.17,1.47,-2.12,{"v":3.1,"d":"3.10"},1.06,2.09,0.13,-3.35,0.19,1.94,3.46,{"v":0.9,"d":"0.90"},0.16,2.18,2.26,4.85,{"v":-7.6,"d":"-7.60"},-2.29,0.68,1.83,-2.95,null,2.47,-2.55,2.33,{"v":-0.3,"d":"-0.30"},null,1.47,1.09,1.31,0.48,0.02,-0.85,{"v":0.5,"d":"0.50"},1.98,0.26,0.72,2.45,{"v":2.5,"d":"2.50"},1.87,3.38,{"v":0,"d":"0.00"},1.73,3.98,-1.35,-3.14,4.22,{"v":1,"d":"1.00"},1.41,{"v":3.2,"d":"3.20"},3.23,3.53,{"v":2.3,"d":"2.30"},1.03,2.29,{"v":5.4,"d":"5.40"},2.57,1.02,3.18,2.95,null,2.48,{"v":-1.1,"d":"-1.10"},1.06,-0.49,1.64,2.25,null,4.58,0.03,0.61,6.76,3.87,1.98,5.42,{"v":3.9,"d":"3.90"},-0.13,3.76,2.18,0.27,null,1.01,{"v":1.3,"d":"1.30"},0.58,1.99,null,null,{"v":0,"d":"0.00"},-1.67,2.03,-0.75,{"v":0,"d":"0.00"},{"v":-1,"d":"-1.00"},1.22,3.13,1.06,2.69,-1.05,1.71,2.32,2.03,1.18,{"v":2.2,"d":"2.20"},3.02,null,-1.65,1.94,2.57,{"v":2.4,"d":"2.40"},null,{"v":3.3,"d":"3.30"},3.25,0.02,1.59,1.97,0.38,0.26,-6.95,0.49,-0.32,1.56,-1.62,0.48,4.14,1.35,1.03,{"v":-4,"d":"-4.00"},4.12,0.59,0.47,0.59,{"v":1.5,"d":"1.50"},-0.51,-0.86,1.51,null,-0.18,2.57,1.33,0.05,{"v":-1.2,"d":"-1.20"},2.17,-0.27,null,2.22,6.29,-0.29,-0.11,null,1.49,{"v":2.2,"d":"2.20"},0.27,null,-0.42,-0.16,"6.16",null,3.92,1.35,-0.71,2.85,1.72,5.46,-0.82,3.22,4.77,1.25,2.19,1.81,1.94,{"v":1.1,"d":"1.10"},3.82,3.42,-0.56,{"v":-0.5,"d":"-0.50"},0.01,-0.48,3.34,null,3.89,{"v":-0.3,"d":"-0.30"},1.81,0.96,-0.05,0.13,null,{"v":2.7,"d":"2.70"},0.71]
["Potential contamination (1; 2 - medium alert ; 3 - high alert)",null,1,3,2,1,3,null,3,3,3,2,2,3,1,2,1,3,1,3,3,null,2,3,2,1,2,2,3,2,2,3,1,3,1,3,1,3,1,2,3,3,1,1,null,2,1,1,3,2,3,1,3,2,1,3,3,1,1,2,3,3,1,1,3,2,3,3,2,1,1,1,3,2,3,1,3,3,1,2,2,2,2,1,null,3,2,2,2,null,2,3,2,1,1,2,3,3,3,3,3,3,3,2,1,2,2,2,2,3,2,2,3,3,1,3,3,3,3,2,1,3,2,3,2,2,1,1,1,2,3,2,3,2,2,2,2,3,1,2,2,1,3,null,1,3,1,3,null,null,1,2,3,1,1,1,3,2,3,2,2,1,3,3,3,3,3,null,1,2,2,1,null,3,2,2,1,3,3,1,2,3,2,2,1,1,3,1,3,3,2,2,3,1,3,1,3,3,3,1,3,3,3,3,3,1,3,1,1,1,1,null,1,1,1,null,1,1,3,null,1,1,1,2,3,3,3,2,3,2,3,3,3,3,3,3,1,1,1,1,2,3,1,1,3,2,2,2,null,3,1]
["Trade\n Name (Brazil)",null,"2,4 D","Ampligo; Vertimec","Acero;  Orthene","Acetamiprido ","Kadette","Bion","Blazer","Rufast","Afidopiropeno ","Alaclor; Laço","Fastac","Gastoxin","Zampo","Ametrina","Amicarbazona; Dinamic","Tordon Ultra","Amitraz","Asulam ","Atrazina; Primestra","Azamax","Gulliver","Amistar; Elatus; Priori; Unizeb","Galben","Benforce; Pottente","Basagran; Doble","Totalit","Alade","Bulldock ; Turbo","Capture; Sperto; Talisman","Bispirabac; Riper","Hanaro","Cantus; Spot","Bromacila","Condor","Applaud","Rugby","Captan; Merpan; Orthocide ","Sevin","Derosal; Fungicarb; Tebuzin","Marshal","Vitavax Thiram","Aurora; Rage; Savana","Cartarys","Altacor; Dermacor; Premio","Pirate","Atabron","Classic; Panzer; Twister","Cerconil; Cuprodil; Daconil; Glider; Zetanil","Clorpirifós; Klorpan; Losban","Centurion; Poquer; Select","Topic","Reator","Pacto","Poncho","Contact","Oxicloreto de cobre","Sulfato de cobre","Benevia; Fortenza; Verimark ","Hanami","Hayate","Invest","Okay","Equation","Ametista; Commanche; Fury; Hero","Alto 100; Aproach; Artea; Sphere max; Verdadeiro","Truzon","Trigard ","Basamid","Decis; K-Obiol; K-Othrine ","Diafentiuron; Polo","Dicamba; Rainvel ","Spider","Flair; Prisma; Score","Diflumax; Dimilim","Dimexion","Forum","Maxsan","Diquat; Reglone","Diquash; Reglone","Delan","Direx; Diuron; Karmex","Dodex","Proclaim","Abacus; Ópera; Prospect","Pirephos; Sumidan","Gladium","Eleitto; Safety; Trebon","Smite","Etridiazole; Terrazole","Equation","Censor","Sumifog; Sumigran; Sumithion ","Podium; Rapsode; Selefen ","Bold; Danimen; Meothrin ","Fenpropimorph; Versatilis","Prolectus","Ortus","Mertin ","Regente; Standak","Katana","Carbine","Gapper","Fusilade; Pilot ","Completo; Frowncide","Belt","Maxim XL","Cascade","Prevaiil; Scorpion","Radiant; Resource","Flumyzin; Sumyzin; Zethamaxx","Xavante","Verango Prime","Sivanto","Atento","Arreio","Moncut","Celeiro; Impact; Skip; Tasker; Tornado; Zoom","Orkestra","Folpan Agricur  ","Flex; Fusiflex","Equip Plus","Aliette","Cierto","Fentrol; Stalion","Fascinate; Finale; Liberty; Patrol","Glyphotal; Roundup; Trop","Texaro","Sempra","Verdict-max","Hexanil; Magnus; Token","Talento","Imazacure; Magnate ","Amplo; Raptor","Only; Imazapique","Contain","Imazaquim; Oneshot ","Imazetapir; Zaphir","Manage ","Connect; Cropstar; Sombrero","Alion; Metribuzin; Provence Total","Avatar","Sugoy","Hussar","Rancona","Attic; Certus; Rovral ","Kenja","Isoxaflutol; Provence","Kasumin","Drible; Naja","Karate zeon","Afalon","Curyom; Game; Match","Malation; Nordick","Dithane; Mancozeb; Manzate; Ridomil","Revus","Agritone","Belyan","Calisto","Alverde; Metaflimizona; Verismo","Maxim","Bunema","Ópera Ultra","Suprathion","Bazuka; Brilhamte; Lannate","Intrepid","Brometo de metila ","Polyram","Dual Gold; Sequence","Sencor; Tenace; Unimark","Accurate; Nufuron; Zartan","Volcane","Systhane","Accent; Sanson; Stoy","Gallaxy; Novaluron; Rimon","Kelion","Ronstar","Zorvec","Goal","Gramoxone; Paraquat; Tocha","Moceren","Herbadox","Raster","Fersol","Imidam","Campestre","Aproach Power","Graolin","Kaligreen","Rotaxil; Sumiguard; Sumilex ","Curyom ","Aura; Profoxidim ","Gesagard","Infinito","Stam","Omite","Juno; Stratego; Tilt","Antracol","Fox","Miravis","Chess","Acronis; Comet","Sanmite","Erune","Blade; Cordial; Privilege; Tiger","Staple","Yamato","Facet","Targa ","Panther","Heat","Poast","Atrasimex","Exalt","Natular","Envidor","Oberon","Boral; Kicker; Ponteiro; Solara","Mirex S","Ally","Expedition","Kumulus","Cronnos; Egan; Folicur; Fusão; Nativo; Tebuco","Mimic","Aval; Butiron; Lava; Spike","Antrimo; Imunit; Nomolt","Soberan","Aramo","Counter","Terbumax","Eminent ","Tecto","Calypso","Actara; Cruiser; Engeo","Adengo","Captor; Futur; Larvim; Semevim","Cercobin; Support; Topsin","Anchor; Rhodiauram; Vitavax ","Chaser","Baytan; Photon ","Arbust","Bim","Flint ","Envoke","Trifimine","Certero; Thorn; Wasp","Premelin; Trifluralina","Trix","Premis","Zoxamida"]
["EIQ* Value (<58,33; 58,33 - 94,46; > 94,46) (low risk; medium alert; high alert)",null,{"v":38.67,"d":"38.7"},{"v":108.16666666666667,"d":"108.2"},{"v":47.333333333333336,"d":"47.3"},{"v":37.666666666666664,"d":"37.7"},{"v":32.666666666666664,"d":"32.7"},{"v":52.666666666666664,"d":"52.7"},{"v":31.666666666666668,"d":"31.7"},{"v":50,"d":"50.0"},{"v":34,"d":"34.0"},{"v":19.333333333333332,"d":"19.3"},{"v":63,"d":"63.0"},null,{"v":39.333333333333336,"d":"39.3"},21.5,null,54.5,{"v":56.333333333333336,"d":"56.3"},{"v":41,"d":"41.0"},{"v":50,"d":"50.0"},{"v":38.666666666666664,"d":"38.7"},{"v":36.333333333333336,"d":"36.3"},{"v":63,"d":"63.0"},{"v":41.333333333333336,"d":"41.3"},{"v":70,"d":"70.0"},{"v":25,"d":"25.0"},{"v":43,"d":"43.0"},{"v":70.66666666666667,"d":"70.7"},{"v":50.666666666666664,"d":"50.7"},69.5,{"v":23,"d":"23.0"},{"v":30.666666666666668,"d":"30.7"},{"v":74.66666666666667,"d":"74.7"},{"v":33.333333333333336,"d":"33.3"},{"v":75.66666666666667,"d":"75.7"},{"v":54.666666666666664,"d":"54.7"},{"v":143.16666666666666,"d":"143.2"},{"v":51.166666666666664,"d":"51.2"},{"v":58,"d":"58.0"},{"v":60.666666666666664,"d":"60.7"},{"v":68.66666666666667,"d":"68.7"},{"v":40.666666666666664,"d":"40.7"},{"v":36,"d":"36.0"},null,{"v":42,"d":"42.0"},null,{"v":30.833333333333332,"d":"30.8"},{"v":36.166666666666664,"d":"36.2"},{"v":47.333333333333336,"d":"47.3"},{"v":87.16666666666667,"d":"87.2"},{"v":37.333333333333336,"d":"37.3"},{"v":29.333333333333332,"d":"29.3"},{"v":34,"d":"34.0"},{"v":22.666666666666668,"d":"22.7"},{"v":115.33333333333333,"d":"115.3"},{"v":50,"d":"50.0"},{"v":44.333333333333336,"d":"44.3"},{"v":39.333333333333336,"d":"39.3"},{"v":57.833333333333336,"d":"57.8"},{"v":50.666666666666664,"d":"50.7"},{"v":101.66666666666667,"d":"101.7"},{"v":26.666666666666668,"d":"26.7"},{"v":39,"d":"39.0"},{"v":33,"d":"33.0"},{"v":63,"d":"63.0"},{"v":89.33333333333333,"d":"89.3"},{"v":56.666666666666664,"d":"56.7"},{"v":61.833333333333336,"d":"61.8"},{"v":40.333333333333336,"d":"40.3"},{"v":67.33333333333333,"d":"67.3"},{"v":33,"d":"33.0"},42.5,{"v":29.666666666666668,"d":"29.7"},{"v":64.66666666666667,"d":"64.7"},{"v":65.33333333333333,"d":"65.3"},52.5,{"v":56,"d":"56.0"},{"v":90.66666666666667,"d":"90.7"},{"v":52.333333333333336,"d":"52.3"},{"v":47,"d":"47.0"},{"v":55,"d":"55.0"},{"v":46.166666666666664,"d":"46.2"},{"v":39.666666666666664,"d":"39.7"},{"v":64,"d":"64.0"},{"v":94.33333333333333,"d":"94.3"},{"v":56,"d":"56.0"},{"v":35,"d":"35.0"},{"v":40.333333333333336,"d":"40.3"},{"v":36.666666666666664,"d":"36.7"},null,{"v":88,"d":"88.0"},{"v":37.666666666666664,"d":"37.7"},{"v":89.33333333333333,"d":"89.3"},{"v":30.333333333333332,"d":"30.3"},{"v":51,"d":"51.0"},{"v":36.666666666666664,"d":"36.7"},{"v":52,"d":"52.0"},{"v":57,"d":"57.0"},{"v":69.83333333333333,"d":"69.8"},{"v":80,"d":"80.0"},{"v":52.333333333333336,"d":"52.3"},{"v":33,"d":"33.0"},{"v":32.166666666666664,"d":"32.2"},{"v":36.666666666666664,"d":"36.7"},{"v":56.666666666666664,"d":"56.7"},60.5,{"v":55,"d":"55.0"},{"v":70.66666666666667,"d":"70.7"},{"v":23.666666666666668,"d":"23.7"},{"v":23.333333333333332,"d":"23.3"},{"v":46.333333333333336,"d":"46.3"},{"v":64.33333333333333,"d":"64.3"},{"v":65,"d":"65.0"},{"v":69,"d":"69.0"},null,{"v":42.666666666666664,"d":"42.7"},{"v":57.333333333333336,"d":"57.3"},{"v":118,"d":"118.0"},{"v":65,"d":"65.0"},48.7,{"v":49.166666666666664,"d":"49.2"},{"v":29,"d":"29.0"},{"v":37.666666666666664,"d":"37.7"},{"v":49,"d":"49.0"},{"v":78.83333333333333,"d":"78.8"},{"v":27.666666666666668,"d":"27.7"},{"v":41.333333333333336,"d":"41.3"},{"v":42.666666666666664,"d":"42.7"},{"v":29.333333333333332,"d":"29.3"},{"v":19.333333333333332,"d":"19.3"},null,{"v":54,"d":"54.0"},{"v":80,"d":"80.0"},{"v":75.33333333333333,"d":"75.3"},null,{"v":22.333333333333332,"d":"22.3"},{"v":62.666666666666664,"d":"62.7"},25.5,{"v":27.666666666666668,"d":"27.7"},{"v":70,"d":"70.0"},{"v":39.166666666666664,"d":"39.2"},{"v":65.33333333333333,"d":"65.3"},null,{"v":40.666666666666664,"d":"40.7"},{"v":64.33333333333333,"d":"64.3"},{"v":55,"d":"55.0"},49.5,{"v":26.333333333333332,"d":"26.3"},{"v":43,"d":"43.0"},null,{"v":69.83333333333333,"d":"69.8"},{"v":56.666666666666664,"d":"56.7"},{"v":49.666666666666664,"d":"49.7"},{"v":40,"d":"40.0"},{"v":46,"d":"46.0"},{"v":26.333333333333332,"d":"26.3"},{"v":38.666666666666664,"d":"38.7"},{"v":86,"d":"86.0"},{"v":44,"d":"44.0"},{"v":50.666666666666664,"d":"50.7"},{"v":32,"d":"32.0"},{"v":34.666666666666664,"d":"34.7"},{"v":62,"d":"62.0"},{"v":77.33333333333333,"d":"77.3"},{"v":53.833333333333336,"d":"53.8"},{"v":52.666666666666664,"d":"52.7"},{"v":53.57,"d":"53.6"},{"v":46.666666666666664,"d":"46.7"},{"v":36.166666666666664,"d":"36.2"},{"v":44.666666666666664,"d":"44.7"},{"v":32,"d":"32.0"},null,{"v":76.66666666666667,"d":"76.7"},{"v":28.666666666666668,"d":"28.7"},{"v":36.666666666666664,"d":"36.7"},{"v":41,"d":"41.0"},{"v":48.666666666666664,"d":"48.7"},{"v":51.833333333333336,"d":"51.8"},{"v":34,"d":"34.0"},{"v":54.333333333333336,"d":"54.3"},{"v":35.333333333333336,"d":"35.3"},{"v":68.66666666666667,"d":"68.7"},{"v":37.333333333333336,"d":"37.3"},{"v":66.33333333333333,"d":"66.3"},{"v":47.666666666666664,"d":"47.7"},{"v":50.333333333333336,"d":"50.3"},{"v":59,"d":"59.0"},{"v":52.666666666666664,"d":"52.7"},{"v":22,"d":"22.0"},{"v":54,"d":"54.0"},{"v":50,"d":"50.0"},null,{"v":50.666666666666664,"d":"50.7"},{"v":64,"d":"64.0"},{"v":46,"d":"46.0"},{"v":61,"d":"61.0"},{"v":61.333333333333336,"d":"61.3"},{"v":32.166666666666664,"d":"32.2"},{"v":49.333333333333336,"d":"49.3"},{"v":63,"d":"63.0"},{"v":31.666666666666668,"d":"31.7"},{"v":67,"d":"67.0"},{"v":61,"d":"61.0"},{"v":54.333333333333336,"d":"54.3"},{"v":59.666666666666664,"d":"59.7"},null,30.5,{"v":45.333333333333336,"d":"45.3"},{"v":37.333333333333336,"d":"37.3"},{"v":31.666666666666668,"d":"31.7"},{"v":37,"d":"37.0"},{"v":28,"d":"28.0"},{"v":32.333333333333336,"d":"32.3"},{"v":45.666666666666664,"d":"45.7"},{"v":68.33333333333333,"d":"68.3"},{"v":46,"d":"46.0"},{"v":40.666666666666664,"d":"40.7"},{"v":51,"d":"51.0"},null,{"v":25.666666666666668,"d":"25.7"},{"v":44.666666666666664,"d":"44.7"},{"v":29.666666666666668,"d":"29.7"},50.5,{"v":43.666666666666664,"d":"43.7"},{"v":51.333333333333336,"d":"51.3"},{"v":74.83333333333333,"d":"74.8"},{"v":23,"d":"23.0"},{"v":40.666666666666664,"d":"40.7"},{"v":102.66666666666667,"d":"102.7"},{"v":47.333333333333336,"d":"47.3"},{"v":59,"d":"59.0"},{"v":71.33333333333333,"d":"71.3"},54.5,{"v":34.333333333333336,"d":"34.3"},{"v":52.333333333333336,"d":"52.3"},{"v":74,"d":"74.0"},{"v":62.333333333333336,"d":"62.3"},{"v":39,"d":"39.0"},{"v":42.666666666666664,"d":"42.7"},{"v":91.33333333333333,"d":"91.3"},{"v":48.166666666666664,"d":"48.2"},{"v":47.333333333333336,"d":"47.3"},{"v":54,"d":"54.0"},{"v":32.666666666666664,"d":"32.7"},null,{"v":56.666666666666664,"d":"56.7"},{"v":54,"d":"54.0"},{"v":17.666666666666668,"d":"17.7"},{"v":80.66666666666667,"d":"80.7"},{"v":26,"d":"26.0"}]
["Farm worker (<  80; 80 - 128; > 128)",null,{"v":90,"d":"90.0"},{"v":150,"d":"150.0"},{"v":40,"d":"40.0"},{"v":32,"d":"32.0"},{"v":60,"d":"60.0"},{"v":80,"d":"80.0"},{"v":48,"d":"48.0"},{"v":56,"d":"56.0"},{"v":56,"d":"56.0"},{"v":24,"d":"24.0"},{"v":80,"d":"80.0"},null,{"v":64,"d":"64.0"},{"v":24,"d":"24.0"},null,{"v":80,"d":"80.0"},{"v":120,"d":"120.0"},{"v":80,"d":"80.0"},{"v":80,"d":"80.0"},{"v":56,"d":"56.0"},{"v":64,"d":"64.0"},{"v":72,"d":"72.0"},{"v":56,"d":"56.0"},{"v":80,"d":"80.0"},{"v":32,"d":"32.0"},{"v":80,"d":"80.0"},{"v":64,"d":"64.0"},{"v":60,"d":"60.0"},{"v":80,"d":"80.0"},{"v":32,"d":"32.0"},{"v":32,"d":"32.0"},{"v":72,"d":"72.0"},{"v":48,"d":"48.0"},{"v":80,"d":"80.0"},{"v":72,"d":"72.0"},{"v":250,"d":"250.0"},{"v":90,"d":"90.0"},{"v":80,"d":"80.0"},{"v":80,"d":"80.0"},{"v":70,"d":"70.0"},{"v":64,"d":"64.0"},{"v":64,"d":"64.0"},null,{"v":48,"d":"48.0"},null,{"v":48,"d":"48.0"},{"v":64,"d":"64.0"},{"v":80,"d":"80.0"},{"v":105,"d":"105.0"},{"v":64,"d":"64.0"},{"v":48,"d":"48.0"},{"v":60,"d":"60.0"},{"v":32,"d":"32.0"},{"v":100,"d":"100.0"},{"v":64,"d":"64.0"},{"v":64,"d":"64.0"},{"v":64,"d":"64.0"},{"v":40,"d":"40.0"},{"v":80,"d":"80.0"},{"v":80,"d":"80.0"},{"v":32,"d":"32.0"},{"v":64,"d":"64.0"},{"v":60,"d":"60.0"},{"v":80,"d":"80.0"},{"v":100,"d":"100.0"},{"v":72,"d":"72.0"},{"v":100,"d":"100.0"},{"v":72,"d":"72.0"},{"v":80,"d":"80.0"},{"v":28,"d":"28.0"},{"v":72,"d":"72.0"},{"v":32,"d":"32.0"},{"v":72,"d":"72.0"},{"v":100,"d":"100.0"},{"v":70,"d":"70.0"},{"v":64,"d":"64.0"},{"v":72,"d":"72.0"},{"v":48,"d":"48.0"},{"v":32,"d":"32.0"},{"v":80,"d":"80.0"},{"v":60,"d":"60.0"},{"v":56,"d":"56.0"},{"v":72,"d":"72.0"},{"v":100,"d":"100.0"},{"v":60,"d":"60.0"},{"v":64,"d":"64.0"},{"v":60,"d":"60.0"},{"v":64,"d":"64.0"},null,{"v":80,"d":"80.0"},{"v":56,"d":"56.0"},{"v":135,"d":"135.0"},{"v":48,"d":"48.0"},{"v":48,"d":"48.0"},{"v":48,"d":"48.0"},{"v":64,"d":"64.0"},{"v":70,"d":"70.0"},{"v":128,"d":"128.0"},{"v":105,"d":"105.0"},{"v":80,"d":"80.0"},{"v":56,"d":"56.0"},{"v":32,"d":"32.0"},{"v":64,"d":"64.0"},{"v":64,"d":"64.0"},{"v":70,"d":"70.0"},{"v":72,"d":"72.0"},{"v":100,"d":"100.0"},{"v":32,"d":"32.0"},{"v":32,"d":"32.0"},{"v":80,"d":"80.0"},{"v":64,"d":"64.0"},{"v":72,"d":"72.0"},{"v":64,"d":"64.0"},null,{"v":80,"d":"80.0"},{"v":40,"d":"40.0"},{"v":150,"d":"150.0"},{"v":72,"d":"72.0"},{"v":90,"d":"90.0"},{"v":96,"d":"96.0"},{"v":32,"d":"32.0"},{"v":64,"d":"64.0"},{"v":90,"d":"90.0"},{"v":120,"d":"120.0"},{"v":60,"d":"60.0"},{"v":80,"d":"80.0"},{"v":80,"d":"80.0"},{"v":56,"d":"56.0"},{"v":24,"d":"24.0"},null,{"v":80,"d":"80.0"},{"v":100,"d":"100.0"},{"v":80,"d":"80.0"},null,{"v":32,"d":"32.0"},{"v":80,"d":"80.0"},{"v":32,"d":"32.0"},{"v":32,"d":"32.0"},{"v":60,"d":"60.0"},{"v":60,"d":"60.0"},{"v":70,"d":"70.0"},null,{"v":80,"d":"80.0"},{"v":80,"d":"80.0"},{"v":90,"d":"90.0"},{"v":80,"d":"80.0"},{"v":48,"d":"48.0"},{"v":80,"d":"80.0"},null,{"v":84,"d":"84.0"},{"v":80,"d":"80.0"},{"v":72,"d":"72.0"},{"v":60,"d":"60.0"},{"v":80,"d":"80.0"},{"v":14,"d":"14.0"},{"v":64,"d":"64.0"},{"v":72,"d":"72.0"},{"v":80,"d":"80.0"},{"v":60,"d":"60.0"},{"v":36,"d":"36.0"},{"v":60,"d":"60.0"},{"v":64,"d":"64.0"},{"v":120,"d":"120.0"},{"v":70,"d":"70.0"},{"v":64,"d":"64.0"},{"v":74,"d":"74.0"},{"v":80,"d":"80.0"},{"v":30,"d":"30.0"},{"v":80,"d":"80.0"},{"v":64,"d":"64.0"},null,{"v":80,"d":"80.0"},{"v":48,"d":"48.0"},{"v":40,"d":"40.0"},{"v":80,"d":"80.0"},{"v":60,"d":"60.0"},{"v":64,"d":"64.0"},{"v":48,"d":"48.0"},{"v":64,"d":"64.0"},{"v":48,"d":"48.0"},{"v":100,"d":"100.0"},{"v":64,"d":"64.0"},{"v":90,"d":"90.0"},{"v":90,"d":"90.0"},{"v":90,"d":"90.0"},{"v":72,"d":"72.0"},{"v":70,"d":"70.0"},{"v":32,"d":"32.0"},{"v":90,"d":"90.0"},{"v":90,"d":"90.0"},null,{"v":80,"d":"80.0"},{"v":90,"d":"90.0"},{"v":80,"d":"80.0"},{"v":90,"d":"90.0"},{"v":80,"d":"80.0"},{"v":56,"d":"56.0"},{"v":80,"d":"80.0"},{"v":96,"d":"96.0"},{"v":60,"d":"60.0"},{"v":80,"d":"80.0"},{"v":64,"d":"64.0"},{"v":64,"d":"64.0"},{"v":80,"d":"80.0"},null,{"v":48,"d":"48.0"},{"v":64,"d":"64.0"},{"v":60,"d":"60.0"},{"v":60,"d":"60.0"},{"v":64,"d":"64.0"},{"v":32,"d":"32.0"},{"v":60,"d":"60.0"},{"v":70,"d":"70.0"},{"v":80,"d":"80.0"},{"v":72,"d":"72.0"},{"v":64,"d":"64.0"},{"v":80,"d":"80.0"},null,{"v":36,"d":"36.0"},{"v":56,"d":"56.0"},{"v":32,"d":"32.0"},{"v":70,"d":"70.0"},{"v":40,"d":"40.0"},{"v":64,"d":"64.0"},{"v":80,"d":"80.0"},{"v":48,"d":"48.0"},{"v":80,"d":"80.0"},{"v":200,"d":"200.0"},{"v":64,"d":"64.0"},{"v":64,"d":"64.0"},{"v":64,"d":"64.0"},{"v":90,"d":"90.0"},{"v":28,"d":"28.0"},{"v":100,"d":"100.0"},{"v":100,"d":"100.0"},{"v":100,"d":"100.0"},{"v":64,"d":"64.0"},{"v":32,"d":"32.0"},{"v":100,"d":"100.0"},{"v":90,"d":"90.0"},{"v":40,"d":"40.0"},{"v":80,"d":"80.0"},{"v":32,"d":"32.0"},null,{"v":80,"d":"80.0"},{"v":70,"d":"70.0"},{"v":24,"d":"24.0"},{"v":80,"d":"80.0"},{"v":32,"d":"32.0"}]
["Consumer (< 20,5; 20,5 - 36,25; > 36,25)",null,{"v":9,"d":"9.0"},19.5,{"v":33,"d":"33.0"},{"v":15,"d":"15.0"},{"v":8,"d":"8.0"},{"v":32,"d":"32.0"},{"v":11,"d":"11.0"},{"v":9,"d":"9.0"},{"v":20,"d":"20.0"},{"v":7,"d":"7.0"},13.5,null,{"v":10,"d":"10.0"},{"v":6,"d":"6.0"},null,{"v":18,"d":"18.0"},{"v":13,"d":"13.0"},{"v":13,"d":"13.0"},{"v":19,"d":"19.0"},{"v":21,"d":"21.0"},{"v":16,"d":"16.0"},{"v":45,"d":"45.0"},{"v":26,"d":"26.0"},{"v":32,"d":"32.0"},{"v":9,"d":"9.0"},{"v":13,"d":"13.0"},{"v":50,"d":"50.0"},8.5,13.5,{"v":7,"d":"7.0"},{"v":13,"d":"13.0"},{"v":56,"d":"56.0"},{"v":12,"d":"12.0"},{"v":63,"d":"63.0"},{"v":16,"d":"16.0"},20.5,15.5,{"v":13,"d":"13.0"},39.5,{"v":32,"d":"32.0"},{"v":28,"d":"28.0"},{"v":11,"d":"11.0"},null,{"v":39,"d":"39.0"},null,{"v":8,"d":"8.0"},{"v":13,"d":"13.0"},{"v":12,"d":"12.0"},19.5,{"v":10,"d":"10.0"},{"v":6,"d":"6.0"},10.5,{"v":8,"d":"8.0"},{"v":78,"d":"78.0"},{"v":25,"d":"25.0"},{"v":27,"d":"27.0"},{"v":10,"d":"10.0"},{"v":24,"d":"24.0"},{"v":14,"d":"14.0"},{"v":63,"d":"63.0"},{"v":6,"d":"6.0"},{"v":9,"d":"9.0"},{"v":18,"d":"18.0"},13.5,70.5,{"v":38,"d":"38.0"},25.5,{"v":8,"d":"8.0"},{"v":16,"d":"16.0"},{"v":4,"d":"4.0"},{"v":14,"d":"14.0"},{"v":10,"d":"10.0"},{"v":50,"d":"50.0"},{"v":17,"d":"17.0"},26.5,{"v":38,"d":"38.0"},{"v":52,"d":"52.0"},{"v":9,"d":"9.0"},{"v":9,"d":"9.0"},{"v":14,"d":"14.0"},15.5,{"v":19,"d":"19.0"},{"v":13,"d":"13.0"},{"v":77,"d":"77.0"},{"v":11,"d":"11.0"},{"v":11,"d":"11.0"},{"v":6,"d":"6.0"},{"v":10,"d":"10.0"},null,{"v":50,"d":"50.0"},{"v":21,"d":"21.0"},14.5,{"v":5,"d":"5.0"},{"v":7,"d":"7.0"},{"v":20,"d":"20.0"},{"v":17,"d":"17.0"},{"v":16,"d":"16.0"},{"v":12,"d":"12.0"},{"v":17,"d":"17.0"},{"v":19,"d":"19.0"},{"v":23,"d":"23.0"},{"v":8,"d":"8.0"},{"v":10,"d":"10.0"},{"v":15,"d":"15.0"},19.5,{"v":19,"d":"19.0"},{"v":21,"d":"21.0"},{"v":10,"d":"10.0"},{"v":8,"d":"8.0"},15.5,{"v":51,"d":"51.0"},{"v":57,"d":"57.0"},{"v":40,"d":"40.0"},null,{"v":14,"d":"14.0"},{"v":33,"d":"33.0"},{"v":78,"d":"78.0"},{"v":57,"d":"57.0"},15.5,{"v":18,"d":"18.0"},{"v":9,"d":"9.0"},{"v":29,"d":"29.0"},{"v":18,"d":"18.0"},13.5,{"v":8,"d":"8.0"},{"v":12,"d":"12.0"},{"v":12,"d":"12.0"},{"v":11,"d":"11.0"},{"v":6,"d":"6.0"},null,{"v":16,"d":"16.0"},{"v":62,"d":"62.0"},{"v":64,"d":"64.0"},null,{"v":9,"d":"9.0"},{"v":20,"d":"20.0"},{"v":11,"d":"11.0"},{"v":13,"d":"13.0"},{"v":48,"d":"48.0"},15.5,{"v":17,"d":"17.0"},null,{"v":14,"d":"14.0"},{"v":47,"d":"47.0"},{"v":18,"d":"18.0"},14.5,{"v":7,"d":"7.0"},{"v":16,"d":"16.0"},null,{"v":15,"d":"15.0"},{"v":18,"d":"18.0"},{"v":31,"d":"31.0"},{"v":7,"d":"7.0"},{"v":13,"d":"13.0"},{"v":8,"d":"8.0"},{"v":12,"d":"12.0"},{"v":56,"d":"56.0"},{"v":13,"d":"13.0"},13.5,{"v":18,"d":"18.0"},{"v":9,"d":"9.0"},{"v":44,"d":"44.0"},{"v":13,"d":"13.0"},26.5,{"v":19,"d":"19.0"},10.4,{"v":13,"d":"13.0"},15.5,{"v":14,"d":"14.0"},{"v":11,"d":"11.0"},null,{"v":63,"d":"63.0"},{"v":10,"d":"10.0"},{"v":10,"d":"10.0"},{"v":13,"d":"13.0"},{"v":17,"d":"17.0"},{"v":44,"d":"44.0"},{"v":8,"d":"8.0"},{"v":17,"d":"17.0"},{"v":12,"d":"12.0"},{"v":26,"d":"26.0"},{"v":14,"d":"14.0"},13.5,{"v":7,"d":"7.0"},{"v":19,"d":"19.0"},{"v":39,"d":"39.0"},{"v":12,"d":"12.0"},{"v":9,"d":"9.0"},40.5,{"v":7,"d":"7.0"},null,{"v":18,"d":"18.0"},{"v":48,"d":"48.0"},{"v":13,"d":"13.0"},18.5,{"v":47,"d":"47.0"},{"v":9,"d":"9.0"},{"v":32,"d":"32.0"},{"v":53,"d":"53.0"},{"v":19,"d":"19.0"},{"v":47,"d":"47.0"},{"v":13,"d":"13.0"},{"v":39,"d":"39.0"},{"v":37,"d":"37.0"},null,{"v":9,"d":"9.0"},{"v":20,"d":"20.0"},{"v":13,"d":"13.0"},{"v":8,"d":"8.0"},{"v":15,"d":"15.0"},{"v":8,"d":"8.0"},{"v":13,"d":"13.0"},8.5,{"v":13,"d":"13.0"},{"v":11,"d":"11.0"},{"v":9,"d":"9.0"},{"v":24,"d":"24.0"},null,{"v":10,"d":"10.0"},{"v":22,"d":"22.0"},{"v":7,"d":"7.0"},39.5,{"v":31,"d":"31.0"},{"v":20,"d":"20.0"},{"v":55,"d":"55.0"},{"v":8,"d":"8.0"},{"v":14,"d":"14.0"},{"v":33,"d":"33.0"},{"v":15,"d":"15.0"},{"v":38,"d":"38.0"},{"v":50,"d":"50.0"},14.5,{"v":19,"d":"19.0"},{"v":20,"d":"20.0"},{"v":17,"d":"17.0"},{"v":48,"d":"48.0"},{"v":11,"d":"11.0"},{"v":5,"d":"5.0"},{"v":78,"d":"78.0"},16.5,{"v":33,"d":"33.0"},{"v":32,"d":"32.0"},{"v":9,"d":"9.0"},null,{"v":16,"d":"16.0"},{"v":16,"d":"16.0"},{"v":5,"d":"5.0"},{"v":63,"d":"63.0"},{"v":6,"d":"6.0"}]
["Ecology (< 75; 75 - 136,5; > 136,5)",null,{"v":17,"d":"17.0"},{"v":155,"d":"155.0"},{"v":69,"d":"69.0"},{"v":66,"d":"66.0"},{"v":30,"d":"30.0"},{"v":46,"d":"46.0"},{"v":36,"d":"36.0"},{"v":85,"d":"85.0"},{"v":26,"d":"26.0"},{"v":27,"d":"27.0"},95.5,null,{"v":44,"d":"44.0"},34.5,null,65.5,{"v":36,"d":"36.0"},{"v":30,"d":"30.0"},{"v":51,"d":"51.0"},{"v":39,"d":"39.0"},{"v":29,"d":"29.0"},{"v":72,"d":"72.0"},{"v":42,"d":"42.0"},{"v":98,"d":"98.0"},{"v":34,"d":"34.0"},{"v":36,"d":"36.0"},{"v":98,"d":"98.0"},83.5,{"v":115,"d":"115.0"},{"v":30,"d":"30.0"},{"v":47,"d":"47.0"},{"v":96,"d":"96.0"},{"v":40,"d":"40.0"},{"v":84,"d":"84.0"},{"v":76,"d":"76.0"},{"v":159,"d":"159.0"},{"v":48,"d":"48.0"},{"v":81,"d":"81.0"},62.5,{"v":104,"d":"104.0"},{"v":30,"d":"30.0"},{"v":33,"d":"33.0"},null,{"v":39,"d":"39.0"},null,36.5,31.5,{"v":50,"d":"50.0"},{"v":137,"d":"137.0"},{"v":38,"d":"38.0"},{"v":34,"d":"34.0"},31.5,{"v":28,"d":"28.0"},{"v":168,"d":"168.0"},{"v":61,"d":"61.0"},{"v":42,"d":"42.0"},{"v":44,"d":"44.0"},109.5,{"v":58,"d":"58.0"},{"v":162,"d":"162.0"},{"v":42,"d":"42.0"},{"v":44,"d":"44.0"},{"v":21,"d":"21.0"},95.5,97.5,{"v":60,"d":"60.0"},{"v":60,"d":"60.0"},{"v":41,"d":"41.0"},{"v":106,"d":"106.0"},{"v":67,"d":"67.0"},41.5,{"v":47,"d":"47.0"},{"v":72,"d":"72.0"},{"v":79,"d":"79.0"},{"v":61,"d":"61.0"},{"v":66,"d":"66.0"},{"v":148,"d":"148.0"},{"v":100,"d":"100.0"},{"v":100,"d":"100.0"},{"v":71,"d":"71.0"},{"v":63,"d":"63.0"},{"v":44,"d":"44.0"},{"v":107,"d":"107.0"},{"v":106,"d":"106.0"},{"v":97,"d":"97.0"},{"v":30,"d":"30.0"},{"v":55,"d":"55.0"},{"v":36,"d":"36.0"},null,{"v":134,"d":"134.0"},{"v":36,"d":"36.0"},118.5,{"v":38,"d":"38.0"},{"v":98,"d":"98.0"},{"v":42,"d":"42.0"},{"v":75,"d":"75.0"},{"v":85,"d":"85.0"},69.5,{"v":118,"d":"118.0"},{"v":58,"d":"58.0"},{"v":20,"d":"20.0"},56.5,{"v":36,"d":"36.0"},{"v":91,"d":"91.0"},{"v":92,"d":"92.0"},{"v":74,"d":"74.0"},{"v":91,"d":"91.0"},{"v":29,"d":"29.0"},{"v":30,"d":"30.0"},43.5,{"v":78,"d":"78.0"},{"v":66,"d":"66.0"},{"v":103,"d":"103.0"},null,{"v":34,"d":"34.0"},{"v":99,"d":"99.0"},{"v":126,"d":"126.0"},{"v":66,"d":"66.0"},40.5,33.5,{"v":46,"d":"46.0"},{"v":20,"d":"20.0"},{"v":39,"d":"39.0"},{"v":103,"d":"103.0"},{"v":15,"d":"15.0"},{"v":32,"d":"32.0"},{"v":36,"d":"36.0"},{"v":21,"d":"21.0"},{"v":28,"d":"28.0"},null,{"v":66,"d":"66.0"},{"v":78,"d":"78.0"},{"v":82,"d":"82.0"},null,{"v":26,"d":"26.0"},{"v":88,"d":"88.0"},33.5,{"v":38,"d":"38.0"},{"v":102,"d":"102.0"},{"v":42,"d":"42.0"},{"v":109,"d":"109.0"},null,{"v":28,"d":"28.0"},{"v":66,"d":"66.0"},{"v":57,"d":"57.0"},{"v":54,"d":"54.0"},{"v":24,"d":"24.0"},{"v":33,"d":"33.0"},null,110.5,{"v":72,"d":"72.0"},{"v":46,"d":"46.0"},{"v":53,"d":"53.0"},{"v":45,"d":"45.0"},{"v":57,"d":"57.0"},{"v":40,"d":"40.0"},{"v":130,"d":"130.0"},{"v":39,"d":"39.0"},78.5,{"v":42,"d":"42.0"},{"v":35,"d":"35.0"},{"v":78,"d":"78.0"},{"v":99,"d":"99.0"},{"v":65,"d":"65.0"},{"v":75,"d":"75.0"},76.3,{"v":47,"d":"47.0"},{"v":63,"d":"63.0"},{"v":40,"d":"40.0"},{"v":21,"d":"21.0"},null,{"v":87,"d":"87.0"},{"v":28,"d":"28.0"},{"v":60,"d":"60.0"},{"v":30,"d":"30.0"},{"v":69,"d":"69.0"},47.5,{"v":46,"d":"46.0"},{"v":82,"d":"82.0"},{"v":46,"d":"46.0"},{"v":80,"d":"80.0"},{"v":34,"d":"34.0"},95.5,{"v":46,"d":"46.0"},{"v":42,"d":"42.0"},{"v":66,"d":"66.0"},{"v":76,"d":"76.0"},{"v":25,"d":"25.0"},31.5,{"v":53,"d":"53.0"},null,{"v":54,"d":"54.0"},{"v":54,"d":"54.0"},{"v":45,"d":"45.0"},74.5,{"v":57,"d":"57.0"},31.5,{"v":36,"d":"36.0"},{"v":40,"d":"40.0"},{"v":16,"d":"16.0"},{"v":74,"d":"74.0"},{"v":106,"d":"106.0"},{"v":60,"d":"60.0"},{"v":62,"d":"62.0"},null,34.5,{"v":52,"d":"52.0"},{"v":39,"d":"39.0"},{"v":27,"d":"27.0"},{"v":32,"d":"32.0"},{"v":44,"d":"44.0"},{"v":24,"d":"24.0"},58.5,{"v":112,"d":"112.0"},{"v":55,"d":"55.0"},{"v":49,"d":"49.0"},{"v":49,"d":"49.0"},null,{"v":31,"d":"31.0"},{"v":56,"d":"56.0"},{"v":50,"d":"50.0"},{"v":42,"d":"42.0"},{"v":60,"d":"60.0"},{"v":70,"d":"70.0"},89.5,{"v":13,"d":"13.0"},{"v":28,"d":"28.0"},{"v":75,"d":"75.0"},{"v":63,"d":"63.0"},{"v":75,"d":"75.0"},{"v":100,"d":"100.0"},{"v":59,"d":"59.0"},{"v":56,"d":"56.0"},{"v":37,"d":"37.0"},{"v":105,"d":"105.0"},{"v":39,"d":"39.0"},{"v":42,"d":"42.0"},{"v":91,"d":"91.0"},{"v":96,"d":"96.0"},{"v":38,"d":"38.0"},{"v":69,"d":"69.0"},{"v":50,"d":"50.0"},{"v":57,"d":"57.0"},null,{"v":74,"d":"74.0"},{"v":76,"d":"76.0"},{"v":24,"d":"24.0"},{"v":99,"d":"99.0"},{"v":40,"d":"40.0"}]
["PAN International consolidated list of banned pesticides - EU (X)",{"$nulls":3},"x",null,"x",null,"x","x",null,"x","x",null,null,"x","x",null,"x","x","x",{"$nulls":3},"x","x",{"$nulls":3},"x","x",{"$nulls":3},"x",null,null,"x",null,"x","x","x",null,null,"x",null,"x","x",null,"x","x",{"$nulls":4},"x",{"$nulls":5},"x","x",null,null,"x","x",{"$nulls":4},"x",{"$nulls":4},"x",null,"x","x","x",null,"x",null,null,"x",null,"x",{"$nulls":3},"x","x","x",null,"x","x",{"$nulls":3},"x",{"$nulls":7},"x","x",{"$nulls":11},"x",{"$nulls":4},"x",{"$nulls":3},"x","x",{"$nulls":3},"x","x","x","x",null,"x","x",{"$nulls":4},"x",null,null,"x","x",null,"x","x","x","x",{"$nulls":8},"x","x",null,"x",null,"x",{"$nulls":5},"x","x","x",null,null,"x",{"$nulls":3},"x","x",null,"x",null,null,"x","x","x","x",null,"x","x","x","x",null,null,"x",{"$nulls":4},"x",null,null,"x",null,null,"x","x",{"$nulls":5},"x",{"$nulls":5},"x",null,null,"x","x",{"$nulls":3},"x","x",null,"x","x","x","x","x",null,"x",null,null,"x","x","x"]
["Number of active principle registered in Brazil (2019-2022)",null,49,14,11,25,{"$nulls":6},6,2,4,31,10,{"$nulls":3},52,null,null,66,{"$nulls":4},5,1,41,6,2,5,null,null,2,null,3,null,17,null,null,3,1,4,14,2,15,28,27,24,null,24,1,1,4,6,null,11,null,6,null,null,8,3,44,3,null,null,3,13,31,2,38,13,null,10,9,4,22,null,24,null,1,8,1,{"$nulls":4},1,null,1,null,null,3,3,null,null,49,1,null,4,2,16,4,10,1,null,null,26,null,4,1,1,26,1,10,13,1,12,null,1,null,null,64,44,3,null,6,30,1,1,2,10,9,null,19,null,25,null,23,4,null,1,1,4,22,1,2,19,null,10,9,33,5,null,5,22,null,8,{"$nulls":3},19,11,null,null,29,6,6,null,null,12,10,null,null,6,1,null,null,2,2,1,null,27,13,null,1,3,5,{"$nulls":3},3,null,3,null,27,5,7,24,null,1,17,null,5,null,3,null,2,null,14,null,null,20,1,33,null,3,12,2,35,null,17,{"$nulls":4},6,2,8,1,13,2,13,17,2,5,null,22,2,11,2,null,3,null,16]
["* Environmental Impact Quocient (Kovach et al., 1992)"]
["DATABASE (QUESTIONNAIRE; INDICATORS; REPORT)",null,"S2DATA","S3INTERVIEWER_NAME","S3INTERVIEWER_ID","S4FARMER_NAME","S4FARMER_ID","S4FARMER_AGE","S5FARM_LOCATION","S5Municipality ","S5STATE","S5Watershed","S6OWNERSHIP","S6Succession_process","S6WOMEN_PARTICIPATION","S7Farm_identification","S7AREA","S7Small_scale_agriculture","S7Non_contiguous_areas","S7Non_contiguous_areas_ha","S8Permanent_crops","S8Annual_crops","S8Pastures","S8Forestry","S8Non_agricultural_area","S8Fallow","S8Water_courses","S8Native_vegetation","S8Unsuitable_areas","S8Total_Area","S9PPA_AREA_TOTAL","S9PPA_area_to_be_recovered","S10CONSERVATION_RESERVE_AREA_CRA","S10Native_vegetation_exceeding_CRA","S11Water_courses","S11Springs","S11Natural_lakes_ponds","S11Dams","S11USE_OF_SUPERFICIAL_WATER","S11USE_OF_UNDERGROUND_WATER","S11Water_quality_availability_problems","S11PROBLEMS.DESCRIPTION","S12Water_Use_Regularization ","S12Environmental_License","S13FARM_CRITICAL_POINT1","S13FARM_CRITICAL_POINT2","S13FARM_CRITICAL_POINT3","I1GROSS_INCOME_ACTIVITY1_DESCRIPTION","I1GROSS_INCOME_ACTIVITY1","I1GROSS_INCOME_ACTIVITY2_DESCRIPTION","I1GROSS_INCOME_ACTIVITY2","I1GROSS_INCOME_ACTIVITY3_DESCRIPTION","I1GROSS_INCOME_ACTIVITY3","I1ACTIVITY1_DESCRIPTION","I1ACTIVITY1_UNIT","I1ACTIVITY1_PRODUCTIVITY","I1ACTIVITY1_SALES_PRICE","I1ACTIVITY1_REGIONAL_PRODUCTIVITY","I1ACTIVITY1_REGIONAL_SALES_PRICE","I1ACTIVITY2_DESCRIPTION","I1ACTIVITY2_UNIT","I1ACTIVITY2_PRODUCTIVITY","I1ACTIVITY2_SALES_PRICE","I1ACTIVITY2_REGIONAL_PRODUCTIVITY","I1ACTIVITY2_REGIONAL_SALES_PRICE","I1ACTIVITY3_DESCRIPTION","I1ACTIVITY3_UNIT","I1ACTIVITY3_PRODUCTIVITY","I1ACTIVITY3_SALES_PRICE","I1ACTIVITY3_REGIONAL_PRODUCTIVITY","I1ACTIVITY3_REGIONAL_SALES_PRICE","I1RESULT","I2Activity1_description","I2Activity1_value","I2Activity2_description","I2Activity2_value","I2Activity3_description","I2Activity3_value","I2Pension_retirement_financial_aid","I2Other_activities","I2Agricultural_livestock_forestry_activities_on_the_farm","I2Other_activities_on_the_farm\t","I2Off-site_activities","I2Retirement_pension_financial_help_other_sources","I2Concentration_in_a_single_activity","I2RESULT","I3EQUITY_DEVELOPMENT_ASSESSMENT_PERIOD","I3Constructions_carried_out_in_the_recent_period_DESCRIPTION","I3RECENT_IMPROVEMENTS_VALUE","I3CONSTUCTIONS_HISTORIC_DESCRIPTION","I3CONSTRUCTIONS_HISTORIC_VALUE","I3CONSTRUCTIONS_TOTAL_VALUE","I3RECENT_EQUIPMENT_DESCRIPTION","I3RECENT_EQUIPMENT_VALUE","I3EQUIPMENT_HISTORIC_DESCRIPTION","I3EQUIPMENT_HISTORIC_VALUE","I3EQUIPMENT_TOTAL_VALUE","I3STOCK_LIVESTOCK_TOTAL_VALUE","I3STOCK_LIVESTOCK_TOTAL_HISTORIC_VALUE","I3IRRIGATION_TYPE","I3IRRIGATION_AREA","I3.4.3.3.IRRIGATION.HISTORIC.AREA","I3TOTAL_LAND_USE","I3TOTAL_LAND_HISTORIC_USE","I3.LAND_VALUE","I3.LAND_HISTORIC_VALUE","I3Estimated_total_asset_values","I3Estimated_total_historic_asset_values","I3ASSET_EVOLUTION_LAND_VALUATION","I3ASSET_EVOLUTION_BUILDINGS","I3ASSET_EVOLUTION_EQUIPMENTS","I3ASSET_EVOLUTION_LIVESTOCK","I3ASSET_EVOLUTION_IRRIGATION_AGRICULTURE_AREA","I3TOTAL_ASSET_EVOLUTION","I3TOTAL_ASSET_EVOLUTION_DISCOUNTING_LAND_APPRECIATION","I3PARTIALRESULT1","I3FINANCING_FINANCIAL_COMMITMENTS_VALUE","I3FINANCING_FINANCIAL_COMMITMENTS_ESTIMATED_ASSET","I3PARTIALRESULT2","I3RESULT","I4NUMBER_OF_RESIDENTS","I4Water_availability","I4Electricity","I4Regular_road_access","I4Access_to_health_care","I4School_transportation","I4Security","I4Internet","I4Waste_collection","I4PARTIAL_RESULT1","I4Vegetables","I4Orchard","I4Milk_eggs_meat_production","I4PARTIAL_RESULT2","I4.RESULT","I5FAMILY_MEMBERS_NUMBER","I5Less_than_9years_of_study","I5Complete_primary_education","I5Complete_high_school","I5College_University","I5Permanent_workers_number","I5Workers_Less_than_9years_of_study","I5Workers_Complete_primary_education","I5Workers_Complete_high_school","I5Workers_College_University","I5Short_training_courses","I5Long_training_courses","I5Workers_short_training_courses","I5Workers_long_training_courses","I5children_number","I5Who_go_to_school","I5Workers_children_number_living_in_the_farm","I5Workers_children_who_go_to_school","I5RESULT","I6Employees_number","I6Employee_registration","I6Overtime_payment_or_abscense_of_overtime","I6Above_minimum_wage","I6Food_supplementation","I6Housing_assistance","I6Education_and_transportation_assistance","I6Profit_sharing","I6Accident_insurance","I6Access_to_leisure","I6Space_for_growing_food","I6Temporary_employees_(%)","I6RESULT","I7Cash_flow","I7Production_cost","I7Access_to_technical_assistance","I7Rural_associations_farmer_participation","I7Environmental_regularization","I7Investment_credit","I7Credit_for_the_farm_activities","I7Credit_for_commercialization","I7RESULT","I8Search_information_diversify_buyers","I8Generates_certified_products_aggregate_value","I8Adoption_of_innovative_techniques","I8Description_innovative_techniques","I8Ability_to_innovate_or_leadership","I8Description_innovative_or_leadership","I8Bioinputs","I8Bioinputs_proportion","I8Cover_crops_perennials_for_shading","I8Cover_crops_perennials_for_shading_proportion","I8RESULT","I9Sewage_destination1","I9Sewage_destination2","I9Garbage_destination1\t","I9Garbage_destination2","I9Composting_reuse_of_organic_solid_waste","I9Adequate_allocation_and_treatment_of_liquid_effluents","I9Adequate_allocation_and_treatment_of_gaseous_effluents","I9Critical_point","I9Critical_point_description","I9.RESULT","I10Plot_identification","I10Clay_content","I10SOM_DAGKG-1","I10SOM","I10P_MGDM-3","I10P","I10Ca_CMOLDM-3","I10Ca","I10Mg_CMOLDM-3","I10Mg","I10K_MGDM-3","I10K","I10PH_UNIT","I10PH","I10.Al_CMOLDM-3","I10.Al","I10CEC_CMOLDM-3","I10CEC","I10BASE_SATURATION_%","I10BASE_SATURATION","I10PARTIAL_RESULT1","I10ARYL_MGPNITROFENOLKG-1H-1","I10BETA_MGPNITROFENOLKG-1H-1","I10SOM_DAGKG-1","I10Biological_soil_quality_index","I10Nutrient_storage_index","I10Nutrient_supply_index","I10Chemical_soil_quality_index","I10FertBio_index","I10PARTIAL_RESULT2","I10.RESULT","I11Degradation_stage","I11Area","I11Area_proportion","I11Trend_of_process_behavior","I11.PARTIALRESULT1","I11Drainage\n","I11Bumps_grooves\n","I11Infiltration_structures\n","I11Holes\n","I11Erosion_grooves\n","I11Critical_point\n","I11Critical_point_description\n","I11.PARTIALRESULT2","I11.RESULT","I12Occupation_of_the_river_banks_upstream\n","I12Occupation_of_the_river_banks_downstream\n","I12Anthropogenic_changes_up\n","I12Anthropogenic_changes_down\n","I12Shading_up\n","I12Shading_down\n","I12Erosion_signals_up\n","I12Erosion_signals_down\n","I12Water_transparency_up\n","I12Water_transparency_down\n","I12Water_odor_up\n","I12Water_odor_down\n","I12Bottom_of_the_river_up\n","I12Bottom_of_the_river_down\n","I12Aquatic_Ecosystem_assessment_results_upstream\n","I12Aquatic_Ecosystem_assessment_results_downstream\n","I12Surface_water_quality_up","I12Surface_water_quality_down","I12Surface_groundwater_quality","I12RESULT","I13Product1\t","I13Land_use_crop1\t","I13Area1","I13Pesticide_volume1","I13Pesticide_total_volume1","I13Product_active_principle1\t","I13Potential_contamination1","I13Field_vulnerability1","I13Contamination_risk1","I13Product2\t","I13Land_use_crop2\t","I13Area2","I13Pesticide_volume2","I13Pesticide_total_volume2","I13Product_active_principle2\t","I13Potential_contamination2","I1Field_vulnerability2","I13Contamination_risk2","I13Product3","I13Land_use_crop3","I13Area3","I13Pesticide_volume3","I13Pesticide_total_volume3","I13Product_active_principle3","I13Potential_contamination3","I143ield_vulnerability3","I13Contamination_risk3","I13Crop_description1","I13Crop_area1","I13Maximum_risk_identified1","I13Crop_description2","I13Crop_area2","I13Maximum_risk_identified2","I13Crop_description2","I13Crop_area2","I13Maximum_risk_identified2","I13.PARTIALRESULT1","I13How_many_people_operate_pesticides","I13Personal_protective_equipment_properly","I13Proper_storage_of_pesticides","I13Return_of_pesticide_packaging","I13.PARTIALRESULT2","I13RESULT","I14Soil_conservation_Sufficient\n\n","I14Soil_conservation_Insufficient\n","I14Soil_conservation_Critical ","I14Critical_situation\n\n","I14Water_conservation_strategies \n\n\n","I14RESULT","I15Practices_that_improve_agrobiodiversity_Sufficient\n\n","I15Practices_that_improve_agrobiodiversity_insufficient\n\n","I15Practices_that_improve_agrobiodiversity_critical\n\n","I15Critical_situation\n\n","I15Partial_result1\n\n\n","I15Shanon_Index","I15Partial_result2\n\n\n","I15High_proportion_of_monocultures","I15.RESULT","I16Phytophysiognomie1\n","I16Phytophysiognomie_sucessional_advanced_stage1\n","I16Phytophysiognomie_sucessional_midle_stage1\n","I16Phytophysiognomie_sucessional_early_stage1\n","I16Phytophysiognomie2\n","I16Phytophysiognomie_sucessional_advanced_stage2\n","I16Phytophysiognomie_sucessional_midle_stage2\n","I16Phytophysiognomie_sucessional_early_stage2\n","I16Phytophysiognomie3\n","I16Phytophysiognomie_sucessional_advanced_stage3\n","I16Phytophysiognomie_sucessional_midle_stage3\n","I16Phytophysiognomie_sucessional_early_stage3\n","I16Phytophysiognomie4\n","I16Phytophysiognomie_sucessional_advanced_stage4\n","I16Phytophysiognomie_sucessional_midle_stage4\n","I16Phytophysiognomie_sucessional_early_stage4\n","I16Number_of_fragments\n","I16Connection_with_native_vegetation_of_neighboring\n","I16Protection_grazing_and_fire\n","I16.RESULT","I17Native vegetation","I17Area_indicated_for_recomposition","I17Proportion_of_PAs_effectively_protected","I17.PARTIALRESULT1","I17CRA_AREA","I17Surplus_native_vegetation","I17CRA_outside_the_farm","I17CRA_not_subject_to_recomposition","I17CRA_requires_recomposition","I17PARTIALRESULT2","I17.RESULT","FINAL_INDEX","Standard_deviation","1.Productivity_and_Sales_Prices","2.Income_Diversity","3.Asset_Development_and_Indebtedness","4.Public_Services","5.Education_and_Courses","6.Employment_Quality","7.Business_Management","8.Commercialization_and_Innovation","9.Waste_Residues_Management","10.Soil_Fertility","11.Soil_Erosion_and_Road_Maintenance","12.Water_Quality","13.Water_contamination_risk_and_Pesticides","14.Soil_and_Water_Conservation ","15.Biodiversity_Conservation","16.Natural_Habitats","17.Preservation_and_Conservation_Reserve_Areas","R1ANNUAL_INCOME","R2ANNUAL_INCOME_HECTARE-1","R3ANNUAL_GROSS_INCOME_ESTIMATED_ASSET-1","R4LAND_REFERENCE_VALUE","R5ESTIMATED_ASSET","R6Anual_asset_development_discounting_land_appreciation","R7Amount_of_pesticides_cultivated_area-1_L_ha_year","R8EIQ_Final_Index","R9Pesticides_Number_of_commercial_products","R10Pesticides_EIQ_average","R11Pesticides_EIQ_max","R12EIQ_Farm_worker_component_average\t","R13EIQ_Farm_worker_component_max\t","R14EIQ_Consumer_component_average\t","R15EIQ_Consumer_component_max\t","R16EIQ_Ecological_component_average\t","R17EIQ_Ecological_component_max\t","R18Pesticides_proportion_of_products_used_in_the_farm_banned_by_the_European_Union"]
[{"$f":"COUNTA(C22:NX22)","v":386},null,{"$f":"'1 Survey'!C34","v":"00:00:00"},{"$f":"'1 Survey'!C38","v":0},{"$f":"'1 Survey'!C40","v":0},{"$f":"'1 Survey'!C44","v":0},{"$f":"'1 Survey'!C46","v":0},{"$f":"'1 Survey'!C48","v":0},{"$f":"'1 Survey'!C52","v":0},{"$f":"'1 Survey'!C54","v":0},{"$f":"'1 Survey'!C56","v":0},{"$f":"'1 Survey'!C58","v":0},{"$f":"'1 Survey'!D62","v":0},{"$f":"'1 Survey'!D64","v":0},{"$f":"'1 Survey'!D66","v":0},{"$f":"'1 Survey'!D70","v":0},{"$f":"'1 Survey'!D72","v":0},{"$f":"'1 Survey'!D74","v":0},{"$f":"'1 Survey'!D77","v":0},{"$f":"'1 Survey'!D79","v":0},{"$f":"'1 Survey'!D84","v":0},{"$f":"'1 Survey'!D85","v":0},{"$f":"'1 Survey'!D86","v":0},{"$f":"'1 Survey'!D87","v":0},{"$f":"'1 Survey'!D88","v":0},{"$f":"'1 Survey'!D89","v":0},{"$f":"'1 Survey'!D90","v":0},{"$f":"'1 Survey'!D91","v":0},{"$f":"'1 Survey'!D92","v":0},{"$f":"'1 Survey'!H92","v":{"v":0,"d":"0.00"}},{"$f":"'1 Survey'!D97","v":{"v":0,"d":"0.00"}},{"$f":"'1 Survey'!D98","v":{"v":0,"d":"0.00"}},{"$f":"'1 Survey'!D72*'1 Survey'!E103","v":{"v":0,"d":"0.00"}},{"$f":"'1 Survey'!E104","v":{"v":0,"d":"0.00"}},{"$f":"'1 Survey'!E108","v":0},{"$f":"'1 Survey'!E109","v":0},{"$f":"'1 Survey'!E110","v":0},{"$f":"'1 Survey'!E111","v":0},{"$f":"'1 Survey'!E114","v":0},{"$f":"'1 Survey'!E115","v":0},{"$f":"'1 Survey'!E118","v":0},{"$f":"'1 Survey'!E120","v":0},{"$f":"'1 Survey'!E124","v":0},{"$f":"'1 Survey'!E126","v":0},{"$f":"'1 Survey'!C131","v":0},{"$f":"'1 Survey'!C133","v":0},{"$f":"'1 Survey'!C135","v":0},{"$f":"'2 Indicators'!C9","v":0},{"$f":"'2 Indicators'!D9","v":{"v":0,"d":"$0.00"}},{"$f":"'2 Indicators'!C10","v":0},{"$f":"'2 Indicators'!D10","v":{"v":0,"d":"$0.00"}},{"$f":"'2 Indicators'!C11","v":0},{"$f":"'2 Indicators'!D11","v":{"v":0,"d":"$0.00"}},{"$f":"'2 Indicators'!D15","v":0},{"$f":"'2 Indicators'!D16","v":0},{"$f":"'2 Indicators'!D17","v":0},{"$f":"'2 Indicators'!D18","v":0},{"$f":"'2 Indicators'!D19","v":0},{"$f":"'2 Indicators'!D20","v":0},{"$f":"'2 Indicators'!E15","v":0},{"$f":"'2 Indicators'!E16","v":0},{"$f":"'2 Indicators'!E17","v":0},{"$f":"'2 Indicators'!E18","v":0},{"$f":"'2 Indicators'!E19","v":0},{"$f":"'2 Indicators'!E20","v":0},{"$f":"'2 Indicators'!F15","v":0},{"$f":"'2 Indicators'!F16","v":0},{"$f":"'2 Indicators'!F17","v":0},{"$f":"'2 Indicators'!F18","v":0},{"$f":"'2 Indicators'!F19","v":0},{"$f":"'2 Indicators'!F20","v":0},{"$f":"'2 Indicators'!C22","v":{"v":0,"d":"0.00"}},{"$f":"'2 Indicators'!C28","v":0},{"$f":"'2 Indicators'!D28","v":{"v":0,"d":"$0.00"}},{"$f":"'2 Indicators'!C29","v":0},{"$f":"'2 Indicators'!D29","v":{"v":0,"d":"$0.00"}},{"$f":"'2 Indicators'!C30","v":0},{"$f":"'2 Indicators'!D30","v":{"v":0,"d":"$0.00"}},{"$f":"'2 Indicators'!D34","v":0},{"$f":"'2 Indicators'!D35","v":0},{"$f":"'2 Indicators'!F39","v":{"$error":"#DIV/0!"}},{"$f":"'2 Indicators'!F40","v":{"$error":"#DIV/0!"}},{"$f":"'2 Indicators'!F41","v":{"$error":"#DIV/0!"}},{"$f":"'2 Indicators'!F42","v":{"$error":"#DIV/0!"}},{"$f":"'2 Indicators'!F43:F43","v":{"$error":"#DIV/0!"}},{"$f":"'2 Indicators'!C45","v":{"$error":"#DIV/0!"}},{"$f":"'2 Indicators'!D49","v":0},{"$f":"'2 Indicators'!B54","v":0},{"$f":"'2 Indicators'!C54","v":{"v":1E-3,"d":"$0.00"}},{"$f":"'2 Indicators'!B58","v":0},{"$f":"'2 Indicators'!C58","v":{"v":1E-3,"d":"$0.00"}},{"$f":"'2 Indicators'!D59","v":{"v":2E-3,"d":"$0.00"}},{"$f":"'2 Indicators'!B62","v":0},{"$f":"'2 Indicators'!C62","v":{"v":1E-3,"d":"$0.00"}},{"$f":"'2 Indicators'!B66","v":0},{"$f":"'2 Indicators'!C66","v":{"v":1E-3,"d":"$0.00"}},{"$f":"'2 Indicators'!D67","v":{"v":2E-3,"d":"$0.00"}},{"$f":"'2 Indicators'!D73","v":{"v":0,"d":"$0.00"}},{"$f":"'2 Indicators'!F73","v":{"v":2E-3,"d":"$0.00"}},{"$f":"'2 Indicators'!B77","v":0},{"$f":"'2 Indicators'!C77","v":{"v":0,"d":"0.0"}},{"$f":"'2 Indicators'!D77","v":{"v":0,"d":"0.0"}},{"$f":"'2 Indicators'!C89","v":0},{"$f":"'2 Indicators'!D89","v":0},{"$f":"'2 Indicators'!C92","v":{"v":0,"d":"$0.00"}},{"$f":"'2 Indicators'!D92","v":{"v":0,"d":"$0.00"}},{"$f":"'2 Indicators'!C95","v":{"$error":"#DIV/0!"}},{"$f":"'2 Indicators'!D95","v":{"$error":"#DIV/0!"}},{"$f":"'2 Indicators'!F100","v":""},{"$f":"'2 Indicators'!F101","v":{"v":1,"d":"100.0%"}},{"$f":"'2 Indicators'!F102","v":{"v":1,"d":"100.0%"}},{"$f":"'2 Indicators'!F103","v":""},{"$f":"'2 Indicators'!F104","v":{"$error":"#DIV/0!"}},{"$f":"'2 Indicators'!F105","v":{"$error":"#DIV/0!"}},{"$f":"'2 Indicators'!F106","v":{"$error":"#DIV/0!"}},{"$f":"'2 Indicators'!C107","v":{"$error":"#DIV/0!"}},{"$f":"'2 Indicators'!E111","v":{"v":0,"d":"$0.00"}},{"$f":"'2 Indicators'!E112","v":{"$error":"#DIV/0!"}},{"$f":"'2 Indicators'!C113","v":{"$error":"#DIV/0!"}},{"$f":"'2 Indicators'!C115","v":{"$error":"#DIV/0!"}},{"$f":"'2 Indicators'!D119","v":0},{"$f":"IF(SUM('2 Indicators'!$E$123:$E$130)=0,'2 Indicators'!D123,('2 Indicators'!D123+'2 Indicators'!E123)/2)","v":0},{"$f":"IF(SUM('2 Indicators'!$E$123:$E$130)=0,'2 Indicators'!D124,('2 Indicators'!D124+'2 Indicators'!E124)/2)","v":0},{"$f":"IF(SUM('2 Indicators'!$E$123:$E$130)=0,'2 Indicators'!D125,('2 Indicators'!D125+'2 Indicators'!E125)/2)","v":0},{"$f":"IF(SUM('2 Indicators'!$E$123:$E$130)=0,'2 Indicators'!D126,('2 Indicators'!D126+'2 Indicators'!E126)/2)","v":0},{"$f":"IF(SUM('2 Indicators'!$E$123:$E$130)=0,'2 Indicators'!D127,('2 Indicators'!D127+'2 Indicators'!E127)/2)","v":0},{"$f":"IF(SUM('2 Indicators'!$E$123:$E$130)=0,'2 Indicators'!D128,('2 Indicators'!D128+'2 Indicators'!E128)/2)","v":0},{"$f":"IF(SUM('2 Indicators'!$E$123:$E$130)=0,'2 Indicators'!D129,('2 Indicators'!D129+'2 Indicators'!E129)/2)","v":0},{"$f":"IF(SUM('2 Indicators'!$E$123:$E$130)=0,'2 Indicators'!D130,('2 Indicators'!D130+'2 Indicators'!E130)/2)","v":0},{"$f":"'2 Indicators'!C132","v":{"v":0,"d":"0.00"}},{"$f":"IF(SUM('2 Indicators'!$E$136:$E$138)=0,'2 Indicators'!D136,('2 Indicators'!D136+'2 Indicators'!E136)/2)","v":0},{"$f":"IF(SUM('2 Indicators'!$E$136:$E$138)=0,'2 Indicators'!D137,('2 Indicators'!D137+'2 Indicators'!E137)/2)","v":0},{"$f":"IF(SUM('2 Indicators'!$E$136:$E$138)=0,'2 Indicators'!D138,('2 Indicators'!D138+'2 Indicators'!E138)/2)","v":0},{"$f":"'2 Indicators'!C140","v":{"v":0,"d":"0.00"}},{"$f":"'2 Indicators'!C142","v":{"v":0,"d":"0.00"}},{"$f":"'2 Indicators'!D147","v":0},{"$f":"'2 Indicators'!D148","v":0},{"$f":"'2 Indicators'!D149","v":0},{"$f":"'2 Indicators'!D150","v":0},{"$f":"'2 Indicators'!D151","v":0},{"$f":"'2 Indicators'!E147","v":0},{"$f":"'2 Indicators'!E148","v":0},{"$f":"'2 Indicators'!E149","v":0},{"$f":"'2 Indicators'!E150","v":0},{"$f":"'2 Indicators'!E151","v":0},{"$f":"'2 Indicators'!D155","v":0},{"$f":"'2 Indicators'!D156","v":0},{"$f":"'2 Indicators'!E155","v":0},{"$f":"'2 Indicators'!E156","v":0},{"$f":"'2 Indicators'!D161","v":0},{"$f":"'2 Indicators'!D162","v":0},{"$f":"'2 Indicators'!E161","v":0},{"$f":"'2 Indicators'!E162","v":0},{"$f":"'2 Indicators'!C164","v":{"$error":"#DIV/0!"}},{"$f":"'2 Indicators'!D170+'2 Indicators'!E170","v":0},{"$f":"'2 Indicators'!D171+'2 Indicators'!E171","v":0},{"$f":"'2 Indicators'!D172+'2 Indicators'!E172","v":0},{"$f":"'2 Indicators'!D177","v":0},{"$f":"'2 Indicators'!D178","v":0},{"$f":"'2 Indicators'!D179","v":0},{"$f":"'2 Indicators'!D180","v":0},{"$f":"'2 Indicators'!D181","v":0},{"$f":"'2 Indicators'!D182","v":0},{"$f":"'2 Indicators'!D183","v":0},{"$f":"'2 Indicators'!D184","v":0},{"$f":"IF('2 Indicators'!E170>0,'2 Indicators'!E170/('2 Indicators'!E170+'2 Indicators'!D170),\"\")","v":""},{"$f":"'2 Indicators'!C186","v":{"v":0.7,"d":"0.70"}},{"$f":"'2 Indicators'!E191","v":0},{"$f":"'2 Indicators'!E192","v":0},{"$f":"'2 Indicators'!E193","v":0},{"$f":"'2 Indicators'!E194","v":0},{"$f":"'2 Indicators'!E195","v":0},{"$f":"'2 Indicators'!E196","v":0},{"$f":"'2 Indicators'!E197","v":0},{"$f":"'2 Indicators'!E198","v":0},{"$f":"'2 Indicators'!C200","v":{"v":0,"d":"0.00"}},{"$f":"'2 Indicators'!E205","v":0},{"$f":"'2 Indicators'!E206","v":0},{"$f":"'2 Indicators'!E209","v":0},{"$f":"'2 Indicators'!E210","v":0},{"$f":"'2 Indicators'!E211","v":0},{"$f":"'2 Indicators'!E212","v":0},{"$f":"'2 Indicators'!D215","v":0},{"$f":"'2 Indicators'!E215","v":{"v":0,"d":"0%"}},{"$f":"'2 Indicators'!D216","v":0},{"$f":"'2 Indicators'!E216","v":{"v":0,"d":"0%"}},{"$f":"'2 Indicators'!C218","v":{"v":0,"d":"0.00"}},{"$f":"'2 Indicators'!D223","v":0},{"$f":"'2 Indicators'!E223","v":0},{"$f":"'2 Indicators'!D224","v":0},{"$f":"'2 Indicators'!E224","v":0},{"$f":"'2 Indicators'!E227","v":{"v":0,"d":"0%"}},{"$f":"IF('2 Indicators'!E230=\"\",\"sem efluente\",'2 Indicators'!E230)","v":"sem efluente"},{"$f":"IF('2 Indicators'!E231=\"\",\"sem efluente\",'2 Indicators'!E231)","v":"sem efluente"},{"$f":"'2 Indicators'!E234","v":0},{"$f":"'2 Indicators'!E235","v":0},{"$f":"'2 Indicators'!C236","v":{"v":0.7,"d":"0.70"}},{"$f":"'2 Indicators'!C240","v":0},{"$f":"'2 Indicators'!C242/100","v":{"v":0,"d":"0%"}},{"$f":"'2 Indicators'!C243","v":{"v":0,"d":"0.00"}},{"$f":"'2 Indicators'!E243","v":{"v":0,"d":"0.00"}},{"$f":"'2 Indicators'!C244","v":{"v":0,"d":"0.00"}},{"$f":"'2 Indicators'!E244","v":{"v":0,"d":"0.00"}},{"$f":"'2 Indicators'!C245","v":0},{"$f":"'2 Indicators'!E245","v":{"v":0,"d":"0.00"}},{"$f":"'2 Indicators'!C246","v":0},{"$f":"'2 Indicators'!E246","v":{"v":0,"d":"0.00"}},{"$f":"'2 Indicators'!C247","v":0},{"$f":"'2 Indicators'!E247","v":{"v":0,"d":"0.00"}},{"$f":"'2 Indicators'!C248","v":0},{"$f":"'2 Indicators'!E248","v":{"v":0,"d":"0.00"}},{"$f":"'2 Indicators'!C249","v":0},{"$f":"'2 Indicators'!E249","v":{"v":0,"d":"0.00"}},{"$f":"'2 Indicators'!C250","v":0},{"$f":"'2 Indicators'!E250","v":{"v":0,"d":"0.00"}},{"$f":"'2 Indicators'!C251","v":0},{"$f":"'2 Indicators'!E251","v":{"v":0,"d":"0.00"}},{"$f":"'2 Indicators'!C265","v":{"v":0,"d":"0.00"}},{"$f":"'2 Indicators'!C255","v":0},{"$f":"'2 Indicators'!C256","v":0},{"$f":"'2 Indicators'!C257","v":{"v":0,"d":"0.00"}},{"$f":"'2 Indicators'!C258","v":{"v":0,"d":"0.00"}},{"$f":"'2 Indicators'!C259","v":{"v":0,"d":"0.00"}},{"$f":"'2 Indicators'!C260","v":{"v":0,"d":"0.00"}},{"$f":"'2 Indicators'!C261","v":{"v":0,"d":"0.00"}},{"$f":"'2 Indicators'!C262","v":{"v":0,"d":"0.00"}},{"$f":"'2 Indicators'!C263","v":{"v":0,"d":"0.00"}},{"$f":"'2 Indicators'!C265","v":{"v":0,"d":"0.00"}},{"$f":"'2 Indicators'!D270","v":{"v":0,"d":"0.00"}},{"$f":"'2 Indicators'!E270","v":{"v":0,"d":"0.00"}},{"$f":"'2 Indicators'!F270","v":" "},{"$f":"'2 Indicators'!D273","v":0},{"$f":"'2 Indicators'!C275","v":{"v":0.7,"d":"0.70"}},{"$f":"'2 Indicators'!E278","v":{"v":0,"d":"0%"}},{"$f":"'2 Indicators'!E279","v":{"v":0,"d":"0%"}},{"$f":"'2 Indicators'!E280","v":{"v":0,"d":"0%"}},{"$f":"'2 Indicators'!E282","v":{"v":0,"d":"0%"}},{"$f":"'2 Indicators'!E283","v":{"v":0,"d":"0%"}},{"$f":"IF('2 Indicators'!E285=\"x\",1,0)","v":0},{"$f":"'2 Indicators'!E286","v":0},{"$f":"'2 Indicators'!C287","v":{"v":0,"d":"0.00"}},{"$f":"'2 Indicators'!C289","v":0.35},{"$f":"'2 Indicators'!D295","v":0},{"$f":"'2 Indicators'!D296","v":0},{"$f":"'2 Indicators'!D297","v":0},{"$f":"'2 Indicators'!D298","v":0},{"$f":"'2 Indicators'!D299","v":0},{"$f":"'2 Indicators'!D300","v":0},{"$f":"'2 Indicators'!D301","v":0},{"$f":"'2 Indicators'!D302","v":0},{"$f":"'2 Indicators'!D303","v":0},{"$f":"'2 Indicators'!D304","v":0},{"$f":"'2 Indicators'!D305","v":0},{"$f":"'2 Indicators'!D306","v":0},{"$f":"'2 Indicators'!D307","v":0},{"$f":"'2 Indicators'!D308","v":0},{"$f":"'2 Indicators'!D322","v":{"v":0,"d":"0.00"}},{"$f":"'2 Indicators'!D323","v":{"v":0,"d":"0.00"}},{"$f":"'2 Indicators'!D325","v":{"v":0,"d":"0.00"}},{"$f":"'2 Indicators'!D326","v":{"v":0,"d":"0.00"}},{"$f":"'2 Indicators'!D334","v":""},{"$f":"'2 Indicators'!C336","v":{"v":0,"d":"0.00"}},{"$f":"'2 Indicators'!D341","v":0},{"$f":"'2 Indicators'!D343","v":0},{"$f":"'2 Indicators'!D344","v":0},{"$f":"'2 Indicators'!D345","v":0},{"$f":"'2 Indicators'!D346","v":0},{"$f":"'2 Indicators'!D347","v":""},{"$f":"'2 Indicators'!D354","v":""},{"$f":"'2 Indicators'!D364","v":""},{"$f":"'2 Indicators'!D365","v":""},{"$f":"'2 Indicators'!E341","v":0},{"$f":"'2 Indicators'!E343","v":0},{"$f":"'2 Indicators'!E344","v":0},{"$f":"'2 Indicators'!E345","v":0},{"$f":"'2 Indicators'!E346","v":0},{"$f":"'2 Indicators'!E347","v":""},{"$f":"'2 Indicators'!E354","v":""},{"$f":"'2 Indicators'!E364","v":""},{"$f":"'2 Indicators'!E365","v":""},{"$f":"'2 Indicators'!F341","v":0},{"$f":"'2 Indicators'!F343","v":0},{"$f":"'2 Indicators'!F344","v":0},{"$f":"'2 Indicators'!F345","v":0},{"$f":"'2 Indicators'!F346","v":0},{"$f":"'2 Indicators'!F347","v":""},{"$f":"'2 Indicators'!F354","v":""},{"$f":"'2 Indicators'!F364","v":""},{"$f":"'2 Indicators'!F365","v":""},{"$f":"'2 Indicators'!D367","v":0},{"$f":"'2 Indicators'!D368","v":0},{"$f":"'2 Indicators'!D369","v":0},{"$f":"'2 Indicators'!E367","v":0},{"$f":"'2 Indicators'!E368","v":0},{"$f":"'2 Indicators'!E369","v":0},{"$f":"'2 Indicators'!F367","v":0},{"$f":"'2 Indicators'!F368","v":0},{"$f":"'2 Indicators'!F369","v":0},{"$f":"'2 Indicators'!C371","v":{"v":1,"d":"1.00"}},{"$f":"'2 Indicators'!E374","v":0},{"$f":"'2 Indicators'!E375","v":0},{"$f":"'2 Indicators'!E377","v":0},{"$f":"'2 Indicators'!E378","v":0},{"$f":"'2 Indicators'!C380","v":{"v":1,"d":"1.00"}},{"$f":"'2 Indicators'!C382","v":{"v":1,"d":"1.00"}},{"$f":"SUM('2 Indicators'!D388:G388)","v":{"v":0,"d":"0.00"}},{"$f":"SUM('2 Indicators'!D390:G390)","v":{"v":0,"d":"0.00"}},{"$f":"SUM('2 Indicators'!D391:G391)","v":{"v":0,"d":"0.00"}},{"$f":"'2 Indicators'!D392","v":0},{"$f":"'2 Indicators'!D395","v":0},{"$f":"'2 Indicators'!C398","v":""},{"$f":"SUM('2 Indicators'!D404:G404)","v":{"v":0,"d":"0.00"}},{"$f":"SUM('2 Indicators'!D406:G406)","v":{"v":0,"d":"0.00"}},{"$f":"SUM('2 Indicators'!D407:G407)","v":{"v":0,"d":"0.00"}},{"$f":"'2 Indicators'!D408","v":0},{"$f":"'2 Indicators'!C411","v":{"$error":"#DIV/0!"}},{"$f":"'2 Indicators'!E413","v":{"$error":"#DIV/0!"}},{"$f":"'2 Indicators'!C414","v":{"$error":"#DIV/0!"}},{"$f":"IF('2 Indicators'!F416=\"x\",1,0)","v":0},{"$f":"'2 Indicators'!C418","v":{"$error":"#DIV/0!"}},{"$f":"'2 Indicators'!D422","v":0},{"$f":"'2 Indicators'!D423","v":0},{"$f":"'2 Indicators'!D424","v":0},{"$f":"'2 Indicators'!D425","v":0},{"$f":"'2 Indicators'!E422","v":0},{"$f":"'2 Indicators'!E423","v":0},{"$f":"'2 Indicators'!E424","v":0},{"$f":"'2 Indicators'!E425","v":0},{"$f":"'2 Indicators'!F422","v":0},{"$f":"'2 Indicators'!F423","v":0},{"$f":"'2 Indicators'!F424","v":0},{"$f":"'2 Indicators'!F425","v":0},{"$f":"'2 Indicators'!G422","v":0},{"$f":"'2 Indicators'!G423","v":0},{"$f":"'2 Indicators'!G424","v":0},{"$f":"'2 Indicators'!G425","v":0},{"$f":"'2 Indicators'!F429","v":0},{"$f":"'2 Indicators'!F432","v":0},{"$f":"'2 Indicators'!F434","v":0},{"$f":"'2 Indicators'!C436","v":{"v":0,"d":"0.00"}},{"$f":"'2 Indicators'!F441","v":{"v":0,"d":"0.00"}},{"$f":"'2 Indicators'!F442","v":{"v":0,"d":"0.00"}},{"$f":"'2 Indicators'!F445","v":{"v":0,"d":"0.0%"}},{"$f":"'2 Indicators'!C447","v":{"v":0,"d":"0.00"}},{"$f":"'1 Survey'!D72*'1 Survey'!E103","v":{"v":0,"d":"0.00"}},{"$f":"'2 Indicators'!F453","v":{"v":0,"d":"0.00"}},{"$f":"'2 Indicators'!F454","v":{"v":0,"d":"0.00"}},{"$f":"'2 Indicators'!F455","v":{"v":0,"d":"0.00"}},{"$f":"'2 Indicators'!F456","v":{"v":0,"d":"0.00"}},{"$f":"'2 Indicators'!C458","v":{"$error":"#DIV/0!"}},{"$f":"'2 Indicators'!C460","v":{"$error":"#DIV/0!"}},{"$f":"'3 Report'!Q65","v":""},{"$f":"'3 Report'!P64","v":{"$error":"#DIV/0!"}},{"$f":"'3 Report'!Q66","v":{"v":0,"d":"0.00"}},{"$f":"'3 Report'!Q67","v":{"$error":"#DIV/0!"}},{"$f":"'3 Report'!Q68","v":{"$error":"#DIV/0!"}},{"$f":"'3 Report'!Q69","v":{"v":0,"d":"0.00"}},{"$f":"'3 Report'!Q70","v":{"$error":"#DIV/0!"}},{"$f":"'3 Report'!Q71","v":{"v":0.7,"d":"0.70"}},{"$f":"'3 Report'!Q72","v":{"v":0,"d":"0.00"}},{"$f":"'3 Report'!Q73","v":{"v":0,"d":"0.00"}},{"$f":"'3 Report'!Q74","v":{"v":0.7,"d":"0.70"}},{"$f":"'3 Report'!Q75","v":{"v":0,"d":"0.00"}},{"$f":"'3 Report'!Q76","v":0.35},{"$f":"'3 Report'!Q77","v":{"v":0,"d":"0.00"}},{"$f":"'3 Report'!Q78","v":{"v":1,"d":"1.00"}},{"$f":"'3 Report'!Q79","v":""},{"$f":"'3 Report'!Q80","v":{"$error":"#DIV/0!"}},{"$f":"'3 Report'!Q81","v":{"v":0,"d":"0.00"}},{"$f":"'3 Report'!Q82","v":{"$error":"#DIV/0!"}},{"$f":"'3 Report'!K38","v":{"$error":"#DIV/0!"}},{"$f":"'3 Report'!K35","v":{"$error":"#DIV/0!"}},{"$f":"'3 Report'!K37","v":{"$error":"#DIV/0!"}},{"$f":"'3 Report'!J92","v":{"v":0,"d":"$0.00"}},{"$f":"'3 Report'!J93","v":{"v":0,"d":"$0.00"}},{"$f":"'3 Report'!J95","v":{"v":0,"d":"0.0%"}},{"$f":"'3 Report'!K44","v":""},{"$f":"'3 Report'!K46","v":0},{"$f":"COUNTA('2 Indicators'!D341:F341,Formulas!D411:L411,Formulas!D440:L440,Formulas!D468:I468)","v":0},{"$f":"NN23/NO23","v":{"$error":"#DIV/0!"}},{"$f":"MAX('2 Indicators'!D358:F358,Formulas!D429:L429,Formulas!D458:L458,Formulas!D486:I486)","v":{"v":0,"d":"0.0"}},{"$f":"AVERAGE('2 Indicators'!D355:F355,Formulas!D426:L426,Formulas!D455:L455,Formulas!D483:I483)","v":{"$error":"#DIV/0!"}},{"$f":"MAX('2 Indicators'!D355:F355,Formulas!D426:L426,Formulas!D455:L455,Formulas!D483:I483)","v":{"v":0,"d":"0.0"}},{"$f":"AVERAGE('2 Indicators'!D356:F356,Formulas!D427:L427,Formulas!D456:L456,Formulas!D484:I484)","v":{"$error":"#DIV/0!"}},{"$f":"MAX('2 Indicators'!D356:F356,Formulas!D427:L427,Formulas!D456:L456,Formulas!D484:I484)","v":{"v":0,"d":"0.0"}},{"$f":"AVERAGE('2 Indicators'!D357:F357,Formulas!D428:L428,Formulas!D457:L457,Formulas!D485:I485)","v":{"$error":"#DIV/0!"}},{"$f":"MAX('2 Indicators'!D357:F357,Formulas!D428:L428,Formulas!D457:L457,Formulas!D485:I485)","v":{"v":0,"d":"0.0"}},{"$f":"Formulas!N488/'Data base'!NO23","v":{"$error":"#DIV/0!"}}]
[]
[{"$nulls":20},"Unsuitable areas",{"$f":"AC23/AD23","v":{"$error":"#DIV/0!"}},{"$nulls":284},{"$f":"KT23","v":{"v":0,"d":"0.0"}},{"$f":"KU23","v":{"v":0,"d":"0.0"}},{"$f":"KV23","v":{"v":0,"d":"0.0"}},{"$nulls":3},{"$f":"KZ23","v":{"v":0,"d":"0.0"}},{"$f":"LA23","v":{"v":0,"d":"0.0"}},{"$f":"LB23","v":{"v":0,"d":"0.0"}}]
[null,null,"REFERENCES",{"$nulls":17},"Fallow",{"$f":"Z23/AD23","v":{"$error":"#DIV/0!"}},{"$nulls":98},"Waste collection",{"$f":"DY23","v":{"v":0,"d":"0.0%"}},{"$nulls":113},"Transverse slope",{"$f":"HZ23","v":{"v":0,"d":"0%"}},{"$nulls":6},"Upstream",{"$nulls":62},{"$f":"KU25","v":{"v":0,"d":"0.0"}},{"$f":"KV25","v":{"v":0,"d":"0.0"}},{"$f":"KW25","v":{"v":0,"d":"0.0"}},{"$nulls":3},{"$f":"LA25","v":{"v":0,"d":"0.0"}},{"$f":"LB25","v":{"v":0,"d":"0.0"}},{"$f":"LC25","v":{"v":0,"d":"0.0"}}]
[{"$nulls":20},"Non-agricultural area",{"$f":"Y23/AD23","v":{"$error":"#DIV/0!"}},{"$nulls":86},"Value of land in the region\t\t",{"$f":"DE23","v":""},{"$nulls":10},"Security in the local area",{"$f":"DW23","v":{"v":0,"d":"0.0%"}},{"$nulls":22},"Family members - Short training season\t","Family members - Long-term training\t","Rural workers - Short training season\t","Rural workers - Long-term training\t",{"$nulls":18},"Access credit for commercialization\t",{"$f":"FS23","v":{"v":0,"d":"0.0%"}},{"$nulls":7},"Search information / diversify buyers\t\t",{"$f":"FU23","v":0},{"$nulls":58},"Bumps/grooves",{"$f":"IA23","v":{"v":0,"d":"0%"}},{"$nulls":6},"Occupation of the river banks",{"$f":"II23","v":{"v":0,"d":"0.00"}},{"$nulls":61},{"$f":"KU26/$KU$28","v":{"$error":"#DIV/0!"}},{"$f":"KV26/$KU$28","v":{"$error":"#DIV/0!"}},{"$f":"KW26/$KU$28","v":{"$error":"#DIV/0!"}},{"$nulls":3},{"$f":"LA26/$KU$28","v":{"$error":"#DIV/0!"}},{"$f":"LB26/$KU$28","v":{"$error":"#DIV/0!"}},{"$f":"LC26/$KU$28","v":{"$error":"#DIV/0!"}}]
[null,null,"Astier, M., García-Barrios, L., Galván-Miyoshi, Y., González-Esquivel, C. E., & Masera, O. R. (2012). Assessing the sustainability of small farmer natural resource management systems. A critical analysis of the MESMIS program (1995-2010). Ecology and society, 17(3). http://dx.doi.org/10.5751/ES-04910-170325 ",{"$nulls":17},"Water courses\t",{"$f":"AA23/AD23","v":{"$error":"#DIV/0!"}},{"$nulls":61},"Retirement, pension, financial help, other sources",{"$f":"CF23","v":{"$error":"#DIV/0!"}},null,null,"Constructions",{"$f":"CN23","v":{"v":2E-3,"d":"R$ 0.00"}},{"$f":"CK28/$CK$32","v":{"$error":"#DIV/0!"}},{"$nulls":18},"Buildings (including renovation or improvements)\t\t",{"$f":"DF23","v":{"v":1,"d":"100.0%"}},{"$nulls":10},"Internet",{"$f":"DX23","v":{"v":0,"d":"0.0%"}},{"$nulls":22},{"$f":"IF(EF23=0,\"\",EP23/EF23)","v":""},{"$f":"IF(EF23=0,\"\",EQ23/EF23)","v":""},{"$f":"IF(EK23=0,\"\",ER23/EK23)","v":""},{"$f":"IF(EK23=0,\"\",ES23/EK23)","v":""},{"$nulls":18},"Access credit for the farm activities\t",{"$f":"FR23","v":{"v":0,"d":"0.0%"}},{"$nulls":7},"Adoption of innovative techniques\t\t",{"$f":"FW23","v":0},{"$nulls":15},"Treatment of gaseous effluents (generated in boilers, biodigesters, charcoal)",{"$f":"IF('2 Indicators'!E231=\"\",\"\",'2 Indicators'!E231)","v":""},{"$nulls":41},"Infiltration structures",{"$f":"IB23","v":{"v":0,"d":"0%"}},{"$nulls":6},"Anthropogenic changes",{"$f":"IK23","v":{"v":0,"d":"0.00"}},{"$nulls":61},{"$f":"SUM(KU25:KW25)","v":{"v":0,"d":"0.00"}},{"$nulls":5},{"$f":"SUM(LA26:LC26)","v":{"v":0,"d":"0.00"}}]
[null,null,"Callisto, M., Ferreira, W. R., Moreno, P., Goulart, M., & Petrucio, M. (2002). Aplicação de um protocolo de avaliação rápida da diversidade de habitats em atividade de ensino e pesquisa (MG-RJ). Acta Limnologica Brasiliensia.",{"$nulls":17},"Native vegetation",{"$f":"AB23/AD23","v":{"$error":"#DIV/0!"}},{"$nulls":61},"Off-site activities",{"$f":"CE23","v":{"$error":"#DIV/0!"}},null,null,"Equipments",{"$f":"CS23","v":{"v":2E-3,"d":"R$ 0.00"}},{"$f":"CK29/$CK$32","v":{"$error":"#DIV/0!"}},{"$nulls":18},"Equipment\t\t",{"$f":"DG23","v":{"v":1,"d":"100.0%"}},{"$nulls":10},"Access to health care",{"$f":"DU23","v":{"v":0,"d":"0.0%"}},{"$nulls":44},"Access investment credit\t",{"$f":"FQ23","v":{"v":0,"d":"0.0%"}},{"$nulls":7},"Ability to innovate or leadership",{"$f":"FY23","v":0},{"$nulls":15},"Adequate allocation and treatment of liquid effluents",{"$f":"IF('2 Indicators'!E230=\"\",\"\",'2 Indicators'!E230)","v":""},{"$nulls":49},"Vegetal cover in the margins",{"$f":"IM23","v":{"v":0,"d":"0.00"}}]
[null,null,"Chaves, H. M. L., & Souza, M. A. (2015). Índice para a avaliação do risco de contaminação da água por pesticidas: desenvolvimento e validação. Revista Brasileira de Recursos Hídricos, 20(2), 286-297.",{"$nulls":17},"Forestry\t",{"$f":"X23/AD23","v":{"$error":"#DIV/0!"}},{"$nulls":61},"Other activities on the farm",{"$f":"CD23","v":{"$error":"#DIV/0!"}},null,null,"Livestock",{"$f":"CT23","v":0},{"$f":"CK30/$CK$32","v":{"$error":"#DIV/0!"}},{"$nulls":18},"Animals / Grain stock\t\t",{"$f":"DH23","v":""},{"$nulls":10},"Regular road access to the farm\t",{"$f":"DT23","v":{"v":0,"d":"0.0%"}},{"$nulls":44}," Production's cost \t",{"$f":"FM23","v":{"v":0,"d":"0.0%"}},{"$nulls":7},"Generates certified products /  aggregate value",{"$f":"FV23","v":0},{"$nulls":15},"Proper sewage treatment and destination",{"$f":"'2 Indicators'!F223","v":{"$error":"#DIV/0!"}},{"$nulls":41},"Presence of holes",{"$f":"IC23","v":{"v":0,"d":"0%"}},{"$nulls":6},"Erosion signals next to the banks",{"$f":"IO23","v":{"v":0,"d":"0.00"}},{"$nulls":61},"Sufficient","Insufficient","Critical situation",{"$nulls":3},"Sufficient","Insufficient","Critical situation"]
[null,null,"Deponti, C.M.; Eckert, C.; Azambuja, J.L.B (2002). Strategy for building indicators for assessing sustainability and monitoring systems. Agroecology and Sustainable Rural Development, Porto Alegre, v.3, n.4, p.44-52.",{"$nulls":17},"Permanent crops",{"$f":"U23/$AD$23","v":{"$error":"#DIV/0!"}},{"$nulls":61},"Agricultural, livestock and or forestry activities on the farm",{"$f":"CC23","v":{"$error":"#DIV/0!"}},null,null,"Land value",{"$f":"CY23*DA23","v":0},{"$f":"CK31/$CK$32","v":{"$error":"#DIV/0!"}},{"$nulls":18},"Increase in the agriculture area and/or irrigation area\t\t",{"$f":"DI23","v":{"$error":"#DIV/0!"}},{"$nulls":10},"Access to electricity\t",{"$f":"DS23","v":{"v":0,"d":"0.0%"}},{"$nulls":44},"Cash flow (income / expense)\t",{"$f":"FL23","v":{"v":0,"d":"0.0%"}},{"$nulls":24},"Proper garbage destination",{"$f":"'2 Indicators'!F224","v":{"$error":"#DIV/0!"}},{"$nulls":41},"Presence of erosion grooves",{"$f":"ID23","v":{"v":0,"d":"0%"}},{"$nulls":6},"Water transparency",{"$f":"IQ23","v":{"v":0,"d":"0.00"}},{"$nulls":61},{"$f":"KU27","v":{"$error":"#DIV/0!"}},{"$f":"KV27","v":{"$error":"#DIV/0!"}},{"$f":"KW27","v":{"$error":"#DIV/0!"}},{"$nulls":3},{"$f":"LA27","v":{"$error":"#DIV/0!"}},{"$f":"LB27","v":{"$error":"#DIV/0!"}},{"$f":"LC27","v":{"$error":"#DIV/0!"}}]
[null,null,"Corrêa, I. V. (2007). Indicadores de sustentabilidade para agroecossistemas em transição agroecológica na região sul do Rio Grande do Sul. Pelotas-RS: UFPel-Universidade Federal de Pelotas.",{"$nulls":17},"Annual crops",{"$f":"V23/AD23","v":{"$error":"#DIV/0!"}},{"$nulls":65},"Asset value",{"$f":"DC23","v":{"$error":"#DIV/0!"}},{"$nulls":31},"Regular access to school transportation",{"$f":"DV23","v":{"v":0,"d":"0.0%"}},{"$nulls":44},"Existence of rural associations and the farmer's participation\t\t",{"$f":"FO23","v":{"v":0,"d":"0.0%"}},{"$nulls":24},"Composting/use of organic solid waste",{"$f":"'2 Indicators'!E227","v":{"v":0,"d":"0.0%"}},{"$nulls":49},"Water Odor",{"$f":"IS23","v":{"v":0,"d":"0.00"}}]
[null,null,"Fidalski, J. (1997). Diagnóstico de manejo e conservação do solo e da água na região noroeste do Paraná. R. Unimar, 19, 845-851.",{"$nulls":17},"Pastures",{"$f":"W23/$AD$23","v":{"$error":"#DIV/0!"}},{"$nulls":86},"Anual asset development\t\t",{"$f":"DJ23","v":{"$error":"#DIV/0!"}},{"$nulls":10},"Water availability (quantity and quality)\t",{"$f":"DR23","v":{"v":0,"d":"0.0%"}},{"$nulls":44},"Access to technical assistance",{"$f":"FN23","v":{"v":0,"d":"0.0%"}},{"$nulls":75},"Characterization of the bottom",{"$f":"IU23","v":{"v":0,"d":"0.00"}}]
[null,null,"Gitman, L. J., & Zutter, C. J. (2012). Principles of managerial finance 13th edition. Massachusetts: Addison-Wesley Publishing Company.",{"$nulls":105},"Anual asset development discounting land appreciation",{"$f":"DK23","v":{"$error":"#DIV/0!"}},{"$nulls":56},"Environmental regularization",{"$f":"FP23","v":{"v":0,"d":"0.0%"}}]
[null,null,"Gómez-Limón, J. A., & Sanchez-Fernandez, G. (2010). Empirical evaluation of agricultural sustainability using composite indicators. Ecological economics, 69(5), 1062-1075. https://10.1016/j.ecolecon.2009.11.027 ",{"$nulls":240},"Downstream"]
[null,null,"Kovach, J., Petzoldt, C., Degni, J., & Tette, J. (1992). A method to measure the environmental impact of pesticides.",{"$nulls":240},"Occupation of the river banks",{"$f":"IJ23","v":{"v":0,"d":"0.00"}}]
[null,null,"López-Ridaura, S., Masera, O., & Astier, M. (2002). Evaluating the sustainability of complex socio-environmental systems. The MESMIS framework. Ecological indicators, 2(1-2), 135-148.",{"$nulls":240},"Anthropogenic changes",{"$f":"IL23","v":{"v":0,"d":"0.00"}}]
[null,null,"Matos Filho, A. M. (2004). Agricultura orgânica sob a perspectiva da sustentabilidade: uma análise da região de Florianópolis/SC, Brasil.",{"$nulls":240},"Vegetal cover in the margins",{"$f":"IN23","v":{"v":0,"d":"0.00"}}]
[null,null,"Mendes, I. C., Souza, L. M., Sousa, D. M. G., Lopes, A. A. C., Reis-Junior, F. B., Lacerda, M. P. C., & Malaquias, J. V. (2019). Critical limits for microbial indicators in tropical Oxisols at post-harvest: The FERTBIO soil sample concept. Applied Soil Ecology, 139, 85–93. https://doi.org/10.1016/j.apsoil.2019.02.025.",{"$nulls":240},"Erosion signals next to the banks",{"$f":"IP23","v":{"v":0,"d":"0.00"}}]
[null,null,"Pesticide Property Database https://sitem.herts.ac.uk/aeru/ppdb/",{"$nulls":240},"Water transparency",{"$f":"IR23","v":{"v":0,"d":"0.00"}}]
[null,null,"Qiu, H. J., Zhu, W. B., Wang, H. B., & Cheng, X. (2007). Analysis and design of agricultural sustainability indicators system. Agricultural Sciences in China, 6(4), 475-486.",{"$nulls":240},"Water Odor",{"$f":"IT23","v":{"v":0,"d":"0.00"}}]
[null,null,"Rao, N. H., & Rogers, P. P. (2006). Assessment of agricultural sustainability. Current science, 439-448.",{"$nulls":240},"Characterization of the bottom",{"$f":"IV23","v":{"v":0,"d":"0.00"}}]
[null,null,"Ribeiro, A. C. (1999). Recomendações para o uso de corretivos e fertilizantes em Minas Gerais: 5. Aproximação. Comissão de fertilidade do solo do Estado de Minas Gerais."]
[null,null,"Rodrigues, G. S., Campanhola, C., & Kitamura, P. C. (2003). An environmental impact assessment system for agricultural R&D. Environmental Impact Assessment Review, 23(2), 219-244."]
[null,null,"Rodrigues, G. S., Rodrigues, I. A., Buschinelli, C. C. de A., & de Barros, I. (2010). Integrated farm sustainability assessment for the environmental management of rural activities. Environmental Impact Assessment Review, 30(4), 229–239. https://doi.org/10.1016/j.eiar.2009.10.002"]
[null,null,"Sala, S., Ciuffo, B., & Nijkamp, P. (2015). A systemic framework for sustainability assessment. Ecological economics, 119, 314-325. http://dx.doi.org/10.1016/j.ecolecon.2015.09.015"]
[null,null,"Sousa, D.M.G.; Lobato, E. (2004). Soil acidity correction. In: Sousa, D.M.G. de; Lobato, E. (Ed.). Cerrado: soil correction and fertilization. 2nd ed. Brasília: Embrapa Technological Information; Planaltina: Embrapa Cerrados, p.81-96."]

{"sheet":"SQI1","index":13,"n_rows":590,"n_cols":10,"rows_kept":590,"merged":[[0,1,1,1],[9,6,9,7],[10,1,10,5],[11,1,11,2],[11,6,12,6],[11,7,12,7],[12,1,12,2],[13,1,13,2],[14,1,14,2],[16,1,16,2],[17,1,17,2],[19,1,19,2],[20,1,20,2],[21,1,21,2],[22,1,22,2],[23,1,23,2],[24,1,24,2],[25,1,25,2],[26,1,26,2],[27,1,27,2],[29,1,29,2],[43,1,43,2],[44,1,44,2],[46,1,46,2],[47,1,47,2],[48,1,48,2],[49,1,49,2],[50,1,50,2],[55,1,55,2],[70,1,70,2],[83,17,83,18],[83,19,83,20],[86,1,86,2],[87,1,87,5],[89,1,89,2],[90,1,90,5],[97,1,100,1],[101,1,101,2],[103,1,103,2],[105,1,105,2],[113,1,116,1],[117,1,117,2],[119,1,119,2],[120,1,120,2],[121,1,121,2],[122,1,122,2],[123,1,123,2],[124,1,124,2],[128,1,129,1],[128,2,129,2],[146,1,146,2],[147,1,147,2],[148,1,148,2],[175,1,176,2],[178,1,178,3],[178,5,178,7],[179,1,179,2],[179,5,180,7],[180,1,181,2],[180,3,181,3],[182,1,182,2],[183,1,183,2],[190,7,191,7],[191,2,191,3],[219,1,219,5],[219,7,220,8],[220,1,220,4],[220,5,221,5],[221,7,221,8],[222,7,222,8],[223,7,223,8],[224,7,224,8],[228,1,232,1],[228,2,228,3],[228,4,228,5],[233,1,237,1],[233,4,233,5],[238,1,242,1],[238,2,238,3],[238,4,238,5],[243,1,247,1],[243,2,243,3],[243,4,243,5],[250,1,250,5],[251,1,251,4],[251,5,252,5],[260,1,263,1],[260,2,260,3],[260,4,260,5],[260,6,260,7],[264,1,267,1],[264,2,264,3],[264,4,264,5],[264,6,264,7],[268,1,271,1],[268,2,268,3],[268,4,268,5],[268,6,268,7],[272,1,275,1],[272,2,272,3],[272,4,272,5],[272,6,272,7],[279,27,279,28],[282,1,282,2],[291,1,291,7],[292,4,292,5],[292,6,292,7],[299,1,299,2],[308,1,308,7],[309,4,309,5],[309,6,309,7],[315,1,315,2],[324,1,324,7],[325,4,325,5],[325,6,325,7],[331,1,331,2],[339,1,339,5],[346,1,346,2],[354,1,354,5],[361,1,361,2],[369,1,369,5],[376,1,376,2],[384,1,384,5],[385,1,385,2],[385,3,385,5],[391,1,391,3],[392,1,394,3],[396,1,396,2],[410,1,410,2],[435,1,437,8],[439,1,439,2],[443,1,444,1],[443,2,444,2],[466,1,466,2],[482,1,482,2],[501,1,502,1],[505,1,506,1],[509,1,510,1],[513,1,514,1],[517,1,518,1],[521,1,522,1],[525,1,526,1],[529,1,530,1],[533,1,534,1],[537,1,538,1],[541,1,542,1],[547,1,548,1],[551,1,552,1],[555,1,556,1],[559,1,560,1],[563,1,564,1],[567,1,568,1],[571,1,572,1],[575,1,576,1],[579,1,580,1],[583,1,584,1],[587,1,588,1]]}
[null,"ISA"]
[null,null,"SOIL QUALITY "]
[]
[null,"DATA "]
[null,"Plot identification"]
[null,"Area"]
[null,"Land use",null,"Choose an option"]
[]
[1,"PRODUCTIVITY "]
[{"$nulls":6},"Weighting factor \t"]
[null,"1.1 Activities carried out on the plot",{"$nulls":4},"> 20%",0.9]
[null,"Activities",null,{"$f":"C7","v":0},null,null,"Production or sale price = local ",0.7]
[null,"Units of measurement (select)"]
[null,"Current mean productivity\t\t",{"$nulls":4},"< 20%",0.5]
[null,"Mean local productivity",{"$nulls":4},"< 40%",0.3]
[]
[null,"1.2 Inputs (optional)"]
[null,"Activity (select)",null,null,"Choose an option"]
[null,"Liming (Kg/ha)"]
[null,"Soluble fertilizers (formula description)"]
[null,"Soluble fertilizers (Kg/ha)"]
[null,"Remineralizers / rock powder (description)"]
[null,"Remineralizers / rock powder (Kg/ha)"]
[null,"Organic fertilizers (description)"]
[null,"Organic fertilizers (Kg/ha)"]
[null,"N (Kg) / ha "]
[null,"P (Kg) / ha"]
[null,"K (Kg) / ha "]
[]
[null,"1.3 Foliar tissue analysis (optional)"]
[null,"Activity (select)",null,"Choose an option","Result"]
[null,"P (g/kg)",null,null,{"$f":"IF(ISBLANK(C32),\"\",E486)","v":""}]
[null,"K (g/kg)",null,null,""]
[null,"N (g/kg)",null,null,""]
[null,"S (g/kg)",null,null,"",null,null,{"$f":"IF($C$31=$B$208,C39/$C$41,\"\")","v":""}]
[null,"Ca (g/kg)",null,null,"",null,null,{"$f":"IF($C$31=$B$208,C38/$C$41,\"\")","v":""}]
[null,"Mg (g/kg)",null,null,"",null,null,{"$f":"IF($C$31=$B$208,C42/$C$41,\"\")","v":""}]
[null,"B (mg/kg)",null,null,""]
[null,"Zn (mg/kg)",null,null,""]
[null,"Fe (mg/kg)",null,null,""]
[null,"Mn (mg/kg)",null,null,""]
[null,"Cu (mg/kg)",null,null,""]
[]
[null,"1.4 Production costs (optional)"]
[null,"Fertilizers ($/ha)"]
[]
[null,"Total Inputs ($/ha)",null,null,"Fertilizers + seeds + pest/weeds/diseases control"]
[null,"Fixed costs ($/ha)"]
[null,"Total costs ($/ha)",null,{"$f":"IF(D47>0,D48+D47,\"\")","v":""},{"$f":"IF(D50>0,(D49/D50),\"\")","v":""}]
[null,"Income ($/ha)"]
[null,"Result (net income) ($/ha)",null,{"$f":"IF(D50>0,D50-D49,\"\")","v":""},{"$f":"IF(D50>0,D51/D50,\"\")","v":""}]
[]
[null,"RESULT",{"$f":"IF(D14>0,F187,0)","v":{"v":0,"d":"0.00"}}]
[]
[2,"CHEMISTRY AND BIOLOGYCAL ANALYSIS"]
[]
[null,"Plot identification \t",{"$f":"C5","v":0}]
[{"$nulls":4},"Result"]
[null,"Clay content",null,"dag kg-1 (%) Clay",{"$f":"IF(ISBLANK(C59),0,IF(C59<=15,H222,IF(AND(C59>15,C59<35),H223,IF(AND(C59>=35,C59<=60),H224,IF(C59>60,H225)))))","v":{"v":0,"d":"0.00"}}]
[null,"Soil Organic Matter",null,"(dag kg-1)",{"$f":"IF(H233>1,1,IF(H233<0,0,H233))","v":{"v":0,"d":"0.00"}}]
[null,"Available P",null,"(mg dm-3) (Mehlich-1)",{"$f":"IF(F279>1,1,IF(F279<0,0,F279))","v":{"v":0,"d":"0.00"}}]
[null,"Exchangeable Ca",null,"(cmolc dm-3)",{"$f":"IF(ISBLANK(C62),0,IF(F298>1,1,IF(F298<0,0,F298)))","v":{"v":0,"d":"0.00"}}]
[null,"Exchangeable Mg",null,"(cmolc dm-3)",{"$f":"IF(ISBLANK(C63),0,IF(F314>1,1,IF(F314<0,0,F314)))","v":{"v":0,"d":"0.00"}}]
[null,"Exchangeable K",null,"(mg dm-3)",{"$f":"IF(ISBLANK(C64),0,IF(F330>1,1,IF(F330<0,0,F330)))","v":{"v":0,"d":"0.00"}}]
[null,"pH",null,"Index",{"$f":"IF(ISBLANK(C65),0,IF(E345>1,1,IF(E345<0,0,E345)))","v":{"v":0,"d":"0.00"}}]
[null,"Exchangeable Al",null,"(cmolc dm-3)",{"$f":"IF(C66>2,0,IF(ISBLANK(C66),0,IF(E360>1,1,IF(E360<0,0,E360))))","v":{"v":0,"d":"0.00"}}]
[null,"Cation Exchange Cap. (CEC)",null,"(cmolc dm-3)",{"$f":"IF(ISBLANK(C67),0,E375)","v":{"v":0,"d":"0.00"}}]
[null,"Base Saturation",null,"(%)",{"$f":"IF(ISBLANK(C68),0,IF(E390>0.83,1,IF(E390<0,0,E390)))","v":{"v":0,"d":"0.00"}}]
[null,"Partial result",{"$f":"AVERAGE(E60,E61,E68)","v":{"v":0,"d":"0.00"}}]
[]
[null,"Soil biology assessment - BioAS* (optional)"]
[null,"Arylsulfatase activity",null,"(mg p-nitrophenol kg-1 h-1)"]
[null,"β-Glucosidase activity",null,"(mg p-nitrophenol kg-1 h-1)"]
[null,"Soil Organic Matter (0-10cm)",null,"(dag kg-1)","Result"]
[null,"Biological soil quality index",null,"Index",{"$f":"IF(C75>0,C75,\"\")","v":""}]
[null,"Nutrient storage index",null,"Index"]
[null,"Nutrient supply index",null,"Index"]
[null,"Chemical soil quality index",null,"Index"]
[null,"FertBio index",null,"Index"]
[null,"Partial result",{"$f":"C75","v":{"v":0,"d":"0.00"}}]
[]
[null,"RESULT",{"$f":"IF(C80>0,(2*C69+C80)/3,C69)","v":{"v":0,"d":"0.00"}}]
[]
[3,"SOIL EROSION"]
[]
[{"$nulls":3},"Choose an option","Area (ha)","Proportion (%) total area","Weighting factor"]
[null,"3.1 Degradation stage*",{"$nulls":3},{"$f":"IF(E87>0,E87/C457,\" \")","v":" "},{"v":1,"d":"1.0"},"Initial"]
[null,"* Evidence of erosion: Initial - reduction of water infiltration, exposed roots; Intermediate - removal of the superficial horizon, presence of localized shallow grooves; Advanced - deep and widespread furrows in the area, gullies, mass movement (displacement of a soil volume).\t\t\t",{"$nulls":4},0.8,"Intermediary"]
[{"$nulls":3},"Choose an option"]
[null,"3.2 Trend of process behavior",{"$nulls":4},0.5,"Advanced"]
[null,"** Adoption of recovery or mitigation measures such as terraces, physical barriers, revegetation, etc."]
[null,"RESULT",{"$f":"IF(B421>0,(B421*B422*1.2)+(B421*C422)+(B421*D422*0.8),0.7)","v":{"v":0.7,"d":"0.70"}}]
[]
[4,"SOIL AND WATER CONSERVATION PRACTICES"]
[]
[{"$nulls":3},{"$f":"C7","v":0}]
[null,null,"Area (ha)",{"$f":"C6","v":0},"Weighting factor"]
[null,"4.1 Soil conservation practices (adoption intensity)\n","High",null,{"v":1,"d":"1.0"}]
[null,null,"Moderate",null,0.6]
[null,null,"Incipient",null,0.3]
[null,null,"Critical situation*",null,0.1]
[null,"*Critical situation (soil/water) - specify"]
[{"$nulls":3},"Choose an option","Weighting factor","Verification (Land Use) =>",{"$f":"SUM(D98:D101)/C6","v":{"$error":"#DIV/0!"}}]
[null,"4.2 Strategies for water conservation and reservation  \n",null,null,{"v":1,"d":"1.0"},"Sufficient"]
[{"$nulls":3},"Choose an option",0.4,"Insufficient","Yes"]
[null,"4.3 No Till practice\n",null,null,0.1,"Critical situation","No"]
[]
[null,"RESULT",{"$f":"IF(C460=0,\"\",(((B460*2)+C460)/3))","v":""}]
[]
[5,"BIODIVERSITY CONSERVATION PRACTICES"]
[]
[{"$nulls":3},{"$f":"C7","v":0}]
[null,null,"Area (ha)",{"$f":"C6","v":0},"Weighting factor"]
[null,"5.1 Agrobiodiversity Conservation Practices (Adoption Intensity)\n","High",null,{"v":1,"d":"1.0"}]
[null,null,"Moderate",null,0.6]
[null,null,"Incipient",null,0.3]
[null,null,"Critical situation*",null,0.1]
[null,"*Critical situation (soil/water) - specify"]
[{"$nulls":5},"Verification (Land Use) =>",{"$f":"SUM(D114:D117)/C6","v":{"$error":"#DIV/0!"}},{"$f":"SUM(D114:D117)","v":0}]
[null,"5.2 Use of Biological Inputs \n",null,null,"Choose an option"]
[null,"5.3 Use of Crop Rotation/Intercropping\n",null,null,"Choose an option"]
[null,"5.4 Use of Cover Crops/Trees\n",null,null,"Choose an option"]
[null,"5.5 Number of Cover Crops Species\n"]
[null,"5.6 Sowing Date of Cover Crops"]
[null,"5.7 Pesticides use (L/ha)\n"]
[]
[null,"RESULT",{"$f":"IF(AND(D120=\"Yes\",D121=\"Yes\",D122=\"Yes\"),(C474*C468)+(C475*C469)+(C476*C470)+(C477*C471),((C474*C468)+(C475*C469)+(C476*C470)+(C477*C471))*0.8)","v":{"$error":"#DIV/0!"}}]
[]
[null,"SQI",{"$f":"H172","v":{"v":0.09999999999999999,"d":"0.10"}},null,null,"Plot description",{"$f":"C5","v":0}]
[{"$nulls":5},"Data",{"$f":"C4","v":"00:00:00"}]
[{"$nulls":5},"Area",{"$f":"C6","v":0}]
[null,"Soil Fertility"]
[null,"Soil Organic Matter (SOM) (dag kg-1)",null,{"$f":"C60","v":{"v":0,"d":"0.0"}}]
[null,"Phosphorus (mg dm-3)",null,{"v":0,"d":"0.0"}]
[null,"Calcium (cmolc dm-3)",null,{"v":0,"d":"0.0"}]
[null,"Magnesium (cmolc dm-3)",null,{"v":0,"d":"0.0"}]
[null,"Potassium (mg dm-3)",null,{"v":0,"d":"0.0"}]
[null,"pH",null,{"v":0,"d":"0.0"}]
[null,"Aluminium (cmolc dm-3)",null,{"v":0,"d":"0.0"}]
[null,"Cation Exchange Cap. (CEC) (cmolc dm-3)",null,{"v":0,"d":"0.0"}]
[null,"Base Saturation (%)",null,{"v":0,"d":"0.0"}]
[null,"K/CTC (%) (reference 3 - 5%)",null,{"$f":"IF(D137>0,((D137/1000*2.5577)/D140*100),\"\")","v":""}]
[null,"Ca/CTC (%) (reference 40 - 60%)",null,{"$f":"IF(D135>0,D135/D140*100,\"\")","v":""}]
[null,"Mg/CTC (%) (reference 15 - 20%)",null,{"$f":"IF(D136>0,D136/D140*100,\"\")","v":""}]
[]
[null,"Nutrients (Input)",{"$nulls":3},"Soil erosion (Plot)"]
[null,"N (Kg/ha) ",null,{"$f":"IF(D26=\"\",\"\",D26)","v":""},null,"Area",null,{"$f":"E87","v":0}]
[null,"P (Kg/ha)",null,{"$f":"IF(D27=\"\",\"\",D27)","v":""},null,"Degradation stage",null,{"$f":"D87","v":0}]
[null,"K (Kg/ha) ",null,{"$f":"IF(D28=\"\",\"\",D28)","v":""},null,"Degradation process trend",null,{"$f":"D90","v":0}]
[]
[null,"Yield (Plot)",{"$nulls":3},"Soil cover quality / pesticides"]
[null,"Main agricultural activity",null,{"$f":"D12","v":{"v":0,"d":"0.0%"}},null,"Number of species Cover Crops",null,{"$f":"IF(D123>0,D123,\"\")","v":""}]
[null,"Unit",null,{"$f":"D13","v":0},null,"Cover Crops sowing date",null,{"$f":"IF(D124>0,D124,\"\")","v":""}]
[null,"Yield / productivity",null,{"$f":"D14","v":0},null,"Pesticides (L/ha)",null,{"$f":"IF(D125>0,D125,\"\")","v":""}]
[]
[null,"Economic result (Plot)",{"$nulls":3},"Soil Biology"]
[null,"Total Inputs ($/ha)",null,{"$f":"D47","v":{"v":0,"d":"$0"}},null,"Arylsulfatase (mg p-nitrophenol kg-1 h-1)",null,{"$f":"IF(C72=\"\",\"\",C72)","v":""}]
[null,"Total cost ($/ha)",null,{"$f":"D49","v":""},null,"ß-glucosidase (mg p-nitrophenol kg-1 h-1)",null,{"$f":"IF(C73=\"\",\"\",C73)","v":""}]
[null,"Net Income ($/ha)",null,{"$f":"D51","v":""},null,"Biological soil quality index",null,{"$f":"IF(C75=\"\",\"\",C75)","v":""}]
[]
[null,"Foliar analysis",{"$nulls":3},"Soil Quality (Plot)",null,{"$f":"G129","v":0}]
[null,"P (g/kg)",{"$f":"IF(C32>0,C32,\"\")","v":""},{"$f":"IF(C32>0,E32,\"\")","v":""},null,"SOM",null,{"$f":"E60","v":{"v":0,"d":"0.00"}},0.7]
[null,"K (g/kg)","","",null,"Phosphorus",null,{"$f":"E61","v":{"v":0,"d":"0.00"}},0.7]
[null,"N (g/kg)","","",null,"Base saturation",null,{"$f":"E68","v":{"v":0,"d":"0.00"}},0.7]
[null,"S (g/kg)","","",null,"CEC",null,{"$f":"E67","v":{"v":0,"d":"0.00"}},0.7]
[null,"Ca (g/kg)","","",null,"pH ",null,{"$f":"E65","v":{"v":0,"d":"0.00"}},0.7]
[null,"Mg (g/kg)","","",null,"Soil erosion",null,{"$f":"C92","v":{"v":0.7,"d":"0.70"}},0.7]
[null,"B (mg/kg)","","",null,"Soil and water conservation",null,{"$f":"C108","v":""},0.7]
[null,"Zn (mg/kg)","","",null,"Biodiversity conservation",null,{"$f":"IF(H119>0,C127,\"\")","v":""},0.7]
[null,"Fe (mg/kg)","","",null,"Yield",null,{"$f":"C53","v":{"v":0,"d":"0.00"}},0.7]
[null,"Mn (mg/kg)","","",null,"Biological soil quality index",null,{"$f":"IF(ISBLANK(C75),\"\",C75)","v":""},0.7]
[null,"Cu (mg/kg)","","",null,"Soil Quality Index",null,{"$f":"AVERAGE(H162:H171)","v":{"v":0.09999999999999999,"d":"0.10"}}]
[]
[]
[]
[null,"FORMULAS"]
[]
[]
[1,"Weighting factor",{"$nulls":3},"Formulas\t\t"]
[null,"> 20%",null,0.9,null,"Formula (R parcial) = Yo + ax"]
[null,"Production or sale price = to local",null,0.7]
[{"$nulls":5},"yo",{"v":-0.3,"d":"-0.30"}]
[null,"< 20%",null,0.5,null,"a",0.01]
[null,"< 40%",null,0.3,null,{"$f":"IF(ISBLANK(D14),\"\",(G182+G183*(100+(E190*100))))","v":""},{"$f":"IF(ISBLANK(E14),\"\",(G182+G183*(100+(F190*100))))","v":""},{"$f":"IF(ISBLANK(F14),\"\",(G182+G183*(100+(G190*100))))","v":""}]
[]
[]
[{"$nulls":5},{"$f":"AVERAGE(E192:G192)","v":{"$error":"#DIV/0!"}}]
[]
[]
[null,"Variation of item 1.3 in relation to item 1.5",null,null,{"$f":"IF(D14>0,((D14/D15)-1),\"\")","v":""},{"$f":"IF(E14>0,((E14/E15)-1),\"\")","v":""},{"$f":"IF(F14>0,((F14/F15)-1),\"\")","v":""}]
[{"$nulls":4},{"v":1,"d":"1.0"},{"v":1,"d":"1.0"},{"v":1,"d":"1.0"},"Weighting matrix\t"]
[null,"Partial result","Productivity",null,{"$f":"IF(ISBLANK(D14),\"\",IF(F184>1,1,F184))","v":""},{"$f":"IF(ISBLANK(E14),\"\",IF(G184>1,1,G184))","v":""},{"$f":"IF(ISBLANK(F14),\"\",IF(H184>1,1,H184))","v":""}]
[]
[]
[null,"Units I",null,null,"Units II"]
[null,"Aquaculture production",null,null,"Sc/ha"]
[null,"Bovine milk",null,null,"Ton./ha"]
[null,"Cattle meat",null,null,"Kg/ha"]
[null,"Chicken meat",null,null," @/ha/year"]
[null,"Coffee",null,null,"L of milk/ha/year"]
[null,"Cotton",null,null,"L of milk/cow/day"]
[null,"Eggs",null,null,"Kg/dia"]
[null,"Fisheries products",null,null,"Kg of food/kg de meat produced"]
[null,"Forest products",null,null,"Piglets sold/pig/year"]
[null,"Fruit cultivation",null,null,"Eggs/chicken/year"]
[null,"Grains",null,null,"Food conversion/dozen eggs"]
[null,"Livestock",null,null,"Food conversion/Kg"]
[null,"Maize",null,null,"Percentage of laying eggs"]
[null,"Oil paml fruit"]
[null,"Others"]
[null,"Pig Meat"]
[null,"Potatos"]
[null,"Rice"]
[null,"Soybeans"]
[null,"Sugar cane"]
[null,"Vegetables"]
[null,"Wheat"]
[]
[]
[2,"SOM - Weighting factor",{"$nulls":5},"Soil granulometry (dag kg-1 of clay)"]
[null,"Classification",{"$nulls":3},"Weighting "]
[null,"Sandy\t","Loam\t","Clay\t","Heavy clay\t",null,null,"Sandy",null,"≤ 15"]
[null,{"v":0,"d":"0.00"},{"v":0,"d":"0.00"},{"v":0,"d":"0.00"},{"v":0,"d":"0.00"},{"v":0.1,"d":"0.10"},null,"Loam",null,"16 a 34"]
[null,{"v":0.8,"d":"0.80"},{"v":1.6,"d":"1.60"},{"v":2.4,"d":"2.40"},{"v":2.8,"d":"2.80"},{"v":0.5,"d":"0.50"},null,"Clay",null,"35 a 60"]
[null,{"v":1.1,"d":"1.10"},{"v":2.1,"d":"2.10"},{"v":3.1,"d":"3.10"},{"v":3.6,"d":"3.60"},{"v":0.7,"d":"0.70"},null,"Heavy clay",null,"> 60"]
[null,{"v":1.5,"d":"1.50"},{"v":3,"d":"3.00"},{"v":4.5,"d":"4.50"},{"v":5.2,"d":"5.20"},{"v":1,"d":"1.00"}]
[null,{"v":4.5,"d":"4.50"},{"v":9,"d":"9.00"},{"v":13.5,"d":"13.50"},{"v":15.6,"d":"15.60"},{"v":0.7,"d":"0.70"}]
[]
[null,"Sandy"," Yo + ax + bx2 + cx3 ",null,"Formula2 = Yo + ax ",null,null,{"$f":"IF(AND(E59=\"Sandy\"),IF(C60<1.5,E232,F232),0)","v":{"v":0,"d":"0.00"}}]
[null,null,"Yo",{"v":0.1,"d":"0.100"},"Yo",1.15,null,{"$f":"IF(AND(E59=\"Loam\"),IF(C60<3,E242,F242),0)","v":{"v":0,"d":"0.00"}}]
[null,null,"a",{"v":0.3597,"d":"0.360"},"a",{"v":-0.1,"d":"-0.10"},null,{"$f":"IF(AND(E59=\"Clay\"),IF(C60<4.5,E237,F237),0)","v":{"v":0,"d":"0.00"}}]
[null,null,"b",{"v":0.1926,"d":"0.193"},{"$f":"D230+D231*C60+D232*C60^2+D233*C60^3","v":{"v":0.1,"d":"0.10"}},{"$f":"F230+F231*C60","v":1.15},null,{"$f":"IF(AND(E59=\"Heavy clay\"),IF(C60<5.2,E247,F247),0)","v":{"v":0,"d":"0.00"}}]
[null,null,"c",{"v":-0.0216,"d":"-0.022"},{"$nulls":3},{"$f":"(H229+H230+H231+H232)","v":{"v":0,"d":"0.00"}}]
[null,"Clay"," Yo + ax + bx2 + cx3 ",null,"Formula2 = Yo + ax "]
[null,null,"Yo",{"v":0.1,"d":"0.100"},"Yo",1.15]
[null,null,"a",{"v":-0.0452,"d":"-0.045"},"a",{"v":-0.03333,"d":"-0.03"}]
[null,null,"b",{"v":0.1269,"d":"0.127"},{"$f":"D235+D236*C60+D237*C60^2+D238*C60^3","v":{"v":0.1,"d":"0.10"}},{"$f":"F235+F236*C60","v":1.15}]
[null,null,"c",{"v":-0.0161,"d":"-0.016"}]
[null,"Loam"," Yo + ax + bx2 + cx3 ",null,"Formula2 = Yo + ax "]
[null,null,"Yo",{"v":0.1,"d":"0.100"},"Yo",1.15]
[null,null,"a",{"v":0.0024,"d":"0.002"},"a",-0.05]
[null,null,"b",{"v":0.2183,"d":"0.218"},{"$f":"D240+D241*C60+D242*C60^2+D243*C60^3","v":{"v":0.1,"d":"0.10"}},{"$f":"F240+F241*C60","v":1.15}]
[null,null,"c",{"v":-0.0397,"d":"-0.040"}]
[null,"Heavy clay\t"," Yo + ax + bx2 + cx3 ",null,"Formula2 = Yo + ax "]
[null,null,"Yo",{"v":0.1,"d":"0.100"},"Yo",1.15]
[null,null,"a",{"v":-0.0486,"d":"-0.049"},"a",{"v":-0.0288,"d":"-0.03"}]
[null,null,"b",{"v":0.0984,"d":"0.098"},{"$f":"D245+D246*C60+D247*C60^2+D248*C60^3","v":{"v":0.1,"d":"0.10"}},{"$f":"F245+F246*C60","v":1.15}]
[null,null,"c",{"v":-0.0107,"d":"-0.011"}]
[]
[]
[null,"P - Weighting factor"]
[null,"Classification",{"$nulls":3},"Weighting "]
[null,"Sandy\t","Loam\t","Clay\t","Heavy clay\t"]
[null,{"v":0,"d":"0.00"},{"v":0,"d":"0.00"},{"v":0,"d":"0.00"},{"v":0,"d":"0.00"},{"v":0.1,"d":"0.10"}]
[null,{"v":12.1,"d":"12.10"},{"v":10.1,"d":"10.10"},{"v":5.1,"d":"5.10"},{"v":3.1,"d":"3.10"},0.25]
[null,{"v":18.1,"d":"18.10"},{"v":15.1,"d":"15.10"},{"v":8.1,"d":"8.10"},{"v":4.1,"d":"4.10"},{"v":0.5,"d":"0.50"}]
[null,{"v":25.1,"d":"25.10"},{"v":20.1,"d":"20.10"},{"v":12.1,"d":"12.10"},{"v":6.1,"d":"6.10"},{"v":0.7,"d":"0.70"}]
[null,{"v":40,"d":"40.00"},{"v":30,"d":"30.00"},{"v":18,"d":"18.00"},{"v":9,"d":"9.00"},{"v":1,"d":"1.00"}]
[null,{"v":400,"d":"400.00"},{"v":300,"d":"300.00"},{"v":180,"d":"180.00"},{"v":90,"d":"90.00"},{"v":0.7,"d":"0.70"}]
[]
[null,"Sandy"," Yo + ax ",null,"F2 = Yo + ax + bx2 ",null,"F3 = Yo + ax "]
[null,null,"Yo",{"v":0.1,"d":"0.10"},"Yo",{"v":-0.4748,"d":"-0.47"},"Yo",{"v":1.0233,"d":"1.02"}]
[null,null,"a",{"v":0.0124,"d":"0.01"},"a",{"v":0.0721,"d":"0.07"},"a",{"v":-0.0008,"d":"-0.00"}]
[{"$nulls":4},"b",{"v":-1E-3,"d":"-0.00"}]
[null,"Clay","F1 = Yo + ax + bx2 ",null,"F2 = Yo + ax + bx2 ",null,"F3 = Yo + ax "]
[null,null,"Yo",{"v":0.1,"d":"0.10"},"Yo",{"v":0.1034,"d":"0.10"},"Yo",{"v":1.04333,"d":"1.04"}]
[null,null,"a",{"v":-0.0045,"d":"-0.00"},"a",{"v":0.0483,"d":"0.05"},"a",{"v":-1.9E-3,"d":"-0.00"}]
[null,null,"b",{"v":0.0067,"d":"0.01"},"b",{"v":8.56e-05,"d":"0.00"}]
[null,"Loam","F1 = Yo + ax + bx2 ",null,"F2 = Yo + ax + bx2 ",null,"F3 = Yo + ax "]
[null,null,"Yo",{"v":0.1,"d":"0.10"},"Yo",{"v":-0.3015,"d":"-0.30"},"Yo",{"v":1.0333,"d":"1.03"}]
[null,null,"a",{"v":-0.0087,"d":"-0.01"},"a",{"v":0.0639,"d":"0.06"},"a",{"v":-0.0011,"d":"-0.00"}]
[null,null,"b",{"v":2.3E-3,"d":"0.00"},"b",{"v":-0.0007,"d":"-0.00"}]
[null,"Heavy clay\t","F1 = Yo + ax + bx2 ",null,"F2 = Yo + ax + bx2 ",null,"F3 = Yo + ax "]
[null,null,"Yo",{"v":0.1,"d":"0.10"},"Yo",{"v":0.1076,"d":"0.11"},"Yo",{"v":1.0333,"d":"1.03"}]
[null,null,"a",{"v":-0.1041,"d":"-0.10"},"a",{"v":0.0928,"d":"0.09"},"a",{"v":-0.0037,"d":"-0.00"}]
[null,null,"b",{"v":0.0492,"d":"0.05"},"b",{"v":0.0007,"d":"0.00"}]
[null,{"$f":"D262+D263*C61","v":{"v":0.1,"d":"0.10"}},{"$f":"F262+F263*C61+F264*C61^2","v":{"v":-0.4748,"d":"-0.47"}},{"$f":"0.1946+0.0201*C61","v":{"v":0.1946,"d":"0.19"}},{"$f":"H262+H263*C61","v":{"v":1.0233,"d":"1.02"}},{"$f":"IF(C61<=12.1,B277,IF(AND(C61>12.1,C61<25.1),C277,IF(C61>40,E277,D277)))","v":{"v":0.1,"d":"0.10"}}]
[null,{"$f":"D266+D267*C61+D268*C61^2","v":{"v":0.1,"d":"0.10"}},{"$f":"F266+F267*C61+F268*C61^2","v":{"v":0.1034,"d":"0.10"}},{"$f":"H266+H267*C61","v":{"v":1.04333,"d":"1.04"}},{"$f":"IF(AND(C61>8.1,C61<18),C278,IF(C61>=18,D278,B278))","v":{"v":0.1,"d":"0.10"}}]
[null,{"$f":"IF(AND(E59=\"Sandy\"),IF(C61<0,0,IF(F277>1,1,F277)),0)","v":{"v":0,"d":"0.00"}},{"$f":"IF(AND(E59=\"Loam\"),IF(C61<0,0,IF(E280>1,1,E280)),0)","v":{"v":0,"d":"0.00"}},{"$f":"IF(AND(E59=\"Clay\"),IF(C61<0,0,IF(E278>1,1,E278)),0)","v":{"v":0,"d":"0.00"}},{"$f":"IF(AND(E59=\"Heavy clay\"),IF(C61<0,0,IF(E281>1,1,E281)),0)","v":{"v":0,"d":"0.00"}},{"$f":"(B279+C279+D279+E279)","v":{"v":0,"d":"0.00"}}]
[null,{"$f":"D270+D271*C61+D272*C61^2","v":{"v":0.1,"d":"0.10"}},{"$f":"F270+F271*C61+F272*C61^2","v":{"v":-0.3015,"d":"-0.30"}},{"$f":"H270+H271*C61","v":{"v":1.0333,"d":"1.03"}},{"$f":"IF(AND(C61>15.1,C61<30),C280,IF(C61>=30,D280,B280))","v":{"v":0.1,"d":"0.10"}}]
[null,{"$f":"D274+D275*C61+D276*C61^2","v":{"v":0.1,"d":"0.10"}},{"$f":"F274+F275*C61+F276*C61^2","v":{"v":0.1076,"d":"0.11"}},{"$f":"H274+H275*C61","v":{"v":1.0333,"d":"1.03"}},{"$f":"IF(AND(C61>4.1,C61<9),C281,IF(C61>=9,D281,B281))","v":{"v":0.1,"d":"0.10"}}]
[]
[null,"Ca - Weighting factor"]
[null,"Classification"," Weighting factor"]
[null,{"v":0,"d":"0.00"},{"v":0.1,"d":"0.10"}]
[null,0.41,0.25]
[null,1.21,{"v":0.5,"d":"0.50"}]
[null,2.41,{"v":0.7,"d":"0.70"}]
[null,{"v":4,"d":"4.00"},{"v":1,"d":"1.00"}]
[null,{"v":20,"d":"20.00"},{"v":0.7,"d":"0.70"}]
[]
[null,"Ca - Formulas"]
[null,"F1 = Yo + ax + bx2 ",null,null,"F2 = Yo + ax + bx2 ",null,"F3 = Yo + ax "]
[null,"Yo",{"v":0.1,"d":"0.10"},null,"Yo",{"v":0.3213,"d":"0.32"},"Yo",{"v":1.075,"d":"1.08"}]
[null,"a",{"v":0.3839,"d":"0.38"},null,"a",{"v":0.1381,"d":"0.14"},"a",{"v":-0.0188,"d":"-0.02"}]
[null,"b",{"v":-0.0441,"d":"-0.04"},null,"b",{"v":0.0079,"d":"0.01"}]
[]
[null,null,{"$f":"C294+C295*C62+C296*C62^2","v":{"v":0.1,"d":"0.10"}},{"$f":"F294+F295*C62+F296*C62^2","v":{"v":0.3213,"d":"0.32"}},{"$f":"H294+H295*C62","v":{"v":1.075,"d":"1.08"}},{"$f":"IF(AND(C62>1.21,C62<4),D298,IF(C62>=4,E298,C298))","v":{"v":0.1,"d":"0.10"}}]
[]
[null,"Mg -  Weighting factor"]
[null,"Classification"," Weighting factor"]
[null,{"v":0,"d":"0.00"},{"v":0.1,"d":"0.10"}]
[null,0.16,0.25]
[null,0.46,{"v":0.5,"d":"0.50"}]
[null,0.91,{"v":0.7,"d":"0.70"}]
[null,{"v":1.5,"d":"1.50"},{"v":1,"d":"1.00"}]
[null,{"v":7.5,"d":"7.50"},{"v":0.7,"d":"0.70"}]
[]
[null,"Mg - Formulas"]
[null,"F1 = Yo + ax + bx2 ",null,null,"F2 = Yo + ax + bx2 ",null,"F3 = Yo + ax "]
[null,"Yo",{"v":0.1,"d":"0.10"},null,"Yo",{"v":0.3213,"d":"0.32"},"Yo",{"v":1.075,"d":"1.08"}]
[null,"a",{"v":0.9737,"d":"0.97"},null,"a",{"v":0.3601,"d":"0.36"},"a",-0.05]
[null,"b",{"v":-0.2264,"d":"-0.23"},null,"b",{"v":0.0616,"d":"0.06"}]
[null,null,{"$f":"C311+C312*C63+C313*C63^2","v":{"v":0.1,"d":"0.10"}},{"$f":"F311+F312*C63+F313*C63^2","v":{"v":0.3213,"d":"0.32"}},{"$f":"H311+H312*C63","v":{"v":1.075,"d":"1.08"}},{"$f":"IF(AND(C63>0.46,C63<1.5),D314,IF(C63>=1.5,E314,C314))","v":{"v":0.1,"d":"0.10"}}]
[]
[null,"K - Weighting factor"]
[null,"Classification"," Weighting factor"]
[null,{"v":0,"d":"0.00"},{"v":0.1,"d":"0.10"}]
[null,{"v":16,"d":"16.00"},0.25]
[null,{"v":41,"d":"41.00"},{"v":0.5,"d":"0.50"}]
[null,{"v":71,"d":"71.00"},{"v":0.7,"d":"0.70"}]
[null,{"v":120,"d":"120.00"},{"v":1,"d":"1.00"}]
[null,{"v":600,"d":"600.00"},{"v":0.7,"d":"0.70"}]
[]
[null,"K - Formulas"]
[null,"F1 = Yo + ax + bx2 ",null,null,"F2 = Yo + ax + bx2 ",null,"F3 = Yo + ax "]
[null,"Yo",{"v":0.1,"d":"0.10"},null,"Yo",{"v":0.2066,"d":"0.21"},"Yo",{"v":1.075,"d":"1.08"}]
[null,"a",{"v":0.0091,"d":"0.01"},null,"a",{"v":0.0074,"d":"0.01"},"a",{"v":-6.2E-4,"d":"-0.00"}]
[null,"b",{"v":1.5244E-5,"d":"0.00"},null,"b",{"v":-6.8888E-6,"d":"-0.00"}]
[null,null,{"$f":"C327+C328*C64+C329*C64^2","v":{"v":0.1,"d":"0.10"}},{"$f":"F327+F328*C64+F329*C64^2","v":{"v":0.2066,"d":"0.21"}},{"$f":"H327+H328*C64","v":{"v":1.075,"d":"1.08"}},{"$f":"IF(AND(C64>41,C64<120),D330,IF(C64>=120,E330,C330))","v":{"v":0.1,"d":"0.10"}}]
[]
[null,"pH - Weighting factor"]
[null,"Classification"," Weighting factor"]
[null,{"v":5.1,"d":"5.10"},{"v":0.3,"d":"0.30"}]
[null,{"v":5.2,"d":"5.20"},{"v":0.4,"d":"0.40"}]
[null,{"v":5.5,"d":"5.50"},{"v":0.7,"d":"0.70"}]
[null,{"v":6,"d":"6.00"},{"v":1,"d":"1.00"}]
[null,{"v":6.4,"d":"6.40"},{"v":0.7,"d":"0.70"}]
[]
[null,"pH - Formulas"]
[null,"F1 = Yo + ax + bx2 ",null,null,"F2 = Yo + ax + bx2 "]
[null,"Yo",{"v":-19.1,"d":"-19.10"},null,"Yo",{"v":-42.5,"d":"-42.50"}]
[null,"a",6.35,null,"a",14.75]
[null,"b",{"v":-0.5,"d":"-0.50"},null,"b",-1.25]
[null,{"$f":"-4.8+(1*C65)","v":{"v":-4.8,"d":"-4.80"}},{"$f":"C342+C343*C65+C344*C65^2","v":{"v":-19.1,"d":"-19.10"}},{"$f":"F342+F343*C65+F344*C65^2","v":{"v":-42.5,"d":"-42.50"}},{"$f":"IF(C65>=6.6,F345,IF(AND(C65>=6,C65<6.6),D345,IF(AND(C65>5.2,C65<6),C345,B345)))","v":{"v":-4.8,"d":"-4.80"}}]
[]
[null,"Al - Weighting factor"]
[null,"Classification"," Weighting factor"]
[null,{"v":0,"d":"0.00"},{"v":0.7,"d":"0.70"}]
[null,0.21,{"v":0.6,"d":"0.60"}]
[null,0.51,{"v":0.5,"d":"0.50"}]
[null,1.01,0.25]
[null,{"v":2,"d":"2.00"},{"v":0,"d":"0.00"}]
[]
[null,"Al - Formulas"]
[null,"F1 = Yo + ax + bx2 ",null,null,"F2 = Yo + ax + bx2 "]
[null,"Yo",{"v":0.7,"d":"0.70"},null,"Yo",{"v":0.8406,"d":"0.84"}]
[null,"a",{"v":-0.535,"d":"-0.54"},null,"a",{"v":-0.7525,"d":"-0.75"}]
[null,"b",{"v":0.2801,"d":"0.28"},null,"b",{"v":0.1661,"d":"0.17"}]
[null,null,{"$f":"C357+C358*C66+C359*C66^2","v":{"v":0.7,"d":"0.70"}},{"$f":"F357+F358*C66+F359*C66^2","v":{"v":0.8406,"d":"0.84"}},{"$f":"IF(C66>=0.51,D360,C360)","v":{"v":0.7,"d":"0.70"}}]
[]
[null,"CTC - Weighting factor"]
[null,"Classification"," Weighting factor"]
[null,{"v":0,"d":"0.00"},{"v":0.1,"d":"0.10"}]
[null,{"v":1.6,"d":"1.60"},0.25]
[null,{"v":4.3,"d":"4.30"},{"v":0.5,"d":"0.50"}]
[null,{"v":8.6,"d":"8.60"},{"v":0.7,"d":"0.70"}]
[null,{"v":15,"d":"15.00"},{"v":1,"d":"1.00"}]
[]
[null,"CTC - Formulas"]
[null,"F1 = Yo + ax"]
[null,"Yo",0.1654]
[null,"a",{"v":0.0584,"d":"0.06"}]
[]
[null,null,{"$f":"C372+C373*C67","v":{"v":0.1654,"d":"0.17"}},{"$f":"IF(C375>1,1,C375)","v":{"v":0.1654,"d":"0.17"}},{"$f":"D375","v":{"v":0.1654,"d":"0.17"}}]
[]
[null,"V - Weighting factor"]
[null,"Classification"," Weighting factor"]
[null,{"v":0,"d":"0.00"},{"v":0.1,"d":"0.10"}]
[null,{"v":15,"d":"15.00"},0.25]
[null,{"v":30,"d":"30.00"},{"v":0.5,"d":"0.50"}]
[null,{"v":60,"d":"60.00"},{"v":0.7,"d":"0.70"}]
[null,{"v":80,"d":"80.00"},{"v":1,"d":"1.00"}]
[]
[null,"V - Formulas"]
[null,"Fórmula1 = Yo + ax ",null,"Formula2 = Yo + ax+bx2 "]
[null,"Yo",{"v":0.3,"d":"0.30"},null,"Yo",{"v":0.1,"d":"0.10"}]
[null,"a",{"v":0.0067,"d":"0.01"},null,"a",{"v":0.0067,"d":"0.01"}]
[{"$nulls":4},"b",{"v":0.0002,"d":"0.00"}]
[null,null,{"$f":"C387+C388*C68","v":{"v":0.3,"d":"0.30"}},{"$f":"F387+F388*C68+F389*C68^2","v":{"v":0.1,"d":"0.10"}},{"$f":"IF(C68<30,D390,C390)","v":{"v":0.1,"d":"0.10"}}]
[]
[null,"12 - Formulas"]
[null,"Formula - Average (organic matter; available P; base saturation)"]
[]
[]
[]
[3,"Weighting matrix"]
[null,"item 15.1","Weighting"]
[null,"< 5%",0.55]
[null,"5 - 10%",0.45]
[null,"> 10%",0.35]
[null,"item 15.1","Weighting"]
[null,"Advanced",{"v":0.5,"d":"0.50"}]
[null,"Intermediary",{"v":0.8,"d":"0.80"}]
[null,"Initial",1]
[null,"item 15.2","Weighting"]
[null,"Reduction",1.2]
[null,"Unchanged",{"v":1,"d":"1.0"}]
[null,"Intensification",0.8]
[]
[null,"Formulas",null,"< 5%","5% - 10%","> 10%"]
[{"$nulls":3},{"$f":"IF(B420>0,1,\" \")","v":" "},{"$f":"IF(D420>0,1,\" \")","v":" "},{"$f":"IF(F420>0,1,\" \")","v":" "}]
[{"$nulls":3},{"$f":"IF(B418>0,1,\" \")","v":" "},{"$f":"IF(D418>0,1,\" \")","v":" "},{"$f":"IF(F418>0,1,\" \")","v":" "}]
[{"$nulls":3},{"$f":"IF(B416>0,1,\" \")","v":" "},{"$f":"IF(D416>0,1,\" \")","v":" "},{"$f":"IF(F416>0,1,\" \")","v":" "}]
[null,{"$f":"IF(F87<0.05,E87,0)","v":0},null,{"$f":"IF(F87>=0.05,E87,0)","v":0},null,{"$f":"IF(F87>0.1,E87,0)","v":0}]
[null,{"$f":"IF(D87=B425,B415,0)","v":0},null,{"$f":"IF(F415>0.001,0,IF(D87=B425,D415,0))","v":0},null,{"$f":"IF(D87=B425,F415,0)","v":0}]
[null,{"$f":"IF(F87<0.05,E87,0)","v":0},null,{"$f":"IF(F87>=0.05,E87,0)","v":0},null,{"$f":"IF(F87>0.1,E87,0)","v":0}]
[null,{"$f":"IF(D87=B426,B417,0)","v":0},null,{"$f":"IF(F417>0.001,0,IF(D87=B426,D417,0))","v":0},null,{"$f":"IF(D87=B426,F417,0)","v":0}]
[null,{"$f":"IF(F87<0.05,E87,0)","v":0},null,{"$f":"IF(F87>=0.05,E87,0)","v":0},null,{"$f":"IF(F87>0.1,E87,0)","v":0}]
[null,{"$f":"IF(D87=B427,B419,0)","v":0},null,{"$f":"IF(F419>0.001,0,IF(D87=B427,D419,0))","v":0},null,{"$f":"IF(D87=B427,F419,0)","v":0}]
[null,{"$f":"IF(B423>0,B423,0)+IF(C423>0,C423,0)+IF(D423>0,D423,0)","v":{"v":0,"d":"0.00"}}]
[null,{"$f":"IF(D90=D425,1,0)","v":{"v":0,"d":"0.00"}},{"$f":"IF(D90=D426,1,0)","v":{"v":0,"d":"0.00"}},{"$f":"IF(D90=D427,1,0)","v":{"v":0,"d":"0.00"}}]
[null,{"$f":"IF(B416>0,G87*B432,0)+IF(B418>0,G88*B432,0)+IF(B420>0,G90*B432,0)","v":0},{"$f":"IF(D416>0,G87*B433,0)+IF(D418>0,G88*B433,0)+IF(D420>0,G90*B433,0)","v":0},{"$f":"IF(F416>0,G87*B434,0)+IF(F418>0,G88*B434,0)+IF(F420>0,G90*B434,0)","v":0}]
[null,"Units III",null,"Units IV"]
[null,"Initial",null,"Reduction"]
[null,"Intermediary",null,"Unchanged"]
[null,"Advanced",null,"Intensification"]
[]
[]
[]
[]
[null,{"$f":"C399","v":0.55}]
[null,{"$f":"C400","v":0.45}]
[null,{"$f":"C401","v":0.35}]
[]
[null,"Formula - verifies the proportion of the degraded area in relation to the total area and the degree of intensity of the phenomenon. After calculation, multiply the final value by factor 1.2, if there is a tendency to reduce the degradation stage or by factor 0.8, if the tendency is to intensify the degradation stage."]
[]
[]
[]
[4,"Weighting factor"]
[null,"Adequate",{"v":1,"d":"1.0"}]
[null,"Medium",0.6]
[null,"Low",0.3]
[null,"Critical situation",0.1]
[]
[]
[null,"Weighting"]
[null,{"$f":"E104","v":{"v":1,"d":"1.0"}}]
[null,{"$f":"E105","v":0.4}]
[null,{"$f":"E106","v":0.1}]
[]
[null,"Formulas"]
[null,{"$f":"D98/D457","v":{"$error":"#DIV/0!"}},null,{"$f":"B453","v":{"$error":"#DIV/0!"}}]
[null,{"$f":"D99/D457","v":{"$error":"#DIV/0!"}},null,{"$f":"B454","v":{"$error":"#DIV/0!"}}]
[null,{"$f":"D100/D457","v":{"$error":"#DIV/0!"}},null,{"$f":"B455","v":{"$error":"#DIV/0!"}}]
[null,{"$f":"D101/D457","v":{"$error":"#DIV/0!"}},null,{"$f":"B456","v":{"$error":"#DIV/0!"}}]
[null,"Total area of the farm (ha) =>",{"$f":"C6","v":{"v":0,"d":"0.00"}},{"$f":"D98+D99+D100+D101","v":{"v":0,"d":"0.0"}}]
[]
[{"$nulls":3},{"$f":"IF(D104=B463,B448,0)","v":0}]
[null,{"$f":"(D453*C441)+(D454*C442)+(D455*C443)+(D456*C444)","v":{"$error":"#DIV/0!"}},{"$f":"SUM(D459:D461)","v":{"v":0,"d":"0.00"}},{"$f":"IF(D104=B464,B449,0)","v":0}]
[{"$nulls":3},{"$f":"IF(D104=B465,B450,0)","v":0}]
[null,"Units V"]
[null,"Sufficient"]
[null,"Insufficient"]
[null,"Critical situation"]
[]
[5,"Weighting matrix"]
[null,"Adequate",{"v":1,"d":"1.0"}]
[null,"Medium",0.6]
[null,"Low",0.3]
[null,"Critical situation",0.1]
[]
[]
[null,{"$f":"D114/C479","v":{"$error":"#DIV/0!"}},{"$f":"B474","v":{"$error":"#DIV/0!"}}]
[null,{"$f":"D115/C479","v":{"$error":"#DIV/0!"}},{"$f":"B475","v":{"$error":"#DIV/0!"}}]
[null,{"$f":"D116/C479","v":{"$error":"#DIV/0!"}},{"$f":"B476","v":{"$error":"#DIV/0!"}}]
[null,{"$f":"D117/C479","v":{"$error":"#DIV/0!"}},{"$f":"B477","v":{"$error":"#DIV/0!"}}]
[]
[null,null,{"$f":"SUM(D114:D117)","v":{"v":0,"d":"0.0"}}]
[]
[]
[]
[null,"Foliar analysis (optional)"]
[]
[{"$nulls":4},"Result"]
[null,"P (g/kg)",{"$f":"C32","v":{"v":0,"d":"0.0"}},null,{"$f":"IF(ISBLANK(C32),\"\",IF(C32<=H548,G487,IF(AND(C32>H548,C32<=H549),G488,IF(C32>H549,G489))))","v":""}]
[null,"K (g/kg)",{"v":0,"d":"0.0"},null,{"$f":"IF(ISBLANK(C33),\"\",IF(C33<=H552,G487,IF(AND(C33>H552,C33<=H553),G488,IF(C33>H553,G489))))","v":""},null,"Low"]
[null,"N (g/kg)",{"v":0,"d":"0.0"},null,{"$f":"IF(ISBLANK(C34),\"\",IF(C34<=H556,G487,IF(AND(C34>H556,C34<=H557),G488,IF(C34>H557,G489))))","v":""},null,"Adequate"]
[null,"S (g/kg)",{"v":0,"d":"0.0"},null,{"$f":"IF(ISBLANK(C35),\"\",IF(C35<=H560,G487,IF(AND(C35>H560,C35<=H561),G488,IF(C35>H561,G489))))","v":""},null,"High"]
[null,"Ca (g/kg)",{"v":0,"d":"0.0"},null,{"$f":"IF(ISBLANK(C36),\"\",IF(C36<=H564,G487,IF(AND(C36>H564,C36<=H565),G488,IF(C36>H565,G489))))","v":""}]
[null,"Mg (g/kg)",{"v":0,"d":"0.0"},null,{"$f":"IF(ISBLANK(C37),\"\",IF(C37<=H568,G487,IF(AND(C37>H568,C37<=H569),G488,IF(C37>H569,G489))))","v":""}]
[null,"B (mg/kg)",{"v":0,"d":"0.0"},null,{"$f":"IF(ISBLANK(C38),\"\",IF(C38<=H572,G487,IF(AND(C38>H572,C38<=H573),G488,IF(C38>H573,G489))))","v":""}]
[null,"Zn (mg/kg)",{"v":0,"d":"0.0"},null,{"$f":"IF(ISBLANK(C39),\"\",IF(C39<=H576,G487,IF(AND(C39>H576,C39<=H577),G488,IF(C39>H577,G489))))","v":""}]
[null,"Fe (mg/kg)",{"v":0,"d":"0.0"},null,{"$f":"IF(ISBLANK(C40),\"\",IF(C40<=H580,G487,IF(AND(C40>H580,C40<=H581),G488,IF(C40>H581,G489))))","v":""}]
[null,"Mn (mg/kg)",{"v":0,"d":"0.0"},null,{"$f":"IF(ISBLANK(C41),\"\",IF(C41<=H584,G487,IF(AND(C41>H584,C41<=H585),G488,IF(C41>H585,G489))))","v":""}]
[null,"Cu (mg/kg)",{"v":0,"d":"0.0"},null,{"$f":"IF(ISBLANK(C42),\"\",IF(C42<=H588,G487,IF(AND(C42>H588,C42<=H589),G488,IF(C42>H589,G489))))","v":""}]
[]
[]
[null,null,"Units VI","Units VII","Units VIII","Units IX","Units X"]
[null,"Level","Soybeans","Maize","Coffee","Pasture","Other"]
["P (g/kg)","Low"]
[null,"Adequate",2.8,2.5,1.5,0.8]
[null,null,3.9,3.5,{"v":2,"d":"2.0"},{"v":3,"d":"3.0"}]
[null,"High"]
["K (g/kg)","Low"]
[null,"Adequate",14.4,17.5,{"v":19,"d":"19.0"},{"v":12,"d":"12.0"}]
[null,null,20.3,22.5,{"v":24,"d":"24.0"},{"v":25,"d":"25.0"}]
[null,"High"]
["N (g/kg)","Low"]
[null,"Adequate",{"v":50.62,"d":"50.6"},27.5,{"v":23,"d":"23.0"},{"v":12,"d":"12.0"}]
[null,null,62.4,32.5,{"v":32,"d":"32.0"},{"v":20,"d":"20.0"}]
[null,"High"]
["S (g/kg)","Low"]
[null,"Adequate",2.4,{"v":1,"d":"1.0"},1.5,0.8]
[null,null,3.3,{"v":2,"d":"2.0"},{"v":2,"d":"2.0"},2.5]
[null,"High"]
["Ca (g/kg)","Low"]
[null,"Adequate",6.2,2.5,{"v":10,"d":"10.0"},{"v":2,"d":"2.0"}]
[null,null,11.6,{"v":4,"d":"4.0"},{"v":14,"d":"14.0"},{"v":6,"d":"6.0"}]
[null,"High"]
["Mg (g/kg)","Low"]
[null,"Adequate",{"v":3,"d":"3.0"},2.5,3.1,1.5]
[null,null,4.9,{"v":4,"d":"4.0"},3.6,{"v":4,"d":"4.0"}]
[null,"High"]
["B (mg/kg)","Low"]
[null,"Adequate",{"v":37,"d":"37.0"},{"v":4,"d":"4.0"},{"v":59,"d":"59.0"},{"v":10,"d":"10.0"}]
[null,null,{"v":56,"d":"56.0"},{"v":20,"d":"20.0"},{"v":80,"d":"80.0"},{"v":20,"d":"20.0"}]
[null,"High"]
["Zn (mg/kg)","Low"]
[null,"Adequate",{"v":41,"d":"41.0"},{"v":20,"d":"20.0"},{"v":8,"d":"8.0"},{"v":20,"d":"20.0"}]
[null,null,{"v":78,"d":"78.0"},{"v":70,"d":"70.0"},{"v":16,"d":"16.0"},{"v":50,"d":"50.0"}]
[null,"High"]
["Fe (mg/kg)","Low"]
[null,"Adequate",{"v":77,"d":"77.0"},{"v":20,"d":"20.0"},{"v":90,"d":"90.0"},{"v":50,"d":"50.0"}]
[null,null,{"v":155,"d":"155.0"},{"v":250,"d":"250.0"},{"v":180,"d":"180.0"},{"v":250,"d":"250.0"}]
[null,"High"]
["Mn (mg/kg)","Low"]
[null,"Adequate",{"v":38,"d":"38.0"},{"v":20,"d":"20.0"},{"v":120,"d":"120.0"},{"v":40,"d":"40.0"}]
[null,null,{"v":97,"d":"97.0"},{"v":150,"d":"150.0"},{"v":210,"d":"210.0"},{"v":250,"d":"250.0"}]
[null,"High"]
["Cu (mg/kg)","Low"]
[null,"Adequate",{"v":7,"d":"7.0"},{"v":6,"d":"6.0"},{"v":8,"d":"8.0"},{"v":4,"d":"4.0"}]
[null,null,{"v":12,"d":"12.0"},{"v":20,"d":"20.0"},{"v":16,"d":"16.0"},{"v":12,"d":"12.0"}]
[null,"High"]
[null,null,"Reference: Documento 458 - Tecnologias de manejo da fertilidade do solo e avaliação do estado nutricional da soja - Embrapa, 2023","Fertilidade de solos: nutrição e adubação do milho - Embrapa (2007)","Documentos 14 - Estado nutricional dos solos e cafeeiros da região das Matas de Minas - Embrapa - 2021","Cerrado: correção do solo e adubação - Embrapa - 2004"]
[null,"Level"]
["P (g/kg)","Low",{"$f":"IF($C$31=$C$500,C501,\"\")","v":""},{"$f":"IF($C$31=$D$500,D501,\"\")","v":""},{"$f":"IF($C$31=$E$500,E501,\"\")","v":""},{"$f":"IF($C$31=$F$500,F501,\"\")","v":""},{"$f":"IF($C$31=$G$500,G501,\"\")","v":""},{"$f":"SUM(C547:G547)","v":{"v":0,"d":"0.0"}}]
[null,"Adequate","","","","","",{"$f":"SUM(C548:G548)","v":{"v":0,"d":"0.0"}}]
[null,null,"","","","","",{"v":0,"d":"0.0"}]
[null,"High","","","","","",{"v":0,"d":"0.0"}]
["K (g/kg)","Low","","","","","",{"v":0,"d":"0.0"}]
[null,"Adequate","","","","","",{"v":0,"d":"0.0"}]
[null,null,"","","","","",{"v":0,"d":"0.0"}]
[null,"High","","","","","",{"v":0,"d":"0.0"}]
["N (g/kg)","Low","","","","","",{"v":0,"d":"0.0"}]
[null,"Adequate","","","","","",{"v":0,"d":"0.0"}]
[null,null,"","","","","",{"v":0,"d":"0.0"}]
[null,"High","","","","","",{"v":0,"d":"0.0"}]
["S (g/kg)","Low","","","","","",{"v":0,"d":"0.0"}]
[null,"Adequate","","","","","",{"v":0,"d":"0.0"}]
[null,null,"","","","","",{"v":0,"d":"0.0"}]
[null,"High","","","","","",{"v":0,"d":"0.0"}]
["Ca (g/kg)","Low","","","","","",{"v":0,"d":"0.0"}]
[null,"Adequate","","","","","",{"v":0,"d":"0.0"}]
[null,null,"","","","","",{"v":0,"d":"0.0"}]
[null,"High","","","","","",{"v":0,"d":"0.0"}]
["Mg (g/kg)","Low","","","","","",{"v":0,"d":"0.0"}]
[null,"Adequate","","","","","",{"v":0,"d":"0.0"}]
[null,null,"","","","","",{"v":0,"d":"0.0"}]
[null,"High","","","","","",{"v":0,"d":"0.0"}]
["B (mg/kg)","Low","","","","","",{"v":0,"d":"0.0"}]
[null,"Adequate","","","","","",{"v":0,"d":"0.0"}]
[null,null,"","","","","",{"v":0,"d":"0.0"}]
[null,"High","","","","","",{"v":0,"d":"0.0"}]
["Zn (mg/kg)","Low","","","","","",{"v":0,"d":"0.0"}]
[null,"Adequate","","","","","",{"v":0,"d":"0.0"}]
[null,null,"","","","","",{"v":0,"d":"0.0"}]
[null,"High","","","","","",{"v":0,"d":"0.0"}]
["Fe (mg/kg)","Low","","","","","",{"v":0,"d":"0.0"}]
[null,"Adequate","","","","","",{"v":0,"d":"0.0"}]
[null,null,"","","","","",{"v":0,"d":"0.0"}]
[null,"High","","","","","",{"v":0,"d":"0.0"}]
["Mn (mg/kg)","Low","","","","","",{"v":0,"d":"0.0"}]
[null,"Adequate","","","","","",{"v":0,"d":"0.0"}]
[null,null,"","","","","",{"v":0,"d":"0.0"}]
[null,"High","","","","","",{"v":0,"d":"0.0"}]
["Cu (mg/kg)","Low","","","","","",{"v":0,"d":"0.0"}]
[null,"Adequate","","","","","",{"v":0,"d":"0.0"}]
[null,null,"","","","","",{"v":0,"d":"0.0"}]
[null,"High","","","","","",{"v":0,"d":"0.0"}]