{"text_format":"3","workbook":"xlsx","n_sheets":14,"sheets":["Guia de aplicação","1 Questionário","2 Indicadores","3 Relatório","4 Plano de adequação","Plan1","Sheet3","Sheet4","Sheet5","Sheet6","Relatório de Assist (2)","Fórmulas","Base de dados","IQS 1"],"not_rendered":{"charts":6,"images":56,"defined_names":42,"comments":1},"read":"whole","date_system":"1900"}

{"sheet":"Guia de aplicação","index":0,"n_rows":330,"n_cols":6,"rows_kept":330,"merged":[[0,1,1,2],[2,1,2,2],[13,1,13,12],[15,1,15,12],[17,1,17,12],[19,1,19,12],[21,1,22,12],[24,1,24,12],[26,1,26,12],[28,0,34,0],[28,1,34,12],[36,0,37,0],[36,1,37,12],[39,0,41,0],[39,1,41,12],[45,1,45,12],[46,1,55,12],[57,1,57,12],[58,1,64,12],[66,1,66,12],[67,1,72,12],[74,1,74,12],[75,1,87,12],[89,1,89,12],[90,1,96,12],[98,1,98,12],[99,1,104,12],[106,1,106,12],[107,1,115,12],[117,1,117,12],[118,1,127,12],[129,1,129,12],[130,1,141,12],[143,1,143,12],[144,1,155,12],[157,1,157,12],[158,1,166,12],[170,1,170,6],[171,3,171,4],[171,5,171,6],[172,3,172,4],[172,5,172,6],[173,3,173,4],[173,5,173,6],[174,3,174,4],[174,5,174,6],[176,1,180,12],[182,1,182,12],[183,1,199,12],[201,1,201,12],[202,1,219,12],[221,1,221,12],[222,1,232,12],[236,1,240,12],[242,1,247,12],[249,1,264,12],[266,1,266,12],[267,1,276,12],[280,1,284,12],[286,1,286,12],[287,1,298,12],[300,1,300,12],[301,1,306,12],[308,1,308,12],[329,1,338,12]]}
[null,"ISA"]
[{"$nulls":3},"GUIA DE APLICAÇÃO"]
[null,"ISBN 978-85-99764-26-8"]
[null,"Indicadores de Sustentabilidade em Agroecossistemas - ISA"]
[null,"O sistema ISA é composto por 7 pastas:"]
[null,"1ª - Guia de aplicação"]
[null,"2ª - Questionário"]
[null,"3ª - Indicadores"]
[null,"4ª - Relatório"]
[null,"5ª - Plano de adequação"]
[null,"6ª - Fórmulas utilizadas nos Indicadores"]
[null,"7ª - Base de dados"]
[null,"Pasta assessória - Índice de Qualidade do Solo (IQS) na escala de talhão (parcela)"]
[null,"A ferramenta ISA foi desenvolvida para aferir o desempenho ambiental, social e econômico dos agroecossistemas, na escala de um imóvel rural, como também identificar limitações, pontos críticos, potencialidades e oportunidades nos diversos usos e ocupações. Para cada indicador, é calculado um índice que varia de 0 e 1, por meio da comparação de medições realizadas no imóvel rural com valores de referência, e da aplicação de fatores de ponderação aos parâmetros correspondentes. O valor base 0,7 é padronizado como o limiar de sustentabilidade. O Índice Final (aba Relatório) é gerado com base na média de 17 indicadores de sustentabilidade. A aba Índice de Qualidade do Solo (IQS) foi desenvolvida para avaliar a qualidade do solo na escala de talhão e pode ser replicada para múltiplas parcelas ou sistemas de produção.\t\t\t\t\t\t\t\t\t\t\n\t\t\t\t\t\t\t\t\t\t\t"]
[]
[null,"Aplicação do ISA"]
[]
[null,"1 - Crie um croqui do imóvel rural, começando pelo perímetro, usando o Google Earth ou um programa semelhante.\t\t\t\t\t\t\t\t\t"]
[]
[null,"2 - Identifique no croqui os diversos usos e ocupações do solo, incluindo culturas anuais, culturas perenes, pastagens, florestas, habitats naturais, corpos d'água, nascentes, represas e lagos. Esses dados (polígonos, linhas ou pontos) poderão ser aproveitados para gerar, verificar ou retificar o Cadastro Ambiental Rural (CAR).\t\t\t\t\t\t\t"]
[]
[null,"3 - A partir do croqui gerado, e de informações levantadas no CAR, como, por exemplo, as Áreas de Preservação Permanente (APPs), inicia-se o planejamento da visita de campo, definindo-se os locais que serão percorridos, com o objetivo de verificar o manejo das áreas produtivas, o estado de conservação das áreas com vegetação nativa, o estado de conservação das estradas, definir os locais para a coleta de amostras de solo, quando necessário, e os locais para a avaliação da qualidade da água e dos ecossistemas aquáticos, quando presentes. \n\t\t\t\t\t\t\t\t\t\t\t"]
[]
[]
[null,"Preenchimento dos dados "]
[null,"1 QUESTIONÁRIO"]
[1,"Colar os croquis do imóvel (croqui gerado no Google Earth ou outro programa similar, e o croqui gerado no CAR)."]
[]
[6,"O preenchimento da posse de terra diz respeito ao vínculo que o produtor possui com o imóvel rural. Proprietário é a pessoa física ou jurídica que possui o imóvel rural, válido e regularmente destacado do patrimônio público, com o registro imobiliário no seu nome. Ele detém o domínio pleno direto (direito de dispor do imóvel rural) e útil (direito de utilizar ou usufruir do imóvel rural).  O Posseiro é aquele que exerce o direito de posse por um ato translativo de domínio, por um documento de passagem de propriedade de um titular a outro, o que ocorre quando o título de propriedade ainda não foi levado a registro imobiliário. Arrendatário é aquele que arrenda (aluga) o imóvel rural para fins de exploração agrícola ou pecuária, na condição de uma regular utilização. Parceiro, ou \"Meeiro\", é aquele que explora o imóvel rural, no todo ou em parte, mediante contrato agrário escrito ou verbal, remunerando o proprietário ou titular do domínio útil com um percentual da produção alcançada. Assentado, pessoa ou família contemplada por um projeto de Reforma Agrária; Usufrutuário é a pessoa que utiliza a terra como usufruto, geralmente com vínculo familiar, e não tem a posse ou propriedade."]
{"$rows_empty":7}
[7,"A planilha ISA foi concebida para ser aplicada em um imóvel rural em consonância com a declaração do Cadastro Ambiental Rural (CAR). Caso o produtor possua outras áreas que compõem a renda ou façam parte do seu empreendimento rural (áreas não contíguas ao imóvel, áreas de arrendamento, áreas destinadas para a compensação de Reserva Legal), as mesmas serão descritas na tabela localizada nesse item, mas não serão objeto de análise dos indicadores."]
[]
[]
[8,"Identificar no imóvel rural as áreas de produção das culturas anuais, perenes, pastagens e florestas plantadas (silvicultura), além das áreas não agrícolas (construções, estradas, terreiros, etc.), áreas de pousio, espelho e cursos d'água (represas, lagos, lagoas, e cursos d'água), vegetação nativa e as áreas inaproveitáveis (vossorocas e outras áreas que no momento da avaliaçâo estavam inaproveitáveis para atividades econômicas). A somatória de todas as áreas lançadas neste item deve corresponder à área do imóvel rural lançada no item 7. Nota: O uso e a ocupação do solo referem-se apenas ao impóvel rural em análise e não incluem outros imóveis e áreas não contíguas."]
[]
[]
[]
[null,"2 INDICADORES"]
[]
[1,"PRODUTIVIDADE E PREÇOS DE VENDA"]
[null,"DESCRIÇÃO\nAvalia a renda bruta anual do imóvel rural proveniente das atividades agrícolas e compara sua produtividade média e preço de mercado com a referência regional ou local. Esse indicador analisa também a contribuição relativa de cada atividade para a receita bruta total do imóvel rural.\nAPLICAÇÃO\n1ª ETAPA  - Identifique as principais fontes de renda das atividades agrícolas e liste-as em ordem decrescente com base na receita bruta anual estimada (Item 1.1): a primeira linha deve indicar a atividade que gera a maior receita bruta; a segunda linha deve indicar a atividade que gera a segunda maior receita bruta; as demais atividades devem ser agrupadas na terceira linha.                                                                                                                                                                                                                                                   2ª ETAPA -  Selecione as atividades agrícolas e as unidades de medida para avaliar a produtividade. As atividades e unidades de medida podem ser modificadas na Aba Fórmulas.\n3ª ETAPA - Insira os índices de produtividade: para culturas anuais, considere a produtividade média da última safra; para a pecuária, considere a produção média do último ano; para culturas perenes, considere a média de produção das duas últimas safras.\n4ª ETAPA - Informe o preço médio de venda da safra mais recente ou do último ano. Para vendas parceladas, calcule o valor médio.\n5ª ETAPA - Lançe a média de produtividade e do preço de venda dos produtos levantados na região ou município. Utilize dados de relatórios anuais oficiais, cooperativas, associações ou agricultores reconhecidos como referência na região. O cálculo do resultado final é feito automaticamente, a partir da média dos índices gerados de cada atividade do empreendimento. Possíveis informações complementares / indagações: Como essa produtividade foi alcançada? Qual é a capacidade produtiva do solo nas áreas agrícolas? Como as atividades são gerenciadas? Quais insumos são utilizados e em quais quantidades? Quais são os critérios para aplicação desses insumos? Quais são as estratégias de compra de insumos?Há disponibilidade de máquinas e equipamentos, ou os serviços são terceirizados? Existe mão de obra qualificada na região? Há infraestrutura pós-colheita ou depende de serviços terceirizados? Como a produção é comercializada e transportada? Ao responder a essas e outras perguntas relevantes, é possível entender como o indicador foi formado. Com base nessa análise, avalie se o resultado está adequado e identifique oportunidades de melhoria. Nota: se a renda bruta média gerada no imóvel rural for menor que R$ 300,00/ha/ano — considerando a receita bruta estimada e a área do imóvel rural — é gerado um rebate de 30% na nota final deste indicador (cálculo realizado automaticamente)."]
{"$rows_empty":10}
[2,"DIVERSIDADE DE RENDA"]
[null,"DESCRIÇÃO\nAnalisa a diversidade das fontes de renda, atribuindo diferentes pesos com base na origem (dentro ou fora da propriedade) e no tipo de renda.                                                                                                                                                                                                     APLICAÇÃO\nEstimar as outras fontes de renda dentro do imóvel rural (item 2.1) e as fontes de renda fora do imóvel rural (atividades agropecuárias, ou não, realizadas fora do imóvel rural e recebimentos de pensão, aposentadoria, bolsas e outras ajudas financeiras - item 2.2) pelos membros da família diretamente envolvidos nas atividades produtivas do imóvel rura. Os porcentuais de cada fonte de renda são lançados automaticamente, assim como a verificação de concentração de renda em uma única atividade agropecuária (item 2.3)."]
{"$rows_empty":7}
[3,"EVOLUÇÃO PATRIMONIAL E GRAU DE ENDIVIDAMENTO\t\t\t\t\t\t\t\t\t\t\t"]
[null,"DESCRIÇÃO\nEstima o valor dos ativos da fazenda, incluindo equipamentos, benfeitorias, semoventes (animais), estoque de grãos, uso e ocupação do solo e valor das terras. O indicador analisa o crescimento ou a redução dos ativos ao longo de um período de tempo definido. Avalia também o nível de endividamento do imóvel rural comparando o valor total dos empréstimos (de curto e longo prazo) com o valor patrimonial estimado.\nAPLICAÇÃO\n1ª ETAPA - (item 3.1) - Defina o tempo de aferição da evolução patrimonial - referência 1 ano ou o período referente à última aplicação do ISA.                                                                                         2ª ETAPA - (item 3.2) – Informe o valor estimado das instalações, benfeitorias ou reformas recentemente concluídas (durante o período definido no Item 3.1), assim como o valor estimado das instalações e benfeitorias existentes antes desse período (informe o valor ou utilize o valor da última aplicação do ISA). Informe o valor estimado das máquinas e equipamentos adquiridos recentemente (durante o período definido no primeiro passo, Item 3.1) e o valor estimado das máquinas e equipamentos existentes antes do período (Item 3.2).\n3ª ETAPA  - (item 3.3) – Informe a quantidade de animais e o estoque agrícola, juntamente com a estimativa do valor de cada categoria (R$). Informe os dados do histórico do rebanho (1 ano antes ou referente a última aplicação). A avaliação das estruturas (equipamentos e benfeitorias) e do estoque no imóvel rural auxilia na atualização cadastral do produtor(a) rural nas instituições financeiras.                                                                                                                                                                                                                        4ª ETAPA  - (item 3.4) -  Levante a área de agricultura irrigada na fazenda. Verifique se houve alguma alteração na área irrigada na coluna “Uso histórico”.\n5ª ETAPA  - (item 3.5) -  Verifique se houve alguma mudança no histórico de uso e ocupação do solo em comparação com a ocupação atual descrita no levantamento.                                                                                                                                                                                                                                        6ª ETAPA - (item 3.6) - Informe os valores atuais e históricos do preço da terra.                                                                                                                                                               7ª ETAPA - (item 3.7) - Levantar todos os financiamentos de curto e longo prazos contraídos pelo produtor até o presente momento e lançar o valor no item 3.7 \n"]
[]
[]
[]
[]
[]
[]
[4,"SERVIÇOS E INFRAESTRUTURA PÚBLICOS"]
[null,"DESCRIÇÃO\nAvalia o acesso aos serviços básicos como água (quantidade e qualidade), eletricidade, estradas, transporte escolar, saúde, segurança, internet e coleta pública de lixo. Para pequenas propriedades, verifica também a disponibilidade da produção de alimentos no próprio imóvel rural  como medida para aferir segurança alimentar (hortaliças, frutas, tubérculos e fontes de proteína animal).\nAPLICAÇÃO - Basic services\n1ª ETAPA  - Verifique quantas residências com moradores regulares possui o estabelecimento.\n2ª ETAPA - Para cada residência, verifique a disponibilidade dos serviços listados no Indicador. Para o preenchimento deste indicador, deve-se colocar 1 (se atende satisfatoriamente), 0,5 (se atende parcialmente), ou 0 (não atende ou inexistente).                                 \nAPLICAÇÃO - Produção própia de alimentos (para os imóveis classificados como Agricultores Familiares)\n1ª ETAPA - Verifique quantas residências com moradores regulares possui o estabelecimento \n2ª ETAPA - Para cada residência ou conjunto de residências, verifique se há produção de hortaliças, tubérculos, frutas e criação de animais para o consumo dos residentes.\nOBS:  Os valores utilizados no preenchimento de cada item são: 1 (presente); 0,5 (parcial) ou 0 (inexistente). Entende-se por parcial a presença do item, mas em quantidade insuficiente para atender à demanda da família. Exemplo de uma referência para uma família com 5 pessoas (demanda média de 2.630 kcal/dia): Citros, 4 pés; Mamoeiros, 13 pés; Bananeiras, 18 pés; Vacas de leite, 2; Cevados (porcos)/ano, 4; Frangos/ano, 100; Galinhas, 50; Galos, 3; Mandioca, 200 kg; Hortaliças (folhosas, frutos e tubérculos)/ano, 600 kg (Fonte: Emater/MG).                                                                                         \n"]
{"$rows_empty":13}
[5,"ESCOLARIDADE E CURSOS DE CAPACITAÇÃO\t\t\t\t\t\t\t\t\t\t\t"]
[null,"DESCRIÇÃO\nVerifica o nível de escolaridade do agricultor, dos membros da família envolvidos nas atividades do imóvel rural e dos trabalhadores permanentes. Avalia a participação em cursos e oficinas de curta e média duração. Verifica se todas as crianças em idade escolar estão frequentando a escola.\nAPLICAÇÃO\n1ª ETAPA - Verifique o número de adultos com vínculo direto à produção e funcionários permanentes. Levantar o número de dependentes em idade escolar que residem no estabelecimento.\n2ª ETAPA - Para cada pesssoa identificada na primeira etapa verifique o grau de escolaridadee a participação dos mesmos em cursos de capacitação direcionado às atividades (no último ano). É feita também a verificação se todos os dependentes em idade escolar, residentes no imóvel rural, estão frequentando a escola.\n"]
{"$rows_empty":7}
[6,"QUALIDADE DO EMPREGO"]
[null,"DESCRIÇÃO\nVerifica o cumprimento da legislação trabalhista e a adesão às normas recomendadas de trabalho tanto para funcionários permanentes quanto temporários.\nAPLICAÇÃO\n1ª ETAPA - Verifique o número de funcionários permanentes (contratação efetiva) e temporários (item 7.1). \n2ª ETAPA - A partir do levantamento do número de funcionários permanentes e temporários, verifique quantos são atendidos pelo item 7.1 (referente às obrigações da legislação trabalhista) e item 7.2 (referente às recomendações e determinações do Ministério do Trabalho)."]
[]
[]
[]
[]
[]
[]
[7,"GESTÃO DO EMPREENDIMENTO\t\t\t\t\t\t\t\t\t\t\t"]
[null,"DESCRIÇÃO\nAvalia o uso de ferramentas de gestão do imóvel rural - fluxo de caixa; registros dos custos de produção; acesso à assistência técnica; participação em associações, sindicatos ou cooperativas; conformidade com regulamentações ambientais; e acesso a crédito financeiro.\nAPLICAÇÃO\n1ª ETAPA - Verifique se é feito um controle de receitas e despesas no empreendimento rural (fluxo de caixa).\n2ª ETAPA - Verifique se é feito um controle de custos de produção para as atividades desenvolvidas no imóvel rural.\n3ª ETAPA - Verifique se o produtor tem acesso à assistência técnica (assistência de revendas ou lojas de insumos agropecuários não são consideradas).\n4ª ETAPA - Verifique se o produtor participa ativamente ou de forma eventual em associações, cooperativas, sindicatos, ou outras formas de organização dos produtores rurais .\n5ª ETAPA - Verifique a situação da regularização ambiental do produtor com relação a água, licença ambiental e regularização da Reserva Legal (RL) e das Áreas de Preservação Permanente (APP) a partir do Cadastro Ambiental Rural (CAR).\n6ª ETAPA - Verifique se o produtor tem acesso às linhas de crédito (custeio, investimentos e/ou crédito para a comercialização da produção). Para o preenchimento deste indicador, deve-se colocar o valor 1 (se a atividade é realizada satisfatoriamente), 0,5 (se a atividade é realizada parcialmente) ou 0 (se inexistente)."]
{"$rows_empty":9}
[8,"COMERCIALIZAÇÃO E INOVAÇÃO\t\t\t\t\t\t\t\t\t\t\t"]
[null,"DESCRIÇÃO\nAvalia se o produtor(a) busca informações de mercado, acessa mercados institucionais ou com valor agregado, adota técnicas inovadoras e ambientalmente adequadas, e demonstra capacidade de inovação ou exerce papel de liderança na comunidade.\nAPLICAÇÃO\n1ª ETAPA -  Verifique quais estratégias são utilizadas para a comercialização da produção e como o produtor obtem informações sobre o mercado (consultas em sites,  Cooperativas, Associações, etc.). Verificarocorrência de produção certificada ou direcionada para mercados institucionais (orgânica e outras certificações, mercados institucionais como, por exemplo, o Programa de Aquisição de Alimentos - PAA e o Programa Nacional de Alimentação Escolar - PNAE).\n2ª ETAPA - Verifique, durante as visitas aos talhões, quais os principais entraves e quais medidas e tecnologias estão sendo adotadas pelo produtor para resolver ou minimizar os eventuais problemas (com o foco nos princípios e fundamentos da agricultura conservacionista / regenerativa). Caso afirmativo, fazer a descrição da técnica inovadora adotada. Verificar também a capacidade de inovação do produtor ou se o mesmo tem uma posição de liderança na comunidade (caso afirmativo fazer a descrição). Avaliar a adoção de práticas que promovam cobertura permanente e diversificada do solo (optativo).\n"]
{"$rows_empty":10}
[9,"GERENCIAMENTO DE RESÍDUOS E EFLUENTES\t\t\t\t\t\t\t\t\t"]
[null,"DESCRIÇÃO\nVerifica o índice de coleta e destinação adequada do lixo e esgoto, o índice de reaproveitamento dos resíduos orgânicos no imóvel rural, e o índice de tratamento e destinação adequada de efluentes líquidos e gasosos quando presentes no imóvel rural.\nAPLICAÇÃO\n1ª ETAPA - Verifique o destino do esgoto doméstico gerado em cada residência existente no imóvel rural (item 10.1).\n2ª ETAPA - Examine o destino do lixo doméstico e do lixo gerado nas unidades de produção (lixo reciclável – embalagens, plástico, papel, latas, e o lixo não reciclável) (item 10.2).\n3ª ETAPA -  Estime a proporção (%) do total de resíduos orgânicos que são compostados ou reaproveitados nas unidades de produção (palhadas, esterco, cama de frango, entre outros).\n4ª ETAPA - Verifique se ocorre geração de efluentes líquidos (curral, galpões para criação de animais, unidades de compostagem, café despolpado, chorumeira, etc.). Caso afirmativo, estime qual a proporção (%) dos efluentes gerados que recebem tratamento e destinação adequada.\n5ª ETAPA -  Verifique se ocorre a geração de efluentes gasosos (caldeiras, carvoaria, biodigestores, etc.). Cas afirmatico, estime qual a proporção (%) do total de efluentes gasosos gerados que possuem um tratamento adequado antes de serem lançados na atmosfera.\n6ª ETAPA - Identifique a ocorrecência de alguma situação crítica com relação ao gerenciamento de resíduos e efluentes:  fossa seca (negra) localizada próxima a um curso d'água ou poço artesiano; lançamento de efuentes (domésticos ou de criações) sem nehum tratamento em corpos d'água; esgoto a céu aberto, queima de resíduos plásticos, baterias, e outros materiais sintéticos no imóvel rural, entre outros."]
{"$rows_empty":12}
[10,"FERTILIDADE DO SOLO"]
[null,"DESCRIÇÃO\nAvalie a fertilidade e atividade biológica do solo. A avaliação da atividade biológica é opcional e considera as enzimas arilsulfatase e β-glicosidase (tecnologia BioAS da Embrapa).\nAPLICAÇÃO\n1ª ETAPA - Identifique a área mais representativa do imóvel rural ou a área direcionada para as intervenções propostas no plano de adequação. Verificar se o entrevistado possui análises recentes de fertilidade do solo (período até 2 anos), e se as mesmas possuem análise granulométrica do solo (textura). \n2ª ETAPA - A partir das informações levantadas verifique a necessidade de fazer outras coletas de amostras de solos para análise química em laboratório de solo. Se necessário, fazer a coleta de amostras de solo evitando talhões que foram recentemente adubados, locais próximos a brejos, casas, galpões, formigueiros ou voçorocas. As coletas devem ser realizadas na profundidade de 0-20 cm, com auxílio de um trado, caminhando em zigue-zague pela área. Após a coleta de amostras, o solo deve ser bem misturado, para obtenção de uma amostra composta do talhão. Desta, separa-se uma porção da amostra composta de, aproximadamente, 300 g, em saco plástico limpo e identificado (nome do talhão, data e o código do estabelecimento), para ser encaminhada ao laboratório de solos. Para as análises da biologia do solo, realizar o mesmo procedimento, porém, na profundidade de 0-10 cm.\n3ª ETAPA -  Ao lançar os dados da análise de solo, primeiro, faça a descrição do talhão e a data da análise no laboratório (campo descrição do talhão). As interpretações dos teores de matéria orgânica e fósforo consideram a textura do solo. Pode ser inserido (opcional) dados sobre aspectos relacionados à atividade biológica do solo envolvendo a BioAS (análise das enzimas arilsulfatase e betaglicosidase em amostras de solo coletadas conforme a descrição da 2ª etapa, na profundidade de 0-10cm). As interpretações dos dados são baseados no sistema da Embrapa (Mendes et al., 2021).\n"]
{"$rows_empty":12}
[11,"EROSÃO DO SOLO E O ESTADO DE CONSERVAÇÃO DAS ESTRADAS"]
[null,"DESCRIÇÃO\nVerifica a ocorrência ou não de áreas afetadas, estimando a extensão, intensidade (inicial, intermediária ou avançada) e tendência de comportamento do processo erosivo (redução, inalterado ou intensificação). Se não houver processos erosivos no imóvel rural, deixe o indicador sem preencher (a nota será = 0,7). Avalia também a presença de estruturas de drenagem e sistemas de escoamento de águas pluviais nas estradas, bem como o estado e a manutenção das estradas dentro do imóvel rural.\nAPLICAÇÃO\n1ª ETAPA - Identifique quaisquer áreas com degradação do solo.\n2ª ETAPA - Após a identificação, determine qual área apresenta a maior intensidade e/ou o estágio mais severo de degradação. As estimativas podem ser feitas no local ou com o auxílio de imagens de satélite. Apenas uma área será registrada na planilha, selecionando uma categoria (estágio Inicial, Intermediário ou Avançado).\n3ª ETAPA - Selecione qual tendência de comportamento do processo erosivo: redução, inalterado ou intensificação.                                                                                                   4ª ETAPA - Percorra as estradas de acesso que cruzam ou margeiam o imóvel rural, bem como as estradas internas, verificando seu estado de conservação e eventuais medidas de conservação adotadas.\n5ª ETAPA - Estime o grau de adoção de medidas de conservação implementadas (item 17.1) e a proporção de buracos e sulcos de erosão (item 17.2).                                             6ª ETAPA  - Verifique se há pontos críticos no local que possam interferir no acesso e/ou compromoter o escoamento de produtos (item 17.3)."]
{"$rows_empty":11}
[null,"Indicativos da Intensidade do estágio de degradação"]
[null,null,"Inicial","Intermediário",null,"Avançado"]
[null,"Erosão laminar","Redução de infiltração de água Raízes expostas","Remoção do horizonte superficial do solo"]
[null,"Erosão em sulcos",null,"Presença de sulcos rasos localizados",null,"Sulcos profundos e disseminados em toda a área"]
[null,"Voçoroca",{"$nulls":3},"Presença de voçorocas, movimento de  massa (deslocamento de grandes volumes de solo)"]
[]
[null,"DECLIVIDADE TRANSVERSAL DA ESTRADA - Inclinação da seção transversal, a partir do eixo da estrada, para permitir o escoamento das águas superficiais para as valas laterais.\nLOMBADAS PARA DESVIO DE ENXURRADA - Elevações construídas transversalmente ao longo de toda a largura do leito da estrada, com o objetivo de conduzir as águas pluviais aos dispositivos (caixas de infiltração ou barraginhas) para absorvê-las e ou armazená-las.\nCAIXAS DE CAPTAÇÃO DE ÁGUA OU BARRAGINHAS - Estruturas para a captação da águas de chuva - pequenas barragens ou miniaçudes. \nBACIAS DE INFILTRAÇÃO  - Depressão no terreno construída, geralmente às margens da estrada, com o objetivo de reduzir o volume das enxurradas e promover a recarga da água subterrânea. \n"]
[]
[]
[]
[]
[]
[12,"QUALIDADE DA ÁGUA"]
[null,"DESCRIÇÃO\nAvalia os ecossistemas aquáticos em dois trechos de um curso d’água utilizando um protocolo de avaliação rápida com nove parâmetros. Análises adicionais (opcional) podem incluir testes a campo (fitas) do pH, nitrato e coliformes e medição da turbidez.\nAPLICAÇÃO\n1ª ETAPA -  Identifique os corpos d'água que passam pelo imóvel rural. Escolher o curso d'água mais representativo ou mais importante para o imóvel rural (abastecimento ou irrigação).\n2ª ETAPA - Depois que o curso de água for definido, identifique os locais de amostragem a montante e a jusante: montante – o ponto onde o curso de água entra no imóvel rural ou próximo de uma nascente; jusante – o ponto de saída do curso d'água que passa dentro ou na divisa do imóvel rural, ou próximo ao local onde um curso d'água deságua em outro corpo d'água.\n3ª ETAPA -  Aplique o protocolo de avaliação rápida dos ecossistemas aquáticos.  Pode ser levado um notebook, tablet ou o cheklist impresso para realizar o seu preenchimento no próprio local de avaliação (item 3.1). \n4ª ETAPA (opcional) - Se for utilizar as fitas para leitura de pH e nitrato, os resultados devem ser anotados ou registrados in loco, no caso da cartela microbiológica para análise da presença de coliformes termotolerantes, fazer a leitura após incubação por 15 horas (para a sua coleta, não tocar na cartela, deixar o excesso de água escorrer e guardar a mesma envolta em um papel alumínio até o local de incubação. Após a incubação, proceder a contagem das colônias, considerando sempre os dois lados da cartela. Coliformes fecais são os pontos azuis. Multiplicar cada ponto por 60 para lançar na planilha). A avaliação da turbidez pode ser feita no local utilizando-se equipamentos portáteis para a sua avaliação (item 13.2). OBS: A análise da qualidade da água subterrânea no imóvel rural também é opcional, e pode ser feita com a coleta de água de um poço ou água utilizada para consumo no imóvel rural (item 13.3).\n"]
{"$rows_empty":17}
[13,"RISCO DE CONTAMINAÇÃO DA ÁGUA E MANEJO DOS PESTICIDAS "]
[null,"DESCRIÇÃO\nAvalia o potencial de contaminação da água por agroquímicos com base na vulnerabilidade da área de aplicação (determinada pela textura do solo, proximidade de cursos d’água e práticas de manejo do solo) e no potencial de contaminação dos princípios ativos (com base na persistência, mobilidade e toxicidade dos ingredientes ativos). Avalia também o cumprimento das exigências legais para o uso de agrotóxicos e medicamentos veterinários, incluindo medidas de proteção com o uso de equipamento de proteção individuais, armazenamento e devolução das embalagens.\nAPLICAÇÃO\n1ª ETAPA - Selecione o ingrediente ativo principal dos produtos (pesticidas) usados ​​para controle de pragas, doenças e plantas invasoras/espontâneas em sistemas agrícolas, pastagens e florestas comerciais (clique no cabeçalho e selecione o produto – item 14.1).\n2ª ETAPA - Para cada produto (pesticida), identifique, opcional, a procentagem do ingrediente ativo, identtifique a cultura, a área de aplicação (ha) e o volume aplicado (L ou kg/ha). Recomenda-se agrupar os pesticidas por cultura (por exemplo, café, milho, soja), mesmo que um produto seja usado em várias culturas, pois as taxas de aplicação podem variar.\n3ª ETAPA -  Os dados de toxicidade, mobilidade do produto no ambiente (coeficiente Koc, que representa a absorção do pesticida na matéria orgânica do solo) e persistência do produto (t1/2, meia-vida in situ em dias) são preenchidos automaticamente. Informações adicionais sobre ingredientes ativos não listados estão disponíveis no Banco de Dados (https://sitem.herts.ac.uk/aeru/ppdb/en/). Dados sobre riscos de contaminação para trabalhadores rurais, consumidores e o meio ambiente (índice EIQ da Universidade Cornell) também estão incluídos, juntamente com detalhes sobre a identificação de pesticidas que estão proibidos na União Europeia.                                                                                                                                                                                                                                                               4ª ETAPA -  Para cada pesticida, identifique as características da área de aplicação, considerando: teor de argila (1, 2 ou 3, com base no item 14.5); distância até o curso d’água mais próximo (1, 2 ou 3, com base no item 14.6); tipo de manejo do solo (1, 2 ou 3, com base no item 14.7). Esta etapa visa determinar a vulnerabilidade dessas áreas quanto à contaminação das águas.\n5ª ETAPA - O risco de contaminação é calculado automaticamente para cada produto. Para gerar uma pontuação de risco final, insira no item 14.3 as culturas identificadas, suas respectivas áreas e, para cada cultura, o maior risco de contaminação verificado (1, 2 ou 3, onde 3 é o maior). Por exemplo, se cinco pesticidas foram aplicados em uma cultura de milho, com os seguintes riscos de contaminação: Dois produtos classificados como 1; Dois produtos classificados como 2; Um produto classificado como 3. O valor registrado no indicador será 3, pois representa o maior risco de contaminação. O resultado final considera o risco máximo e a área equivalente de cada cultura na fazenda.                               6ª ETAPA: Verifique se agrotóxicos são utilizados em alguma parte do imóvel rural, o número de pessoas que os manuseiam e quantas usam equipamentos de proteção individual.\n7ª ETAPA - Verifique se o imóvel rural possui um local adequado para o armazenamento das embalagens de agrotóxicos (local exclusivo com acesso restrito e ventilado) e se o produtor faz a devolução dessas embalagens no local indicado pela revenda, conforme a Lei 12.305/10 que institui a Política Nacional de Resíduos Sólidos e trata da logística reversa dos resíduos (excolher a opção \"sim\" quando for adequado e suficiente).\n"]
{"$rows_empty":18}
[14,"CONSERVAÇÃO DO SOLO E ÁGUA"]
[null,"DESCRIÇÃO\nAvalia a adoção de medidas de conservação do solo e da água (suficientes, insuficientes ou inadequadas) em todos os sistemas de produção, incluindo a implantação de terraceamentos, quando necessário, cobertura permanente e diversificada do solo, entre outras estratégias para tornar os sistemas mais resilientes  ao estresse hídrico e chuvas de alta intensidade, ampliar a capacidade do solo de infiltrar e reter as águas pluviais, além de outras estratégias para reservação de água no imóvel rural.\nAPLICAÇÃO\n1ª ETAPA - Avalie a adoção de medidas de conservação do solo em todos os sistemas de produção identificados no questionário (item 8). Veja exemplos abaixo.\n2ª ETAPA - Após avaliar o grau de adoção de práticas de conservação — considerando a topografia, a cobertura vegetal e, para culturas permanentes e florestas plantadas, seu estágio de desenvolvimento — registre as respectivas áreas de cada talhão e pasto de acordo com as seguintes categorias: Adequado — As medidas de conservação são adequadas para conter eventuais processos erosivos, não há simais de erosão na área; Médio - existem medidas para conservação do solo mas são inadequadas para prevenir completamente a erosão, incluindo a erosão laminar de baixa intensidade; Baixo — Existem algumas medidas pontuais, mas estão distantes do mínimo necessário para previnir os processo erosivos;  Situação crítica — Grave ausência de práticas de conservação do solo e/ou presença de processos erosivos de alta intensidade.                                                                                                                                                                                                                                           3ª ETAPA - Verifique com o produtor o grau de adoção de estratégias para a conservação e reservação das águas, considerando todo o imóvel rural, marcando uma das opções: suficiente; insuficiente; ou situação inadequada ou de alta fragilidade (item 16.2).\n"]
{"$rows_empty":13}
[null,"GRAU DE ADOÇÃO DE PRÁTICAS CONSERVACIONISTAS - SOLO (REFERÊNCIA)\nALTO - Terraços, rotação de culturas, sistemas de plantio direto e cobertura de solo permanente e diversificada, sem sinais de erosão.                                                   MODERADO - Adoção parcial de práticas de conservação do solo, solos sem boa estrutura.\nINCIPIENTE - Solo desprotegido, plantio sem respeitar as curvas de nível, ou revolvimento do solo (aração, gradagem, etc.).\nSITUAÇÃO CRÍTICA - Ausência de práticas de conservação do solo, processos severos de erosão, solos muito compactados, uso intensivo de grade e arado, presença de fogo, monocultivos sem rotação de culturas, solo exposto, etc."]
[]
[]
[]
[]
[]
[null,"GRAU DE ADOÇÃO DE PRÁTICAS CONSERVACIONISTAS - ÁGUA (REFERÊNCIA)\nSUFICIENTE - Práticas adotadas são suficientes para garantir o abastecimento de água (para consumo humano e/ou atividades agrícolas); implementação de estruturas para minimizar o poder erosivo do escoamento superficial (principalmente enxurradas) em talhões e estradas; adoção de estratégias para manter ou aumentar a matéria orgânica do solo e atividade biológica visando maior estabilidade de agregados e melhora na infiltração e retenção de água no solo.\nINSUFICIENTE - Práticas adotadas não são suficientes para previnir processos erosivos, e, consequentemente, a perda de água nos sistemas. Práticas adotadas não garantem o abastecimento de água para consumo, e atividades agrícolas.\nSITUAÇÃO CRÍTICA  - Escassez de água para consumo humano; para consumo animal; ausência de práticas para lidar com a seca; processos erosivos de alta intensidade."]
[]
[]
[]
[]
[]
[]
[null,"PLANTIO EM CURVA DE NÍVEL - Preparo do solo é realizado seguindo a direção da curva de nível do terreno. Para terrenos com pequena declividade, o plantio em nível cria obstáculos à descida do escoamento superficial das águas pluviais, propiciando a redução dos processos erosivos e aumento da infiltração de água no solo.                                                                                                                                                                                                                                       SISTEMA PLANTIO DIRETO - É um sistema de semeadura, no qual a semente é colocada diretamente no solo não revolvido, usando-se máquinas específicas. Somente é aberto um pequeno sulco ou cova de largura e profundidade suficientes para a adequada cobertura e contato das sementes com o solo. O sistema plantio direto segue três princípios: não revolvimento do solo, cobertura permanente do solo e rotação de culturas, além da diversificação de culturas e minimização dos distúrbios à atividade microbiológica do solo. \nCOBERTURA PERMANENTE DO SOLO  - A permanência de palhadas de colheitas anteriores ou o uso de plantas de cobertura evitam que o solo fique exposto à insolação, reduz a evaporação, fornece também proteção contra o impacto das gotas de chuva, reduzindo o escoamento superficial e a erosão. A cobertura permanente do solo apresenta como benefícios: a redução da incidência de plantas invasoras; promoção do equilíbrio da flora e da fauna do solo; favorecimento do manejo integrado de pragas e doenças; maior estabilização da taxa de reciclagem de nutrientes; e promoção da atividade biológica no solo.             ROTAÇÃO DE CULTURAS  - Consiste em alternar, anualmente, espécies vegetais, numa mesma área agrícola. As espécies escolhidas podem ter, ao mesmo tempo, propósito comercial e de recuperação do solo. A diversidade de plantas influencia na diversidade da microbiota do solo, proporcionando maior resiliência dos sistemas de produção.\nQUEBRA-VENTOS / BARREIRAS VEGETAIS  - Plantio de árvores em intervalos regulares no entorno de lavouras e pastagens em direção perpendicular aos ventos dominantes, ou formação de barreiras vegetais. Seus benefícios principais são as alterações no microclima, o que pode levar a incrementos na produção, reduzindo a necessidade por insumos externos. O sombreamento auxilia no aumento da umidade do solo, enquanto a redução dos ventos diminui a erosão eólica. A presença de árvores também funciona como um fator atrativo para diversas espécies. \nFAIXAS COM VEGETAÇÃO NATURAL, ROÇADAS ALTERNADAS  -  Aplicável em novas áreas, onde o desmatamento parcial permite a permanência de fileiras alternadas de vegetação nativa permanente entre as culturas cultivadas. Essa vegetação nativa serve como quebra-ventos e oferece refúgio para predadores naturais de pragas.\nCULTURAS INTERCALARES - Podem ser utilizadas culturas comerciais ou não. O plantio de culturas de porte, ciclo e comportamento agronômico diferentes podem trazer benefícios com o aumento da biodiversidade e melhor aproveitamento dos nutrientes do solo, explorando diferentes camadas do solo.\nTERRACEAMENTO -   Os terraços podem ser locados em nível, em desnível ou de forma mista. Os terraços em nível possuem as extremidades bloqueadas e têm a função de acumular e infiltrar a água, e são recomendados para áreas com boa permeabilidade e declividade de até 12%. Os terraços em desnível apresentam pequeno gradiente ao longo de seu comprimento e conduzem a água para as laterais, sendo mais adequados, para áreas com menor permeabilidade e/ou declividades superiores a 12%. Os terraços mistos englobam os dois tipos anteriores, ou seja, são projetados em pequeno desnível e com capacidade de acumulação de água que, ao ser excedida, escoa pelas laterais. Em encostas ou morros onde o volume e a velocidade da enxurrada são grandes, dependendo do comprimento de rampa e da declividade, o terraço em desnível é mais recomendado para se evitar que estes se rompam, podendo ser construídos com menor largura. A seleção do tipo de terraço a ser construído, assim como seu dimensionamento, sua locação e sua construção devem ser feitas por profissionais qualificados. Os terraços classificam-se ainda quanto a sua largura, em base estreita (menos de 3 m), base média (3 a 6 m) e base larga (6 a 12 m). \n\n\n"]
{"$rows_empty":16}
[15,"CONSERVAÇÃO DA BIODIVERSIDADE"]
[null,"DESCRIÇÃO\nAvalia o grau de adoção de práticas que promovem a biodiversidade nas áreas cultivadas, bem como avalia a diversidade na escala do imóvel rural, a qual é medida automaticamente utilizando o índice de Shannon-Weaver.\nAPLICAÇÃO\n1ª ETAPA - Avalie o grau de adoção de práticas que promovem a agrobiodiversidade nas áreas de produção agrícola. Essas práticas incluem cultivos consorciados, policultivos, integração lavoura-pecuária, sistemas agroflorestais, adubação verde, barreiras vegetais, corredores ecológicos, rotação de culturas, ativação da biologia do solo e redução de perturbações à atividade biológica (por exemplo, uso indiscriminado de pesticidas, fertilizantes de alta solubilidade, mecanização intensa e pressão de monoculturas). O item 21.1 pode ser preenchido de forma semelhante ao item 16.1 do Indicador 16 (grau de adoção de práticas conservacionistas).\n2ª ETAPA - O grau de diversidade na escala do imóvel rural é medido automaticamente pela avaliação da diversidade de fitofisionomias dos habitats naturais (vegetação nativa) e dos diversos usos e ocupação do solo, utilizando o índice de Shannon-Weaver.\n3ª ETAPA - O grau de diversificação do uso e ocupação do imóvel e das áreas no seu entorno é avaliado, ao considerar a proporção de cultivos e usos similares ao longo das áreas fronteiriças, com o objetivo de verificar se ocorre pressão de monocultivos. Se for identificado uma alta proporção das áreas limítrofes ao imóvel rural com o mesmo uso do solo (acima de 70%), marque \"sim\" no item 21.3.\n"]
{"$rows_empty":12}
[null,"GRAU DE ADOÇÃO DE PRÁTICAS CONSERVACIONISTAS - BIODIVERSIDADE (REFERÊNCIA)\nALTO -  Consorciações, rotações e policultivos, diversificação com o uso de espécies cultivadas e não cultivadas, uso de mixes de plantas de cobertura, cobertura permanente e diversificada do solo, diminuição ou eliminação do uso de pesticidas e adubos solúveis, uso de insumos biológicos, implantação de barreidas verdes ou faixas com espécies arbóreas visando ampliar os serviços ecossistêmicos como o refúgio para polinizadores e inimigos naturais de pragas.                                                                                                                MODERADO - Adoção parcial de práticas de conservação da biodiversidade.\nINCIPIENTE - Baixa adoção de práticas de indução à agrobiodiversidade - rotação de culturas limitada a duas espécies, uso de plantas de cobertura com apenas uma espécie, cobertura parcial do solo durante o ano, uso incipiente de insumos biologicos.\nSITUAÇÃO CRÍTICA - Solo descoberto, uso do fogo, monocultivos sem o uso de rotação de culturas, consorciação ou diversificação, etc."]
[]
[]
[]
[]
[]
[16,"ESTADO DE CONSERVAÇÃO DOS HABITATS NATURAIS"]
[null,"DESCRIÇÃO\nIdentifica as fitofisionomias (habitats naturais) presentes no imóvel rural e avalia seu estado de conservação (estágio sucessional). Verifica o número de fragmentos de vegetação nativa existentes no imóvel rural e se esses fragmentos estão protegidos contra pastoreio e fogo.\nAPLICAÇÃO\n1ª ETAPA - Identifique os diferentes tipos de vegetação nativa (selecione a fitofisionomia no cabeçalho da tabela - item 18.1).\n2ª ETAPA - Estime a área correspondente a cada fragmento de vegetação nativa e identifique seu estágio sucessional.\n3ª ETAPA  - Verifique a quantidade de fragmentos com vegetação nativa dentro do imóvel rural por meio de observações de campo e imagens de satélite (item 18.2).\n4ª ETAPA - Verifique se algum fragmento de vegetação nativa tem conexão com a vegetação nativa de imoveis rurais vizinhos (marque com um \"X\" se houver) (item 18.3).                                                                                                                                                                                                                                                                     5ª ETAPA - Verifique se todos os fragmentos de vegetação nativa estão protegidos do pastoreio (com cercas suficientes) e incêndios (presença de aceiros com manutenção anual). Caso afirmativo, marque com um \"X\" (item 18.4).\n "]
{"$rows_empty":12}
[17,"ADEQUAÇÃO DAS ÁREAS DE PRESERVAÇÃO PERMANENTE (APPs) E RESERVA LEGAL (RL) \t\t\t\t\t\t\t\t\t\t"]
[null,"DESCRIÇÃO\nAvalia o estado de conservação das APPs. Essas áreas funcionam como zonas de amortecimento para prevenir a erosão do solo, filtrar o escoamento superficial e fornecer habitat para espécies aquáticas e terrestres. Avalia também o cumprimento da exigência de Reserva Legal (RL) no imóvel rural, conforme o Novo Código Florestal. Verificar também se o imóvel rural possui área com vegetação nativa excedente à exigência para RL (considerado como um ativo ambiental). \nAPLICAÇÃO\n1ª ETAPA - O lançamento dos dados é feito automaticamente no item 19.1, a partir da identificação do uso e ocupação do solo nas APPs (item 9 do questionário).  \n2ª ETAPA - Verifique no campo e na imagem de satélite o percentual das APPs efetivamente protegidas e com bom estado de conservação (item19.2).                  Considera-se APP: faixas marginais de qualquer curso d'água natural perene e intermitente; as áreas no entorno das nascentes e dos olhos d’água perenes; as áreas no entorno dos reservatórios d’água artificiais, decorrentes de barramento ou represamento de cursos d’água naturais; as encostas ou partes destas com declividade superior a 45º , equivalente a 100% (cem por cento) na linha de maior declive; as bordas dos tabuleiros ou chapadas, até a linha de ruptura do relevo; em veredas, a faixa marginal, em projeção horizontal, com largura mínima de 50 (cinquenta) metros, a partir do espaço permanentemente brejoso e encharcado;\tno topo de morros, montes, montanhas e serras, com altura mínima de 100 (cem) metros e inclinação média maior que 25º; as áreas em altitude superior a 1.800 (mil e oitocentos) metros, qualquer que seja a vegetação; as restingas, como fixadoras de dunas ou estabilizadoras de mangues; os manguezais, em toda a sua extensão (Código Florestal LEI 12.651 de 25 de maio de 2012).\t                                                                                          3ª ETAPA - A Verificação do cumprimento da RL é feita automaticamente para imóveis com área menor que 4 Módulos Fiscais - no campo \"Áreas de/para RL não passíveis de recomposição\". Para os demais imóveis rurais (>4MF), o preenchimento não será feito de forma automátca, utilizando-se os campos do item 20.1: \"Área de RL fora do imóvel rural\" (Se a RL, ou parte da RL, estiver localizada fora do imóvel rural); \"Áreas de/para RL que necessitam de recomposição \" (se a RL estiver localizada dentro do imóvel rural, verificar se a mesma possui alguma área que necessita de recomposição); \"Áreas de/para RL não passíveis de recomposição\".\t\t\t\t\t"]
{"$rows_empty":27}
[null,"\n\n"]

{"sheet":"1 Questionário","index":1,"n_rows":207,"n_cols":10,"rows_kept":207,"merged":[[0,1,1,2],[31,1,31,3],[71,1,71,2],[73,1,73,2],[75,1,75,2],[75,4,75,5],[77,1,77,8],[82,1,82,6],[84,1,84,2],[84,4,84,6],[85,1,85,2],[86,1,86,2],[87,1,87,2],[88,1,88,2],[89,1,89,2],[90,1,90,2],[91,1,91,2],[92,1,92,2],[93,1,93,2],[94,1,94,6],[95,1,95,8],[97,1,97,2],[97,4,97,6],[98,1,98,2],[99,1,99,2],[100,1,100,2],[101,1,101,2],[101,5,101,6],[103,1,103,8],[104,5,104,6],[105,1,105,3],[107,1,107,6],[109,1,109,3],[110,1,110,3],[111,1,111,3],[112,1,112,3],[116,1,116,3],[116,5,116,6],[117,1,117,3],[117,5,117,6],[118,1,118,5],[120,1,120,3],[120,5,120,6],[121,1,121,5],[124,1,124,6],[126,5,126,6],[128,5,128,6],[130,5,130,6],[133,1,133,8],[180,1,180,6],[185,1,185,5],[186,1,186,5],[188,1,189,5],[188,6,189,6],[191,1,191,6],[203,1,203,7],[206,1,206,7]]}
[null,"ISA",null,"QUESTIONÁRIO"]
[]
[1,"CROQUI DO IMÓVEL RURAL (CAR)"]
{"$rows_empty":28}
[null,"Preencher todos os campos em amarelo\t"]
[]
[2,"DATA "]
[]
[3,"ENTREVISTADOR(A)"]
[]
[null,"Nome"]
[]
[null,"CPF"]
[]
[4,"PRODUTOR(A) RURAL"]
[]
[null,"Nome"]
[]
[null,"CPF"]
[]
[null,"Idade (anos)"]
[]
[5,"LOCALIZAÇÃO DO IMÓVEL RURAL"]
[]
[null,"Geolocalização* "]
[null,"*coordenadas graus decimais"]
[null,"Município"]
[]
[null,"Estado"]
[]
[null,"Bacia Hidrográfica*"]
[null,"*Identificação do principal rio próximo ao imóvel rural"]
[6,"POSSE DA TERRA"]
[]
[null,"Posse da terra",null,null,"Escolha uma opção ao clicar no campo ao lado\t\t\t",{"$nulls":3},"Proprietário"]
[{"$nulls":8},"Posseiro"]
[null,"Sucessão* ",null,null,"Escolha uma opção  \t",{"$nulls":3},"Arrendatário"]
[null,"*Envolvimento dos filhos nos negócios; participação dos filhos em cursos de capacitação.",{"$nulls":6},"Parceiro"]
[null,"Participação da mulher (gestão)",null,null,"Escolha uma opção  \t",{"$nulls":3},"Assentado"]
[{"$nulls":8},"Usufrutuário"]
[7,"DESCRIÇÃO DO IMÓVEL RURAL"]
[{"$nulls":8},"Sim"]
[null,"Identificação",{"$nulls":6},"Não"]
[{"$nulls":5},"Módulos Fiscais"]
[null,"Área - hectares (ha)",{"$nulls":3},{"$f":"IF(D74>0,D72/D74,\"\")","v":""}]
[]
[null,"Tamanho do módulo fiscal (ha)*\t\t\t"]
[null,"*Tamanho do módulo fiscal no município"]
[null,"Agricultura Familiar",null,null,"Escolha uma opção  \t"]
[]
[null,"Outras áreas não contíguas ao imóvel rural e/ou áreas de arrendamento que integram a renda do produtor(a)"]
[null,"Identificação"]
[]
[null,"Área (ha)"]
[]
[8,"USO E OCUPAÇÃO DO SOLO NO IMÓVEL RURAL \t\t\t\t\t"]
[]
[null,"Descrição",null,"Uso atual Área (ha) ","Proporção em relação a área total%\t",{"$nulls":4},"                 "]
[null,"Lavouras permanentes\t",null,null,{"$f":"D86/'3 Relatório'!$H$5","v":{"$error":"#DIV/0!"}}]
[null,"Lavouras temporárias\t",null,null,{"$f":"D87/'3 Relatório'!$H$5","v":{"$error":"#DIV/0!"}}]
[null,"Pastagens\t",null,null,{"$f":"D88/'3 Relatório'!$H$5","v":{"$error":"#DIV/0!"}}]
[null,"Silvicultura\t",null,null,{"$f":"D89/'3 Relatório'!$H$5","v":{"$error":"#DIV/0!"}}]
[null,"Área não agrícola\t",null,null,{"$f":"D90/'3 Relatório'!$H$5","v":{"$error":"#DIV/0!"}},{"$nulls":3},{"$f":"SUM(D86:D90,D94)","v":{"v":0,"d":"0.0"}}]
[null,"Pousio\t",null,null,{"$f":"D91/'3 Relatório'!$H$5","v":{"$error":"#DIV/0!"}}," Verificação ",null,null,{"$f":"D91","v":{"v":0,"d":"0.0"}}]
[null,"Corpos d'água\t",null,null,{"$f":"D92/'3 Relatório'!$H$5","v":{"$error":"#DIV/0!"}},{"$nulls":3},{"$f":"D92","v":{"v":0,"d":"0.0"}}]
[null,"Vegetação nativa\t\t",null,null,{"$f":"D93/'3 Relatório'!$H$5","v":{"$error":"#DIV/0!"}},{"$nulls":3},{"$f":"D93","v":{"v":0,"d":"0.0"}}]
[null,"Áreas inaproveitáveis*\t",null,null,{"$f":"D94/'3 Relatório'!$H$5","v":{"$error":"#DIV/0!"}},{"$f":"IF(H94>0,(H94/D72),\"\")","v":""},"Total (ha)",{"$f":"SUM(D86:D94)","v":{"v":0,"d":"0.0"}},{"$f":"SUM(I90:I93)","v":{"v":0,"d":"0.0"}}]
[null,"*Vossorocas e outras áreas que no momento da avaliação são inaproveitáveis para atividades econômicas\t\t\t\t\t",{"$nulls":6},{"$f":"SUM(I90:I93)","v":{"v":0,"d":"0.0"}}]
[9,"ÁREAS DE PRESERVAÇÃO PERMANENTE (APPs)"]
[]
[{"$nulls":3},"Área (ha) ","Proporção em relação a área total (%)\t\t"]
[null,"Área total de APPs\t",null,null,{"$f":"IF(D99>0,D99/I94,0)","v":{"v":0,"d":"0.0%"}},null,null,{"v":0.2,"d":"20%"},{"$f":"D99-D100","v":{"v":0,"d":"0.00"}}]
[null,"Área da APP a ser recuperada\t\t",null,null,{"$f":"IF(D100>0,D100/I94,0)","v":{"v":0,"d":"0.0%"}},null,null,{"v":0.35,"d":"35%"}]
[null,"*Área a ser recuperada para imóveis até 4MF\t\t\t",null,{"$f":"IF(AND(E100>0.1,F72<2),D72*0.1,IF(AND(E100>0.2,F72<4),D72*0.2,D100))","v":{"v":0,"d":"0.0"}},{"$nulls":3},{"v":0.8,"d":"80%"}]
[]
[10,"RESERVA LEGAL (RL)"]
[]
[null,"Área exigida para Reserva Legal  (% do imóvel rural)",{"$nulls":3},"Escolha uma opção  \t"]
[null,"Área com vegetação nativa excedente à area exigida para RL",null,null,{"$f":"IF(D93>'2 Indicadores'!D450,'1 Questionário'!D93-'2 Indicadores'!D450,0)","v":{"v":0,"d":"0.00"}}]
[]
[11,"RECURSOS HÍDRICOS NO IMÓVEL RURAL\t\t\t\t\t"]
[{"$nulls":4},"Quantidade"]
[null,"Cursos d´água \t\t"]
[null,"Nascentes e olhos d'água perenes*\t\t"]
[null,"Lagos e lagoas naturais\t\t\t"]
[null,"Represas\t\t"]
[null," * Afloramento natural do lençol freático que apresenta perenidade e dá início a um curso d'água "]
[]
[null,"Fonte de água utilizada no imóvel rural:"]
[null,"Superficial\t\t",{"$nulls":3},"Escolha uma opção  \t"]
[null,"Subterrânea*\t\t\t\t",{"$nulls":3},"Escolha uma opção  \t"]
[null,"* Cisternas, poço tubular (artesiano)\t\t\t\t"]
[]
[null,"Problemas com qualidade/disponibilidade de água* ",{"$nulls":3},"Escolha uma opção  \t"]
[null,"*Para consumo humano e atividades rurais"]
[null,"Especificar (descrição do problema)"]
[]
[12,"REGULARIZAÇÃO AMBIENTAL DO IMÓVEL RURAL\t\t\t\t\t"]
[]
[null,"Regularização do uso da água",{"$nulls":3},"Escolha uma opção  \t"]
[null,"Outorga; ou cadastro de uso insignificante; ou cadastro na campanha \"água: faça uso legal\"; ou cadastro de pequeno núcleo populacional rural."]
[null,"Licenciamento ambiental",{"$nulls":3},"Escolha uma opção  \t"]
[null,"Certidão de não passível (dispensa de licenciamento), Autorização Ambiental de Funcionamento (AAF), Licenciamento Ambiental."]
[null,"Regularização RL e APP",{"$nulls":3},"Escolha uma opção  \t"]
[null,"Cadastro Ambiental Rural - CAR."]
[]
[13,"PONTOS CRÍTICOS - principais problemas enfrentados pelo produtor rural (na visão dele)\t\t\t\t\t\t\t"]
[]
[null,"Descrição"]
[]
[null,"Descrição"]
[]
[null,"Descrição"]
[]
[]
[18]
{"$rows_empty":37}
[19,"ATIVIDADE PECUÁRIA (opcional)"]
[]
[null,"19.1 - Utiliza pastagens plantadas para a atividade pecuária",{"$nulls":5},"caso afirmativo marque x"]
[null,"Estimativa da área, considerando áreas próprias e arrendadas (ha)"]
[]
[null,"Total de UA (Unidade Animal) do empreendimento - item 12.3 =>",{"$nulls":4},{"$f":"('2 Indicadores'!C71*1.5)+'2 Indicadores'!#REF!+'2 Indicadores'!#REF!+('2 Indicadores'!#REF!*0.75)+('2 Indicadores'!#REF!*0.75)+('2 Indicadores'!#REF!*0.5)+('2 Indicadores'!#REF!*0.5)","v":{"$error":"#REF!"}}]
[null,"Estimativa da taxa média de lotação das áreas com pastagem",{"$nulls":4},{"$f":"IF(G183=\"x\",(G186/G184),\"\")","v":""}]
[]
[null,"Proporção das pastagens no imóvel rural que apresentam processo de  degradação dos solos e baixa capacidade de suporte de animais (%)"]
[]
[]
[20,"ADUBAÇÃO NITROGENADA NA LAVOURA DE MILHO (opcional)"]
[]
[null,"20.1 - Possui lavoura de milho para produção de grãos"]
[null,"Estimativa da área (ha)"]
[]
[null,"20.2 - Possui lavoura de milho para produção de silagem"]
[null,"Estimativa da área (ha)"]
[]
[null,"20.3 - Estimativa da adubação nitrogenada para a lavoura de milho (kg de N/ha)*"]
[null,"*Considerar apenas os adubos nitrogenados solúveis (NPK, ureia, sulfato de amônia, etc.)"]
[]
[null,"20.4 - Produtividade da lavoura de milho para grãos (sc/ha)*"]
[null,"Estimativa da relação: sc milho produzido (60 Kg)/kg de N via adubação/ha ",{"$nulls":6},{"$f":"IF(I194=\"x\",(I203/I200),\"\")","v":""}]
[]
[null,"20.5 - Produtividade da lavoura de milho para silagem (t/ha)*"]
[null,"Estimativa da relação: tonelada (t) de milho produzido (silagem)/kg de N via adubação/ha ",{"$nulls":6},{"$f":"IF(I197=\"x\",(I206/I200),\"\")","v":""}]

{"sheet":"2 Indicadores","index":2,"n_rows":460,"n_cols":9,"rows_kept":460,"merged":[[0,1,1,1],[0,2,1,2],[2,1,2,2],[6,1,6,3],[11,1,11,3],[13,1,13,2],[13,6,13,7],[14,1,14,2],[14,6,14,7],[15,1,15,2],[16,1,16,2],[16,6,17,6],[16,7,17,7],[17,1,17,2],[18,1,18,2],[19,1,19,2],[37,1,37,4],[38,1,38,4],[39,1,39,4],[40,1,40,4],[41,1,41,4],[42,1,42,4],[42,6,43,6],[51,1,51,2],[51,6,51,7],[52,6,52,7],[55,1,55,2],[56,6,56,7],[59,1,59,2],[59,6,59,7],[60,6,60,7],[63,1,63,2],[64,6,64,7],[68,1,68,3],[68,4,68,5],[74,3,75,3],[93,1,94,1],[95,5,95,7],[97,1,98,4],[97,5,98,5],[97,6,98,6],[99,2,99,4],[100,1,103,1],[100,2,100,4],[101,2,101,4],[102,2,102,4],[103,2,103,4],[104,1,104,4],[105,1,105,4],[108,1,108,3],[108,6,108,7],[109,1,109,3],[109,6,109,7],[110,1,110,2],[110,6,110,7],[121,3,121,6],[122,1,122,2],[123,1,123,2],[124,1,124,2],[125,1,125,2],[126,1,126,2],[127,1,127,2],[128,1,128,2],[129,1,129,2],[130,1,130,2],[131,1,131,2],[131,3,131,7],[133,1,133,2],[134,1,135,2],[134,3,134,6],[136,1,136,2],[137,1,137,2],[138,1,138,2],[140,1,140,2],[145,1,145,2],[146,1,146,2],[147,1,147,2],[148,1,148,2],[149,1,149,2],[150,1,150,2],[153,1,153,2],[154,1,154,2],[155,1,155,2],[158,1,159,2],[158,3,159,3],[158,4,159,4],[158,5,159,5],[160,1,160,2],[161,1,161,2],[162,1,162,3],[167,1,168,2],[167,3,168,3],[167,4,168,4],[167,5,168,5],[169,1,169,2],[170,1,170,2],[171,1,171,2],[174,1,175,2],[174,3,175,3],[174,4,175,4],[174,5,175,5],[176,1,176,2],[177,1,177,2],[178,1,178,2],[179,1,179,2],[180,1,180,2],[181,1,181,2],[182,1,182,2],[183,1,183,2],[184,1,184,3],[189,2,189,4],[190,1,191,1],[190,2,190,3],[191,2,191,3],[192,1,192,3],[193,1,193,3],[194,1,194,3],[195,1,197,1],[195,2,195,3],[196,2,196,3],[197,2,197,3],[204,1,204,3],[205,1,205,3],[207,1,207,3],[208,1,208,3],[209,1,209,3],[210,1,210,3],[211,1,211,3],[212,1,212,7],[213,1,213,2],[213,4,213,7],[214,1,214,2],[215,1,215,2],[216,1,216,7],[220,3,220,4],[220,7,221,7],[222,1,222,2],[223,1,223,2],[226,1,226,3],[228,1,228,3],[229,1,229,3],[230,1,230,3],[233,1,233,3],[234,2,234,3],[253,1,253,3],[269,1,269,2],[270,1,270,5],[272,1,272,2],[273,1,273,5],[276,3,276,4],[277,1,279,1],[277,2,277,3],[278,2,278,3],[279,2,279,3],[280,3,280,4],[281,1,282,1],[281,2,281,3],[281,6,281,7],[282,2,282,3],[284,1,284,3],[285,2,285,3],[291,6,292,7],[294,1,295,1],[296,1,297,1],[298,1,299,1],[300,1,301,1],[302,1,303,1],[304,1,305,1],[306,1,307,1],[309,1,309,5],[312,1,313,1],[314,1,315,1],[316,1,317,1],[318,1,319,1],[321,1,322,1],[324,1,325,1],[327,1,327,5],[328,1,328,2],[330,1,330,2],[331,1,331,2],[332,1,332,2],[333,1,333,2],[339,1,339,2],[340,1,340,2],[341,1,341,2],[342,1,342,2],[343,1,343,2],[344,1,344,2],[345,1,345,2],[346,1,346,2],[347,1,347,2],[348,1,348,2],[349,1,349,2],[350,1,350,2],[351,1,351,2],[352,1,352,2],[353,1,353,2],[354,1,354,2],[355,1,355,2],[356,1,356,2],[359,3,359,4],[360,1,360,2],[361,1,361,2],[362,1,362,2],[363,1,363,2],[364,1,364,2],[367,1,367,2],[368,1,368,2],[369,1,369,2],[372,1,372,3],[373,1,373,3],[374,1,374,3],[376,1,376,3],[377,1,377,3],[385,2,386,2],[385,7,386,7],[387,1,390,1],[391,1,391,2],[392,5,392,6],[394,1,394,2],[401,2,402,2],[401,7,402,7],[403,1,406,1],[407,1,407,2],[408,1,408,4],[408,5,408,6],[409,1,409,4],[412,1,412,3],[415,1,415,4],[420,7,421,7],[422,1,424,1],[426,7,427,7],[428,1,428,4],[431,1,431,4],[433,1,433,4],[437,7,439,7],[440,1,441,1],[440,2,440,5],[441,2,441,5],[444,1,444,5],[449,1,449,2],[450,1,450,2],[452,1,455,1],[452,2,452,4],[453,2,453,4],[454,2,454,4],[455,2,455,4],[456,1,456,3],[461,27,461,28]]}
[null,"ISA","INDICADORES"]
[]
[null,"Preencher todos os campos em amarelo\t"]
[]
[1,"PRODUTIVIDADE E PREÇOS DE VENDA"]
[]
[null,"1.1 Renda bruta anual estimada agropecuária (ordem decrescente)\t\t"]
[null,null,"Escolha uma opção","Valor estimado anual (R$)"]
[null,"Atividade 1 (maior receita)",null,null,{"$f":"(D9/($D$9+$D$10+$D$11+D28+$D$29+$D$30+'2 Indicadores'!$D$34+'2 Indicadores'!D35))","v":{"$error":"#DIV/0!"}}]
[null,"Atividade 2",null,null,{"$f":"(D10/($D$9+$D$10+$D$11+D28+$D$29+$D$30+'2 Indicadores'!$D$34+'2 Indicadores'!D35))","v":{"$error":"#DIV/0!"}}]
[null,"Outras atividades",null,null,{"$f":"(D11/($D$9+$D$10+$D$11+$D$28+$D$29+$D$30+'2 Indicadores'!$D$34+D35))","v":{"$error":"#DIV/0!"}}]
[null,"*Atividades agrícolas, de pecuária e/ou silvicultura conduzidas no imóvel rural"]
[]
[null,"1.2 Produtividade das principais atividades",null,"Atividade 1","Atividade 2","Atividade 3"]
[null,"Atividades (selecione)",{"$nulls":4},"Fator de ponderação \t"]
[null,"Unidades de medida (selecione)",{"$nulls":4},"> 20%",0.9]
[null,"Produtividade média atual\t",{"$nulls":4},"produção ou preço de venda = ao regionall ",0.7]
[null,"Preço médio de venda  (R$/unidade de venda)\t"]
[null,"Produtividade média na região*\t",{"$nulls":4},"< 20%",0.5]
[null,"Média de preço da região (R$/unidade de venda)*\t",{"$nulls":4},"< 40%",0.3]
[null,"* Base de dados  - Cooperativa no município, Emater, IBGE, etc."]
[null,"Resultado",{"$f":"IF(D17>0,Fórmulas!G15,0)","v":{"v":0,"d":"0.00"}},"Referência: Depontti (2001); Correa (2007); Mattos Filho (2004); Lopez e Ridaura (2001)."]
[]
[2,"DIVERSIDADE DE RENDA"]
[]
[null,"2.1 Renda bruta anual estimada - outras atividades no imóvel rural* \t\t\t\t\t\t"]
[null,null,"Descrição das atividades\t","Valor estimado no ano (R$)\t"]
[null,"Atividade 1",null,null,{"$f":"(D28/($D$9+$D$10+$D$11+$D$29+$D$30+'2 Indicadores'!$D$34+D28+D35))","v":{"$error":"#DIV/0!"}}]
[null,"Atividade 2",null,null,{"$f":"(D29/($D$9+$D$10+$D$11+$D$29+$D$30+'2 Indicadores'!$D$34+'2 Indicadores'!D35+D28))","v":{"$error":"#DIV/0!"}}]
[null,"Outras atividades",null,null,{"$f":"(D30/($D$9+$D$10+$D$11+$D$28+$D$29+$D$30+'2 Indicadores'!$D$34+'2 Indicadores'!D35))","v":{"$error":"#DIV/0!"}}]
[null,"*Turismo, artesanato, agroindústria, produção de cachaça, alimentos processados, aplicações financeiras do capital de giro do imóvel rural, etc."]
[]
[null,"2.2 Renda bruta anual estimada fora imóvel rural*"]
[null,"Pensão, aposentadoria, ajudas financeiras (R$)",null,null,{"$f":"(D34/('2 Indicadores'!$D$9+'2 Indicadores'!$D$10+'2 Indicadores'!$D$11+$D$28+'2 Indicadores'!$D$29+'2 Indicadores'!$D$30+$D$34+'2 Indicadores'!D35))","v":{"$error":"#DIV/0!"}}]
[null,"Outras atividades/prestação de serviços (R$)",null,null,{"$f":"(D35/('2 Indicadores'!$D$9+'2 Indicadores'!$D$10+'2 Indicadores'!$D$11+$D$28+'2 Indicadores'!$D$29+'2 Indicadores'!$D$30+$D$35+'2 Indicadores'!D34))","v":{"$error":"#DIV/0!"}}]
[null,"*De todas as rendas das pessoas com vínculo direto com o estabelecimento (locação de máquinas, emprego fora do estabelecimento, prestação de serviços, etc.)"]
[]
[null,"2.3 Diversidade de Renda\t\t\t\t\t",{"$nulls":3},"Proporção da renda (%)","Fator de ponderação"]
[null,"Atividades agrícolas, pecuárias e florestais realizadas no estabelecimento\t\t\t",{"$nulls":3},{"$f":"(E11+E10+E9)","v":{"$error":"#DIV/0!"}},{"v":2,"d":"2.0"}]
[null,"Outras atividades realizadas no estabelecimento\t\t\t\t\t",{"$nulls":3},{"$f":"(E30+E29+E28)","v":{"$error":"#DIV/0!"}},{"v":2,"d":"2.0"}]
[null,"Atividades realizadas fora do estabelecimento\t\t\t",{"$nulls":3},{"$f":"'2 Indicadores'!E35","v":{"$error":"#DIV/0!"}},{"v":1,"d":"1.0"}]
[null,"Aposentadoria; Pensão; Ajuda Financeira; Outras fontes de renda\t\t\t",{"$nulls":3},{"$f":"'2 Indicadores'!E34","v":{"$error":"#DIV/0!"}},0.3]
[null,"Concentração numa única atividade no imóvel rural (> 80% da receita total)\t",{"$nulls":3},{"$f":"IF('2 Indicadores'!E9>0.8,\"sim\",\"não\")","v":{"$error":"#DIV/0!"}},"Verificação da proporção de renda",{"$f":"F39+F40+F41+F42","v":{"$error":"#DIV/0!"}}]
[]
[null,"Resultado",{"$f":"IF(H43<0.99,\"\",Fórmulas!H32)","v":{"$error":"#DIV/0!"}},"Adaptação APOIA-NovoRural (Rodrigues et al, 2010), Deponti (2002)."]
[]
[3,"EVOLUÇÃO PATRIMONIAL E GRAU DE ENDIVIDAMENTO"]
[]
[null,"3.1 Período da evolução patrimonial (anos)\t\t"]
[]
[null,"3.2 Avaliação dos bens do imóvel rural\t\t\t\t"]
[null,"3.2.1 Construções/ Reformas (período recente)* \t"]
[null,"Descrição","Valor estimado ($)\t"]
[null,null,{"v":1E-3,"d":"R$ 0.00"}]
[null,"*período de avaliação definido no item 3.1"]
[null,"3.2.2 Construcões existentes no imóvel rural*"]
[null,"Descrição","Valor estimado ($)\t",{"$nulls":3},{"$f":"IF(C58>0,((1+0.04167)^'2 Indicadores'!$D$49*C58),\" \")","v":{"v":1E-3,"d":"R$ 0.00"}}]
[null,null,{"v":1E-3,"d":"R$ 0.00"},null,"Valor Histórico*"]
[null,"*Depreciação vida útil 40 anos","Total",{"$f":"C58+C54","v":{"v":2E-3,"d":"$0.00"}},{"$f":"SUM(G57:G57)","v":{"v":1E-3,"d":"$0.00"}}]
[null,"3.2.3 Equipamentos adquiridos (período recente)*",{"$nulls":4},"Valor histórico*"]
[null,"Descrição","Valor estimado ($)\t"]
[null,null,{"v":1E-3,"d":"R$ 0.00"}]
[null,"*período de avaliação definido no item 3.1"]
[null,"3.2.4 Equipamentos já existentes no imóvel*"]
[null,"Descrição","Valor estimado ($)\t",{"$nulls":3},{"$f":"IF(C66>0,((1+0.052632)^'2 Indicadores'!$D$49*C66),\" \")","v":{"v":1E-3,"d":"R$ 0.00"}}]
[null,null,{"v":1E-3,"d":"R$ 0.00"},null,"Valor Histórico*"]
[null,"*Depreciação vida útil 20 anos","Total",{"$f":"C66+C62","v":{"v":2E-3,"d":"$0.00"}},{"$f":"SUM(G65:G65)","v":{"v":1E-3,"d":"$0.00"}}]
[]
[null,"3.3 Avaliação semoventes / estoque*\t\t",null,null,"Histórico (anterior - período item 3.1)"]
[null,"Descrição (selecione)","Quantidade (un.)","Valor atual ($)","Quantidade (un.)","Valor histórico ($)"]
[]
[{"$nulls":5},{"v":1E-3,"d":"R$ 0.00"}]
[null,"*Milho, soja, café, entre outros. ","Total",{"$f":"SUM(D71:D72)","v":0},"Total",{"$f":"SUM(F71:F72)","v":{"v":1E-3,"d":"R$ 0.00"}}]
[]
[null,"3.4 Sistemas de irrigação",null,"Uso histótico (ha)*"]
[null,"Tipo de irrigação","Área total irrigada (ha)"]
[]
[null,"*Anterior ao período de avaliação item 3.1"]
[null,"3.5 Uso do solo","Uso atual (ha)","Uso histótico (ha)*"]
[null,"Lavouras permanentes",{"$f":"'1 Questionário'!D86","v":0},{"$f":"C80","v":{"v":0,"d":"0.00"}}]
[null,"Lavouras temporárias",{"$f":"'1 Questionário'!D87","v":0},{"$f":"C81","v":{"v":0,"d":"0.00"}}]
[null,"Pastagens",{"$f":"'1 Questionário'!D88","v":0},{"v":0,"d":"0.00"}]
[null,"Silvicultura",{"$f":"'1 Questionário'!D89","v":0},{"v":0,"d":"0.00"}]
[null,"Área não agrícola",{"$f":"'1 Questionário'!D90","v":0},{"v":0,"d":"0.00"}]
[null,"Pousio\t",{"$f":"'1 Questionário'!D91","v":0},{"v":0,"d":"0.00"}]
[null,"Espelho/cursos d'água",{"$f":"'1 Questionário'!D92","v":0},{"v":0,"d":"0.00"}]
[null,"Vegetação nativa",{"$f":"'1 Questionário'!D93","v":0},{"v":0,"d":"0.00"}]
[null,"Áreas inaproveitáveis",{"$f":"'1 Questionário'!D94","v":0},{"v":0,"d":"0.00"}]
[null,"Total (ha)",{"$f":"SUM(C80:C88)","v":{"v":0,"d":"0.00"}},{"$f":"SUM(D80:D88)","v":{"v":0,"d":"0.00"}}]
[null,"*período de avaliação item 3.1"]
[null,"3.6 Valor da terra","Atual ($/ha)","Histórico ($/ha)* "]
[null,"Valor de referência na região "]
[null,"*Período de avaliação item 3.1"]
[null,"Estimativa patrimonial do imóvel rural**","Atual ($/ha)","Histórico ($/ha)* "]
[null,null,{"$f":"Fórmulas!E51+Fórmulas!E52+Fórmulas!E53+Fórmulas!E54+Fórmulas!E55+'2 Indicadores'!D73+'2 Indicadores'!D67+'2 Indicadores'!D59","v":{"$error":"#DIV/0!"}},{"$f":"Fórmulas!I51+Fórmulas!I52+Fórmulas!I53+Fórmulas!I54+Fórmulas!I55+'2 Indicadores'!E59+'2 Indicadores'!E67+'2 Indicadores'!F73","v":{"$error":"#DIV/0!"}}]
[null,"** (Somatória de benfeitorias, máquinas, equipamentos, animais e valor da terra)\t\t\t"]
[]
[null,"Evolução Patrimonial",{"$nulls":3},"Evolução no período (%)","Fator de ponderação"]
[]
[null,"Fator externo","Valor da terra na região",null,null,{"$f":"IF('2 Indicadores'!C92>0,('2 Indicadores'!C92/'2 Indicadores'!D92-1),\"\")","v":""},{"v":0.67,"d":"0.7"}]
[null,"Fatores internos em relação ao imóvel rural","Benfeitorias",null,null,{"$f":"IF('2 Indicadores'!D59>0,('2 Indicadores'!D59/'2 Indicadores'!E59-1),\"\")","v":{"v":1,"d":"100.0%"}},{"v":1,"d":"1.0"}]
[null,null,"Equipamentos",null,null,{"$f":"IF('2 Indicadores'!D67>0,('2 Indicadores'!D67/'2 Indicadores'!E67-1),\"\")","v":{"v":1,"d":"100.0%"}},{"v":1,"d":"1.0"}]
[null,null,"Semoventes / Estoque de grãos",null,null,{"$f":"IF('2 Indicadores'!D73>0,('2 Indicadores'!D73/'2 Indicadores'!F73-1),\"\")","v":""},{"v":1,"d":"1.0"}]
[null,null,"Ampliação da área de lavoura e/ou agricultura irrigada",null,null,{"$f":"+Fórmulas!H59","v":{"$error":"#DIV/0!"}},{"v":1,"d":"1.0"}]
[null,"Média anual da Evolução Patrimonial total (%)",{"$nulls":3},{"$f":"(+Fórmulas!H63)/D49","v":{"$error":"#DIV/0!"}}]
[null,"Média anual da Evolução Patrimonial (sem valorização da terra) (%)",{"$nulls":3},{"$f":"(Fórmulas!H61)/D49","v":{"$error":"#DIV/0!"}}]
[null,"Resultado Parcial",{"$f":"IF(Fórmulas!I39>1,1,Fórmulas!I39)","v":{"$error":"#DIV/0!"}},"Referência: Rodrigues et al, 2010; Gitman and Zutter (2015)."]
[{"$nulls":5},"% dívidas/valor pat.","Fator de ponderação"]
[null,"3.7 Grau de endividamento",{"$nulls":3},"0-7,5%","07 - 1 (y = 0,04x + 0,7)"]
[null,"Valor Total - financiamentos e outros compromissos financeiros \t\t",{"$nulls":3},"7,5-30%","1 - 01 (y = -0,04x + 1,3)"]
[null,"Total de dívidas / valor patrimonial estimado (%)\t",null,null,{"$f":"E110/C95","v":{"$error":"#DIV/0!"}},">30%",0.1]
[]
[null,"Resultado Parcial",{"$f":"Fórmulas!G68","v":{"$error":"#DIV/0!"}},"Adaptação APOIA-NovoRural (Rodrigues et al, 2010), Deponti (2002)."]
[]
[null,"Resultado",{"$f":"IF(C107=\"\",\"\",((C107*2)+C113)/3)","v":{"$error":"#DIV/0!"}}]
[]
[]
[4,"SERVIÇOS E INFRAESTRUTURA PÚBLICOS"]
[]
[null,"4.1 Total de residências no imóvel rural"]
[]
[{"$nulls":3},"Escolha uma opção: 1 (atende satisfatoriamente); 0,5 (parcialmente); 0 (inexistente)           \t\t\t"]
[null,"4.2 Serviços básicos disponíveis\t",null,"Residência rural (1)","Outras residências","Fator de ponderação"]
[null,"Disponibilidade de água (quantidade e qualidade)\t",{"$nulls":3},{"v":1,"d":"1.0"}]
[null,"Acesso a energia elétrica\t",{"$nulls":3},{"v":1,"d":"1.0"}]
[null,"Acesso regular para escoamento da produção\t",{"$nulls":3},{"v":1,"d":"1.0"}]
[null,"Acesso ao serviço de saúde*\t",{"$nulls":3},{"v":1,"d":"1.0"}]
[null,"Acesso regular ao transporte escolar\t",{"$nulls":3},{"v":1,"d":"1.0"}]
[null,"Segurança no campo \t",{"$nulls":3},{"v":1,"d":"1.0"}]
[null,"Internet \t",{"$nulls":3},{"v":1,"d":"1.0"}]
[null,"Coleta pública de lixo\t",{"$nulls":3},{"v":1,"d":"1.0"}]
[null,"* Produtor atendido pelo Programa Saúde da Família - PSF \t"]
[null,"Resultado Parcial",{"$f":"IF('1 Questionário'!E121=\"sim\",(Fórmulas!H77/10),(Fórmulas!H77/8))","v":{"v":0,"d":"0.00"}},"Adaptação APOIA-NovoRural (Rodrigues et al, 2010)."]
[]
[null,"4.3 Produção própria de alimentos (somente para imóveis rurais ≤ 4MF)\t",null,"Escolha uma opção: 1 (atende satisfatoriamente); 0,5 (parcialmente); 0 (inexistente)           \t\t\t\t         "]
[{"$nulls":3},"Residência rural (1)","Outras residências","Fator de ponderação"]
[null,"Hortaliças, grãos e tubérculos\t",{"$nulls":3},{"v":1,"d":"1.0"}]
[null,"Pomar\t",{"$nulls":3},{"v":1,"d":"1.0"}]
[null,"Criação de animais (carne, leite, ovos)\t\t",{"$nulls":3},{"v":1,"d":"1.0"}]
[null,"Resultado Parcial",{"$f":"IF('1 Questionário'!D76=\"Não\",\"\",Fórmulas!F89/3)","v":{"v":0,"d":"0.00"}},"Referência- Correa (2007)."]
[]
[null,"Resultado",{"$f":"IF(C140=\"\",C133,(((C133*2)+C140)/3))","v":{"v":0,"d":"0.00"}}]
[]
[5,"ESCOLARIDADE E CURSOS DE CAPACITAÇÃO"]
[{"$nulls":3},"Marque o nº de pessoas em cada campo"]
[null,"5.1 Grau de escolaridade \t\n\t",null,"Membros da família","Funcionários"]
[null,"Número de adultos no imóvel rural\t",{"$nulls":3},"Fator de ponderação"]
[null,"Menos de 9 anos de estudo\t",{"$nulls":3},0.7]
[null,"Ensino Fundamental completo\t",{"$nulls":3},{"v":1,"d":"1.0"}]
[null,"Ensino Médio completo\t",{"$nulls":3},1.2]
[null,"Curso superior\t",{"$nulls":3},1.5]
[]
[{"$nulls":3},"Marque o nº de pessoas em cada campo"]
[null,"5.2 Cursos direcionados às atividades rurais",null,"Membros da família","Funcionários","Fator de ponderação"]
[null,"Capacitação curta temporada\t",{"$nulls":3},0.5]
[null,"Capacitação longa temporada",{"$nulls":3},0.8]
[]
[{"$nulls":3},"Marque o nº de pessoas em cada campo"]
[null,"5.3 Frequência da rede de ensino dos dependentes",null,"Integrantes da família (6 - 18 anos)","Filhos de funcionários residentes imóvel rural (6 - 18 anos)"]
[]
[null,"Número de dependentes no imóvel rural\t",{"$nulls":3},"Fator de ponderação"]
[null,"Frequenta rede de ensino \t",{"$nulls":3},{"v":1,"d":"1.0"}]
[]
[null,"Resultado",{"$f":"IF(Fórmulas!K96>1,1,Fórmulas!K96)","v":{"$error":"#DIV/0!"}},"Referência: Calorio (1997), Correa (2007) e Rodrigues et al. (2003)."]
[]
[6,"QUALIDADE DO EMPREGO"]
[{"$nulls":3},"Marque o nº de pessoas em cada campo"]
[null,"6.1 Cumprimento da Legislação Trabalhista\t\t",null,"Funcionários permanentes","Funcionários temporários","Fator de ponderação"]
[]
[null,"Número de funcionários no imóvel rural\t\t"]
[null,"Registro de funcionários (carteira de trabalho)\t\t",{"$nulls":3},{"v":1,"d":"1.0"}]
[null,"Pagamento de hora extra ou ausência de hora extra\t\t\t\t",{"$nulls":3},{"v":1,"d":"1.0"}]
[]
[{"$nulls":3},"Marque o nº de pessoas em cada campo"]
[null,"6.2 Adoção de benefícios / observância das recomendações/determinações do Ministério do Trabalho\t\t\n\t\t\n\t\t",null,"Funcionários permanentes","Funcionários temporários","Fator de ponderação"]
[]
[null,"Acima de 1 salário mínimo\t\t",{"$nulls":3},{"v":1,"d":"1.0"}]
[null,"Auxílio alimentação\t\t",{"$nulls":3},{"v":1,"d":"1.0"}]
[null,"Auxílio moradia\t\t",{"$nulls":3},{"v":1,"d":"1.0"}]
[null,"Auxílio educação e transporte\t\t",{"$nulls":3},{"v":1,"d":"1.0"}]
[null,"Participação nos lucros\t\t",{"$nulls":3},{"v":5,"d":"5.0"}]
[null,"Seguro contra acidentes\t\t",{"$nulls":3},{"v":3,"d":"3.0"}]
[null,"Acesso a lazer\t\t",{"$nulls":3},{"v":1,"d":"1.0"}]
[null,"Espaço para cultivo de alimentos \t\t",{"$nulls":3},{"v":3,"d":"3.0"}]
[]
[null,"Resultado",{"$f":"IF(Fórmulas!H108>1,1,Fórmulas!H108)","v":{"v":0.7,"d":"0.70"}},"Adaptação APOIA-NovoRural (Rodrigues et al, 2010)."]
[]
[7,"GESTÃO DO EMPREENDIMENTO"]
[]
[null,null,"Escolha uma opção: 1 (atende satisfatoriamente); 0,5 (parcialmente); 0 (inexistente)\t  \t\t\t         ",null,null,"Fator de ponderação"]
[null,"7.1 Controle administrativo"," Fluxo de caixa (receita/despesa)\t",null,null,{"v":1,"d":"1.0"}]
[null,null," Custo de produção das atividades\t",null,null,{"v":1,"d":"1.0"}]
[null,"7.2 Acesso à assistência técnica (particular ou pública)*\t\t",{"$nulls":3},{"v":1,"d":"1.0"}]
[null,"7.3 Participação - formas associativas - ativa (1) ou passiva (0,5)\t\t",{"$nulls":3},{"v":1,"d":"1.0"}]
[null,"7.4 Regularização ambiental (Uso da água, CAR e Licenciamento)\t\t",{"$nulls":3},{"v":2,"d":"2.0"}]
[null,"7.5 Financiamento\n"," Acessa crédito para investimento\t",null,null,0.4]
[null,null," Acessa crédito para custeio\t",null,null,0.4]
[null,null," Acessa crédito para comercialização\t",null,null,0.2]
[null,"* Não considerar assistência técnica de revendas de insumos."]
[null,"Resultado",{"$f":"((+E191*F191+E192*F192+E193+E194+E195*2+E196*F196+E197*F197+E198*F198)/7)","v":{"v":0,"d":"0.00"}},"Referência: Correa (2007)."]
[]
[8,"COMERCIALIZAÇÃO E INOVAÇÃO "]
[]
[null,"8.1 Comercialização",null,null,"Escolha uma opção","Fator de ponderação"]
[null,"Diversificação de compradores, busca de preços, preços pré-venda",{"$nulls":3},0.4]
[null,"Produtos certificados, agrega valor, mercado institucional\t\t",{"$nulls":3},0.4]
[]
[null,"8.2 Inovação",null,null,"Escolha uma opção"]
[null,"Adoção de técnicas inovadoras*\t\t\t",{"$nulls":3},0.3]
[null,"Descrição "]
[null,"Capacidade de inovação ou liderança na comunidade\t\t",{"$nulls":3},0.4]
[null,"Descrição "]
[null,"* Conceito, ideia, prática ou tecnologia, percebidas como nova pelo indivíduo e/ou grupo social. Conhecimento científico e tecnológico transformados em boas práticas.\t\t\t\t\t\t\t\t\t\t\t"]
[null,"8.3 Adoção de práticas regenerativas (opcional)",null,"Escolha uma opção","Caso afirmativo, qual a proporção da área de produção que adota esta prática (%)\t\t\t"]
[null,"Uso de bioinsumos nas áreas de produção agropecuária\t"]
[null,"Uso de plantas de cobertura / arbóreas - sombreamento**"]
[null,"** Estratégias para cobertura permanente do solo; aumentar a biodiversidade e/ou bem estar animal\t\t\t\t\t\t"]
[null,"Resultado",{"$f":"IF(Fórmulas!F128>1,1,Fórmulas!F128)","v":{"v":0,"d":"0.00"}}]
[]
[9,"GERENCIAMENTO DE RESÍDUOS E EFLUENTES "]
[{"$nulls":3},"Escolha uma opção ao clicar no campo abaixo\t",{"$nulls":3},"Fator de ponderação"]
[{"$nulls":3},"Residência rural (1)\t","Outras residências"]
[null,"9.1.Destinação do esgoto residencial",{"$nulls":3},{"$f":"Fórmulas!M143","v":{"$error":"#DIV/0!"}},null,{"v":1,"d":"1.0"}]
[null,"9.2.Destinação do lixo domiciliar e das atividades",{"$nulls":3},{"$f":"Fórmulas!M149","v":{"$error":"#DIV/0!"}},null,{"v":1,"d":"1.0"}]
[]
[null,"Preenchimento obrigatório\t\t\t",null,null,"(%)"]
[null,"9.3.Resíduos sólidos orgânicos - compostagem/reaproveitamento no campo\t\t\t",{"$nulls":5},{"v":1,"d":"1.0"}]
[]
[null,"Deixar o campo em branco quando não houver geração de efluentes líquidos e/ou gasosos\t\t\t",null,null,"(%)"]
[null,"9.4.Efluentes líquidos (quando existentes) - tratamento / destinação adequada \t\t\t\t\t",{"$nulls":3},{"$f":"IF(ISBLANK(E230),Fórmulas!$K$135,\" \")","v":"Não se aplica"},null,{"v":1,"d":"1.0"}]
[null,"9.5.Efluentes gasosos (quando existentes) - tratamento / destinação adequada \t\t\t\t\t\t",{"$nulls":3},{"$f":"IF(ISBLANK(E231),Fórmulas!$K$135,\" \")","v":"Não se aplica"},null,{"v":1,"d":"1.0"}]
[null,"* Estação de tratamento; biodigestor; compostagem; etc."]
[{"$nulls":4},"Escolha uma opção\t\t"]
[null,"9.6 Imóvel rural possui pontos críticos na gestão de resíduos e efluentes*\t\t\t\t\t\t"]
[null,null,"*Situação crítica - especificar"]
[null,"Resultado",{"$f":"IF(Fórmulas!H135=0,0.7,+Fórmulas!F136)","v":{"v":0.7,"d":"0.70"}},"Adaptação APOIA-NovoRural (Rodrigues et al, 2010)."]
[]
[10,"FERTILIDADE DO SOLO"]
[]
[null,"Descrição do talhão \t"]
[{"$nulls":4},"Resultado "]
[null,"Teor de argila",null,"dag kg-1 (%) Argila",{"$f":"IF(ISBLANK(C242),0,IF(C242<=15,Fórmulas!H156,IF(AND(C242>15,C242<35),Fórmulas!H157,IF(AND(C242>=35,C242<=60),Fórmulas!H158,IF(C242>60,Fórmulas!H159)))))","v":{"v":0,"d":"0.00"}}]
[null,"Matéria Orgânica",null,"(dag kg-1)",{"$f":"IF(Fórmulas!M168>1,1,IF(Fórmulas!M168<0,0,Fórmulas!M168))","v":{"v":0,"d":"0.00"}}]
[null,"P disponível",null,"(mg dm-3) (Mehlich-1)",{"$f":"IF(Fórmulas!F197>1,1,IF(Fórmulas!F197<0,0,Fórmulas!F197))","v":{"v":0,"d":"0.00"}}]
[null,"Ca trocável",null,"(cmolc dm-3)",{"$f":"IF(ISBLANK(C245),0,IF(Fórmulas!I205>1,1,IF(Fórmulas!I205<0,0,Fórmulas!I205)))","v":{"v":0,"d":"0.00"}}]
[null,"Mg trocável",null,"(cmolc dm-3)",{"$f":"IF(ISBLANK(C246),0,IF(Fórmulas!I214>1,1,IF(Fórmulas!I214<0,0,Fórmulas!I214)))","v":{"v":0,"d":"0.00"}}]
[null,"K trocável",null,"(mg dm-3)",{"$f":"IF(ISBLANK(C247),0,IF(Fórmulas!I223>1,1,IF(Fórmulas!I223<0,0,Fórmulas!I223)))","v":{"v":0,"d":"0.00"}}]
[null,"pH em água",null,"Índice",{"$f":"IF(ISBLANK(C248),0,IF(Fórmulas!H232>1,1,IF(Fórmulas!H232<0,0,Fórmulas!H232)))","v":{"v":0,"d":"0.00"}}]
[null,"Al trocável",null,"(cmolc dm-3)",{"$f":"IF(C249>2,0,IF(ISBLANK(C249),0,IF(Fórmulas!H240>1,1,IF(Fórmulas!H240<0,0,Fórmulas!H240))))","v":{"v":0,"d":"0.00"}}]
[null,"CTC",null,"(cmolc dm-3)",{"$f":"IF(ISBLANK(C250),0,Fórmulas!H248)","v":{"v":0,"d":"0.00"}}]
[null,"Saturação por bases",null,"(%)",{"$f":"IF(ISBLANK(C251),0,IF(Fórmulas!H256>0.83,1,IF(Fórmulas!H256<0,0,Fórmulas!H256)))","v":{"v":0,"d":"0.00"}}]
[null,"Resultado Parcial",{"$f":"AVERAGE(E243,E244,E251)","v":{"v":0,"d":"0.00"}},null,"Análise de regressão gerada pelo programa SigmaPlot."]
[]
[null,"Avaliação da biologia do solo - BioAS* (opcional)\t"]
[null,"Arilsulfatase",null,"(mg p-nitrofenol kg-1 h-1)"]
[null,"β-Glicosidase",null,"(mg p-nitrofenol kg-1 h-1)"]
[null,"Matéria orgânica (0-10cm)",null,"(dag kg-1)"]
[null,"IQS Biológico ",null,"Índice"]
[null,"Índice Armaz. Nutrientes",null,"Índice"]
[null,"Índice Sup. Nutrientes",null,"Índice"]
[null,"IQS Químico",null,"Índice"]
[null,"IQS FertBio",null,"Índice"]
[null,"Resultado Parcial",{"$f":"C258","v":{"v":0,"d":"0.00"}}]
[null,"* Bioanálise do Solo (Embrapa)"]
[null,"Resultado",{"$f":"IF(C263>0,(2*C252+C263)/3,C252)","v":{"v":0,"d":"0.00"}},"Adaptação - Sousa, D.M.G.; Lobato, E. (2004) e Ribeiro, A. C. (1999)"]
[]
[11,"EROSÃO DO SOLO E MANUTENÇÃO DAS ESTRADAS"]
[]
[null,"Erosão do solo",null,"Escolha uma opção  ","Área (ha)","Proporção (%) área total","Fator de ponderação"]
[null,"11.1 Intensidade do estágio de degradação*\t",{"$nulls":3},{"$f":"IF(E270>0,E270/Fórmulas!$I$520,\" \")","v":" "},{"v":1,"d":"1.0"},"Inicial"]
[null,"* Evidências de erosão: Inicial - redução de infiltração de água, raízes expostas; Intermediário - remoção do horizonte superficial, presença de sulcos rasos localizados; Avançado - sulcos profundos e disseminados na área, voçorocas, movimento de massa (deslocamento de um volume de solo).\t\t\t\t\t",{"$nulls":4},0.8,"Intermediário"]
[{"$nulls":6},0.5,"Avançado"]
[null,"11.2 Tendência de comportamento do processo\t",null,null,"Escolha uma opção  "]
[null,"** Adoção de medidas de recuperação ou mitigação como terraceamentos, barreiras físicas, barramentos, revegetação, etc.\t\t\t\t"]
[null,"Resultado Parcial",{"$f":"IF(Fórmulas!E294>0,(Fórmulas!E294*Fórmulas!E295*1.2)+(Fórmulas!E294*Fórmulas!F295)+(Fórmulas!E294*Fórmulas!G295*0.8),0.7)","v":{"v":0.7,"d":"0.70"}},"Adaptação APOIA-NovoRural (Rodrigues et al, 2003); Fidalski (1997)."]
[]
[null,"Estado de conservação das estradas",null,"Estradas (%)",null,"Fator de ponderação"]
[null,"11.3 Avaliação do estado de conservação e drenagem \n\n","Presença abaulamento das estradas\t",null,null,{"v":1,"d":"1.0"}]
[null,null,"Presença de lombadas - desvio de enxurrada\t",null,null,{"v":1,"d":"1.0"},{"$f":"IF(ISBLANK(E279),Fórmulas!M302,\" \")","v":"Não se aplica"}]
[null,null,"Presença de caixas de infiltração\t",null,null,{"v":1,"d":"1.0"},{"$f":"IF(ISBLANK(E280),Fórmulas!M302,\" \")","v":"Não se aplica"}]
[{"$nulls":3},"Estradas (%)"]
[null,"11.4 Conservação das estradas","Presença de buracos nas estradas\t",null,null,{"v":1,"d":"1.0"},"Fator de ponderação"]
[null,null,"Presença de sulcos de erosão nas estradas\t\t",null,null,{"v":1,"d":"1.0"},{"v":2,"d":"2.0"},{"v":1,"d":"1.0"}]
[{"$nulls":4},"Escolha uma opção  "]
[null,"11.5 O imóvel rural possui algum ponto crítico nas estradas* \t\t",{"$nulls":3},{"v":1,"d":"1.0"}]
[null,null,"*Situação crítica - especificar"]
[null,"Resultado Parcial",{"$f":"IF(AND(E282=\"\",E278=\"\"),0,Fórmulas!J303)","v":{"v":0,"d":"0.00"}}]
[]
[null,"Result",{"$f":"IF(AND(C275=0.7,C287>0.925),1,((C275+C287)/2))","v":0.35}]
[]
[12,"QUALIDADE DA ÁGUA"]
[{"$nulls":6},"*Adaptação CALLISTO et al., 2002 - Aplicação de um protocolo de avaliação rápida de habitats em atividades de ensino e pesquisa.\t\n\t"]
[null,"12.1 Avaliação dos ecossistemas aquáticos nos trechos de coleta de amostras de água*"]
[null,null,"Localização ","Escolha uma opção  ",null,null,"Fator de ponderação"]
[null,"Tipo de ocupação das margens do corpo d'água \n","Montante",null,null,{"$f":"SUM((IF('2 Indicadores'!D295=Fórmulas!L309,4,0))+(IF('2 Indicadores'!D295=Fórmulas!L310,2,0)))","v":{"v":0,"d":"0.0"}},{"v":4,"d":"4.0"},{"$f":"'2 Indicadores'!G295*'2 Indicadores'!F295","v":{"v":0,"d":"0.0"}}]
[null,null,"Jusante",null,null,{"$f":"SUM((IF('2 Indicadores'!D296=Fórmulas!L309,4,0))+(IF('2 Indicadores'!D296=Fórmulas!L310,2,0)))","v":{"v":0,"d":"0.0"}},{"v":4,"d":"4.0"},{"$f":"'2 Indicadores'!G296*'2 Indicadores'!F296","v":{"v":0,"d":"0.0"}}]
[null,"Alterações antrópicas\n","Montante",null,null,{"$f":"SUM((IF('2 Indicadores'!D297=Fórmulas!L312,4,0))+(IF('2 Indicadores'!D297=Fórmulas!L313,2,0)))","v":{"v":0,"d":"0.0"}},{"v":2,"d":"2.0"},{"$f":"'2 Indicadores'!G297*'2 Indicadores'!F297","v":{"v":0,"d":"0.0"}}]
[null,null,"Jusante",null,null,{"$f":"SUM((IF('2 Indicadores'!D298=Fórmulas!L312,4,0))+(IF('2 Indicadores'!D298=Fórmulas!L313,2,0)))","v":{"v":0,"d":"0.0"}},{"v":2,"d":"2.0"},{"$f":"'2 Indicadores'!G298*'2 Indicadores'!F298","v":{"v":0,"d":"0.0"}}]
[null,"Sombreamento a partir da cobertura vegetal no leito ","Montante",null,null,{"$f":"SUM((IF('2 Indicadores'!D299=Fórmulas!L315,4,0))+(IF('2 Indicadores'!D299=Fórmulas!L316,2,0)))","v":{"v":0,"d":"0.0"}},{"v":4,"d":"4.0"},{"$f":"'2 Indicadores'!G299*'2 Indicadores'!F299","v":{"v":0,"d":"0.0"}}]
[null,null,"Jusante",null,null,{"$f":"SUM((IF('2 Indicadores'!D300=Fórmulas!L315,4,0))+(IF('2 Indicadores'!D300=Fórmulas!L316,2,0)))","v":{"v":0,"d":"0.0"}},{"v":4,"d":"4.0"},{"$f":"'2 Indicadores'!G300*'2 Indicadores'!F300","v":{"v":0,"d":"0.0"}}]
[null,"Erosão nas margens / assoreamento em seu leito\n","Montante",null,null,{"$f":"SUM((IF('2 Indicadores'!D301=Fórmulas!L318,4,0))+(IF('2 Indicadores'!D301=Fórmulas!L319,2,0)))","v":{"v":0,"d":"0.0"}},{"v":4,"d":"4.0"},{"$f":"'2 Indicadores'!G301*'2 Indicadores'!F301","v":{"v":0,"d":"0.0"}}]
[null,null,"Jusante",null,null,{"$f":"SUM((IF('2 Indicadores'!D302=Fórmulas!L318,4,0))+(IF('2 Indicadores'!D302=Fórmulas!L319,2,0)))","v":{"v":0,"d":"0.0"}},{"v":4,"d":"4.0"},{"$f":"'2 Indicadores'!G302*'2 Indicadores'!F302","v":{"v":0,"d":"0.0"}}]
[null,"Transparência da água\n","Montante",null,null,{"$f":"SUM((IF('2 Indicadores'!D303=Fórmulas!L321,4,0))+(IF('2 Indicadores'!D303=Fórmulas!L322,2,0)))","v":{"v":0,"d":"0.0"}},{"v":3,"d":"3.0"},{"$f":"'2 Indicadores'!G303*'2 Indicadores'!F303","v":{"v":0,"d":"0.0"}}]
[null,null,"Jusante",null,null,{"$f":"SUM((IF('2 Indicadores'!D304=Fórmulas!L321,4,0))+(IF('2 Indicadores'!D304=Fórmulas!L322,2,0)))","v":{"v":0,"d":"0.0"}},{"v":3,"d":"3.0"},{"$f":"'2 Indicadores'!G304*'2 Indicadores'!F304","v":{"v":0,"d":"0.0"}}]
[null,"Odor da água","Montante",null,null,{"$f":"SUM((IF('2 Indicadores'!D305=Fórmulas!L324,4,0))+(IF('2 Indicadores'!D305=Fórmulas!L325,2,0)))","v":{"v":0,"d":"0.0"}},{"v":2,"d":"2.0"},{"$f":"'2 Indicadores'!G305*'2 Indicadores'!F305","v":{"v":0,"d":"0.0"}}]
[null,null,"Jusante",null,null,{"$f":"SUM((IF('2 Indicadores'!D306=Fórmulas!L324,4,0))+(IF('2 Indicadores'!D306=Fórmulas!L325,2,0)))","v":{"v":0,"d":"0.0"}},{"v":2,"d":"2.0"},{"$f":"'2 Indicadores'!G306*'2 Indicadores'!F306","v":{"v":0,"d":"0.0"}}]
[null,"Tipo de fundo do corpo d'água","Montante",null,null,{"$f":"SUM((IF('2 Indicadores'!D307=Fórmulas!L327,4,0))+(IF('2 Indicadores'!D307=Fórmulas!L328,2,0)))","v":{"v":0,"d":"0.0"}},{"v":4,"d":"4.0"},{"$f":"'2 Indicadores'!G307*'2 Indicadores'!F307","v":{"v":0,"d":"0.0"}}]
[null,null,"Jusante",null,null,{"$f":"SUM((IF('2 Indicadores'!D308=Fórmulas!L327,4,0))+(IF('2 Indicadores'!D308=Fórmulas!L328,2,0)))","v":{"v":0,"d":"0.0"}},{"v":4,"d":"4.0"},{"$f":"'2 Indicadores'!G308*'2 Indicadores'!F308","v":{"v":0,"d":"0.0"}}]
[]
[null,"12.2 Avaliação da qualidade da água superficial (opcional)\t\t\t\t"]
[null,"Descrição dos locais das coletas da água"]
[{"$nulls":5},"Resultado ","Fator de ponderação"]
[null,"pH da água","Montante",null,"Unidade",{"$f":"IF(D313>0,Fórmulas!B314,\"\")","v":""},{"v":1,"d":"1.0"}]
[null,null,"Jusante",null,"Unidade",{"$f":"IF(D314>0,Fórmulas!C314,\"\")","v":""},{"v":1,"d":"1.0"}]
[null,"Coliformes Termotolerantes","Montante",null,"(UFC 100 mL-1)",{"$f":"IF(D315=\"\",\"\",Fórmulas!B323)","v":""},{"v":3,"d":"3.0"}]
[null,null,"Jusante",null,"(UFC 100 mL-1)",{"$f":"IF(D316=\"\",\"\",Fórmulas!C323)","v":""},{"v":3,"d":"3.0"}]
[null,"Nitrato Total","Montante",null,"(mg L-1 de NO3)",{"$f":"IF(D317=\"\",\"\",Fórmulas!B340)","v":""},{"v":2,"d":"2.0"}]
[null,null,"Jusante",null,"(mg L-1 de NO3)",{"$f":"IF(D318=\"\",\"\",Fórmulas!C340)","v":""},{"v":2,"d":"2.0"}]
[null,"Turbidez da água","Montante",null,"UNT",{"$f":"IF(D319=\"\",\"\",Fórmulas!B332)","v":""},{"v":4,"d":"4.0"}]
[null,null,"Jusante",null,"UNT",{"$f":"IF(D320=\"\",\"\",Fórmulas!C332)","v":""},{"v":4,"d":"4.0"}]
[]
[null,"Avaliação do Ecossistema Aquático","Montante",{"$f":"(H295+H297+H299+H301+H303+H305+H307)/92","v":{"v":0,"d":"0.00"}},null,null,{"v":4,"d":"4.0"}]
[null,null,"Jusante",{"$f":"(H296+H298+H300+H302+H304+H306+H308)/92","v":{"v":0,"d":"0.00"}},null,null,{"v":4,"d":"4.0"}]
[]
[null,"Resultado Parcial Qualidade água superficial","Montante",{"$f":"+Fórmulas!L344","v":{"v":0,"d":"0.00"}}]
[null,null,"Jusante",{"$f":"+Fórmulas!L345","v":{"v":0,"d":"0.00"}}]
[]
[null,"12.3 Avaliação da qualidade da água subterrânea / consumo humano (opcional)\t\t\t\t\t"]
[null,"Descrição do local da coleta da amostra da água\t"]
[{"$nulls":5},"Resultado ","Fator de ponderação"]
[null,"pH da água",null,null,"Unit",{"$f":"IF(D331>0,Fórmulas!B356,\"\")","v":""},{"v":1,"d":"1.0"}]
[null,"Coliformes Termotolerantes",null,null,"(UFC 100 mL-1)",{"$f":"IF(D332=\"\",\"\",Fórmulas!B363)","v":""},{"v":1,"d":"1.0"}]
[null,"Nitrato Total",null,null,"(mg L-1 de NO3)",{"$f":"IF(D333=\"\",\"\",Fórmulas!B370)","v":""},{"v":1,"d":"1.0"}]
[null,"Resultado parcial  - Qualidade da água subterrânea\t",null,{"$f":"IF(AND(D331>0),AVERAGE(F331,F332,F333),\"\")","v":""}]
[]
[null,"Resultado",{"$f":"IF(D334=\"\",Fórmulas!F350,(((Fórmulas!F350*2)+D334)/3))","v":{"v":0,"d":"0.00"}}]
[]
[13,"RISCO DE CONTAMINAÇÃO DA ÁGUA E MANEJO DOS PESTICIDAS"]
[null,"13.1 Potencial de contaminação do produto",{"$nulls":3},"Para incluir mais produtos clique aqui"]
[null,"Nome comercial do produto (selecione)\t"]
[null,"Ingrediente ativo (%) (opcional)"]
[null,"Descrição da cultura \t"]
[null,"Área (ha)\t"]
[null,"Volume aplicado  L/ha ou kg/ha \t"]
[null,"Volume total aplicado por produto\t",null,{"$f":"+D344*D343","v":{"v":0,"d":"0.0"}},{"$f":"+E344*E343","v":{"v":0,"d":"0.0"}},{"$f":"+F344*F343","v":{"v":0,"d":"0.0"}},{"$f":"+G344*G343","v":{"v":0,"d":"0.0"}},{"$f":"+H344*H343","v":{"v":0,"d":"0.0"}}]
[null,"Ingrediente ativo do produto \t",null,{"$f":"IF(D$343>0,(HLOOKUP(D$340,'Base de dados'!$B$5:$AIN$11,$I346,0)),\"\")","v":""},{"$f":"IF(E$343>0,(HLOOKUP(E$340,'Base de dados'!$B$5:$AIN$11,$I346,0)),\"\")","v":""},{"$f":"IF(F$343>0,(HLOOKUP(F$340,'Base de dados'!$B$5:$AIN$11,$I346,0)),\"\")","v":""},{"$f":"IF(G$343>0,(HLOOKUP(G$340,'Base de dados'!$B$5:$AIN$11,$I346,0)),\"\")","v":""},{"$f":"IF(H$343>0,(HLOOKUP(H$340,'Base de dados'!$B$5:$AIN$11,$I346,0)),\"\")","v":""},2]
[null,"Toxicidade para peixes - 96h LC50 (mg L-1)\t",null,{"$f":"IF(D$343>0,(HLOOKUP(D$340,'Base de dados'!$B$5:$AIN$11,$I347,0)),\"\")","v":""},{"$f":"IF(E$343>0,(HLOOKUP(E$340,'Base de dados'!$B$5:$AIN$11,$I347,0)),\"\")","v":""},{"$f":"IF(F$343>0,(HLOOKUP(F$340,'Base de dados'!$B$5:$AIN$11,$I347,0)),\"\")","v":""},{"$f":"IF(G$343>0,(HLOOKUP(G$340,'Base de dados'!$B$5:$AIN$11,$I347,0)),\"\")","v":""},{"$f":"IF(H$343>0,(HLOOKUP(H$340,'Base de dados'!$B$5:$AIN$11,$I347,0)),\"\")","v":""},3]
[null,"Toxicidade (mg kg-1 day-1)",null,{"$f":"IF(D$343>0,(HLOOKUP(D$340,'Base de dados'!$B$5:$AIN$11,$I348,0)),\"\")","v":""},{"$f":"IF(E$343>0,(HLOOKUP(E$340,'Base de dados'!$B$5:$AIN$11,$I348,0)),\"\")","v":""},{"$f":"IF(F$343>0,(HLOOKUP(F$340,'Base de dados'!$B$5:$AIN$11,$I348,0)),\"\")","v":""},{"$f":"IF(G$343>0,(HLOOKUP(G$340,'Base de dados'!$B$5:$AIN$11,$I348,0)),\"\")","v":""},{"$f":"IF(H$343>0,(HLOOKUP(H$340,'Base de dados'!$B$5:$AIN$11,$I348,0)),\"\")","v":""},4]
[null,"Índice para toxicidade do produto\t",null,{"$f":"IF(D$343>0,(HLOOKUP(D$340,'Base de dados'!$B$5:$AIN$11,$I349,0)),\"\")","v":""},{"$f":"IF(E$343>0,(HLOOKUP(E$340,'Base de dados'!$B$5:$AIN$11,$I349,0)),\"\")","v":""},{"$f":"IF(F$343>0,(HLOOKUP(F$340,'Base de dados'!$B$5:$AIN$11,$I349,0)),\"\")","v":""},{"$f":"IF(G$343>0,(HLOOKUP(G$340,'Base de dados'!$B$5:$AIN$11,$I349,0)),\"\")","v":""},{"$f":"IF(H$343>0,(HLOOKUP(H$340,'Base de dados'!$B$5:$AIN$11,$I349,0)),\"\")","v":""},5]
[null,"Koc",null,{"$f":"IF(D$343>0,(HLOOKUP(D$340,'Base de dados'!$B$5:$AIN$11,$I350,0)),\"\")","v":""},{"$f":"IF(E$343>0,(HLOOKUP(E$340,'Base de dados'!$B$5:$AIN$11,$I350,0)),\"\")","v":""},{"$f":"IF(F$343>0,(HLOOKUP(F$340,'Base de dados'!$B$5:$AIN$11,$I350,0)),\"\")","v":""},{"$f":"IF(G$343>0,(HLOOKUP(G$340,'Base de dados'!$B$5:$AIN$11,$I350,0)),\"\")","v":""},{"$f":"IF(H$343>0,(HLOOKUP(H$340,'Base de dados'!$B$5:$AIN$11,$I350,0)),\"\")","v":""},6]
[null,"t1/2 (DT50)",null,{"$f":"IF(D$343>0,(HLOOKUP(D$340,'Base de dados'!$B$5:$AIN$11,$I351,0)),\"\")","v":""},{"$f":"IF(E$343>0,(HLOOKUP(E$340,'Base de dados'!$B$5:$AIN$11,$I351,0)),\"\")","v":""},{"$f":"IF(F$343>0,(HLOOKUP(F$340,'Base de dados'!$B$5:$AIN$11,$I351,0)),\"\")","v":""},{"$f":"IF(G$343>0,(HLOOKUP(G$340,'Base de dados'!$B$5:$AIN$11,$I351,0)),\"\")","v":""},{"$f":"IF(H$343>0,(HLOOKUP(H$340,'Base de dados'!$B$5:$AIN$11,$I351,0)),\"\")","v":""},7]
[null,"Índice de vulnerabilidade águas subterrâneas (GUS)\t",null,{"$f":"IF(D343=0,\"\",IF(LOG10(D351)*(4-LOG10(D350))<=0,0,IF(OR(LOG10(D351)*(4-LOG10(D350))>0,),(LOG10(D351)*(4-LOG10(D350))),IF((LOG10(D351)*(4-LOG10(D350))>0),(LOG10(D351)*(4-LOG10(D350)))))))","v":""},{"$f":"IF(E343=0,\"\",IF(LOG10(E351)*(4-LOG10(E350))<=0,0,IF(OR(LOG10(E351)*(4-LOG10(E350))>0,),(LOG10(E351)*(4-LOG10(E350))),IF((LOG10(E351)*(4-LOG10(E350))>0),(LOG10(E351)*(4-LOG10(E350)))))))","v":""},{"$f":"IF(F343=0,\"\",IF(LOG10(F351)*(4-LOG10(F350))<=0,0,IF(OR(LOG10(F351)*(4-LOG10(F350))>0,),(LOG10(F351)*(4-LOG10(F350))),IF((LOG10(F351)*(4-LOG10(F350))>0),(LOG10(F351)*(4-LOG10(F350)))))))","v":""},{"$f":"IF(G343=0,\"\",IF(LOG10(G351)*(4-LOG10(G350))<=0,0,IF(OR(LOG10(G351)*(4-LOG10(G350))>0,),(LOG10(G351)*(4-LOG10(G350))),IF((LOG10(G351)*(4-LOG10(G350))>0),(LOG10(G351)*(4-LOG10(G350)))))))","v":""},{"$f":"IF(H343=0,\"\",IF(LOG10(H351)*(4-LOG10(H350))<=0,0,IF(OR(LOG10(H351)*(4-LOG10(H350))>0,),(LOG10(H351)*(4-LOG10(H350))),IF((LOG10(H351)*(4-LOG10(H350))>0),(LOG10(H351)*(4-LOG10(H350)))))))","v":""}]
[null,"Potencial de contaminação (1, 2 or 3)",null,{"$f":"IF(D343>0,(IF(OR(Fórmulas!C387=0.83,Fórmulas!C387<0.83),1,IF(OR(AND(0.83<Fórmulas!C387,Fórmulas!C387<=1.66)),2,IF(Fórmulas!C387>1.66,3,\"\")))),\"\")","v":""},{"$f":"IF(E343>0,(IF(OR(Fórmulas!D387=0.83,Fórmulas!D387<0.83),1,IF(OR(AND(0.83<Fórmulas!D387,Fórmulas!D387<=1.66)),2,IF(Fórmulas!D387>1.66,3,\"\")))),\"\")","v":""},{"$f":"IF(F343>0,(IF(OR(Fórmulas!E387=0.83,Fórmulas!E387<0.83),1,IF(OR(AND(0.83<Fórmulas!E387,Fórmulas!E387<=1.66)),2,IF(Fórmulas!E387>1.66,3,\"\")))),\"\")","v":""},{"$f":"IF(G343>0,(IF(OR(Fórmulas!F387=0.83,Fórmulas!F387<0.83),1,IF(OR(AND(0.83<Fórmulas!F387,Fórmulas!F387<=1.66)),2,IF(Fórmulas!F387>1.66,3,\"\")))),\"\")","v":""},{"$f":"IF(H343>0,(IF(OR(Fórmulas!G387=0.83,Fórmulas!G387<0.83),1,IF(OR(AND(0.83<Fórmulas!G387,Fórmulas!G387<=1.66)),2,IF(Fórmulas!G387>1.66,3,\"\")))),\"\")","v":""}]
[null,"EIQ Impacto ao trabalhador rural (<  80; 80 - 128; > 128)",null,{"$f":"IF(D$343>0,(HLOOKUP(D$340,'Base de dados'!$B$5:$AIN$18,$I354,0)),\"\")","v":""},{"$f":"IF(E$343>0,(HLOOKUP(E$340,'Base de dados'!$B$5:$AIN$18,$I354,0)),\"\")","v":""},{"$f":"IF(F$343>0,(HLOOKUP(F$340,'Base de dados'!$B$5:$AIN$18,$I354,0)),\"\")","v":""},null,null,12]
[null,"EIQ Impacto ao consumidor (< 20,5; 20,5 - 36,25; > 36,25)",null,{"$f":"IF(D$343>0,(HLOOKUP(D$340,'Base de dados'!$B$5:$AIN$18,$I355,0)),\"\")","v":""},{"$f":"IF(E$343>0,(HLOOKUP(E$340,'Base de dados'!$B$5:$AIN$18,$I355,0)),\"\")","v":""},{"$f":"IF(F$343>0,(HLOOKUP(F$340,'Base de dados'!$B$5:$AIN$18,$I355,0)),\"\")","v":""},null,null,13]
[null,"EIQ Impacto ao meio ambiente (< 75; 75 - 136,5; > 136,5)",null,{"$f":"IF(D$343>0,(HLOOKUP(D$340,'Base de dados'!$B$5:$AIN$18,$I356,0)),\"\")","v":""},{"$f":"IF(E$343>0,(HLOOKUP(E$340,'Base de dados'!$B$5:$AIN$18,$I356,0)),\"\")","v":""},{"$f":"IF(F$343>0,(HLOOKUP(F$340,'Base de dados'!$B$5:$AIN$18,$I356,0)),\"\")","v":""},null,null,14]
[null,"Environmental Impact Quotient (EIQ) (<58,33; 58,33 - 94,46; > 94,46)",null,{"$f":"IF(D$343>0,(HLOOKUP(D$340,'Base de dados'!$B$5:$AIN$18,$I357,0)),\"\")","v":""},{"$f":"IF(E$343>0,(HLOOKUP(E$340,'Base de dados'!$B$5:$AIN$18,$I357,0)),\"\")","v":""},{"$f":"IF(F$343>0,(HLOOKUP(F$340,'Base de dados'!$B$5:$AIN$18,$I357,0)),\"\")","v":""},null,null,11]
[null,"Pesticidas banidos na União Européia - EU (2022) (X)",null,{"$f":"IF(D$343>0,(HLOOKUP(D$340,'Base de dados'!$B$5:$AIN$19,$I358,0)),\"\")","v":""},{"$f":"IF(E$343>0,(HLOOKUP(E$340,'Base de dados'!$B$5:$AIN$19,$I358,0)),\"\")","v":""},{"$f":"IF(F$343>0,(HLOOKUP(F$340,'Base de dados'!$B$5:$AIN$19,$I358,0)),\"\")","v":""},null,null,15]
[]
[null,"13.2 Vulnerabilidade ambiental do talhão",null,"Escolha uma opção (1, 2 or 3)\t"]
[null,"Teor de argila no solo                                                              > 60% (1); 30% - 60% (2); <30% (3)\t"]
[null,"Distância do curso d'água (a partir da borda do talhão)                          >1.000m (1);  300 - 1.000m (2);  <300m (3)\t"]
[null,"Tipo de manejo do solo: Sistema plantio direto (1); Cultivo mínimo (2); Revolvimento do solo (3)\t"]
[null,"Vulnerabilidade do talhão (1, 2 ou 3)\t",null,{"$f":"IF(D344>0,(IF(OR(AND(1<=Fórmulas!C388,Fórmulas!C388<=3)),1,IF(OR(AND(3<Fórmulas!C388,Fórmulas!C388<=9)),2,IF(Fórmulas!C388>9,3)))),\"\")","v":""},{"$f":"IF(E344>0,(IF(OR(AND(1<=Fórmulas!D388,Fórmulas!D388<=3)),1,IF(OR(AND(3<Fórmulas!D388,Fórmulas!D388<=9)),2,IF(Fórmulas!D388>9,3)))),\"\")","v":""},{"$f":"IF(F344>0,(IF(OR(AND(1<=Fórmulas!E388,Fórmulas!E388<=3)),1,IF(OR(AND(3<Fórmulas!E388,Fórmulas!E388<=9)),2,IF(Fórmulas!E388>9,3)))),\"\")","v":""},{"$f":"IF(G344>0,(IF(OR(AND(1<=Fórmulas!F388,Fórmulas!F388<=3)),1,IF(OR(AND(3<Fórmulas!F388,Fórmulas!F388<=9)),2,IF(Fórmulas!F388>9,3)))),\"\")","v":""},{"$f":"IF(H344>0,(IF(OR(AND(1<=Fórmulas!G388,Fórmulas!G388<=3)),1,IF(OR(AND(3<Fórmulas!G388,Fórmulas!G388<=9)),2,IF(Fórmulas!G388>9,3)))),\"\")","v":""}]
[null,"Risco de contaminação (1 (baixo), 2 (médio) or 3 (alto)",null,{"$f":"IF(D344>0,(IF(OR(AND(1<=Fórmulas!C390,Fórmulas!C390<=2)),1,IF(OR(AND(2<Fórmulas!C390,Fórmulas!C390<=4)),2,IF(Fórmulas!C390>4,3)))),\"\")","v":""},{"$f":"IF(E344>0,(IF(OR(AND(1<=Fórmulas!D390,Fórmulas!D390<=2)),1,IF(OR(AND(2<Fórmulas!D390,Fórmulas!D390<=4)),2,IF(Fórmulas!D390>4,3)))),\"\")","v":""},{"$f":"IF(F344>0,(IF(OR(AND(1<=Fórmulas!E390,Fórmulas!E390<=2)),1,IF(OR(AND(2<Fórmulas!E390,Fórmulas!E390<=4)),2,IF(Fórmulas!E390>4,3)))),\"\")","v":""},{"$f":"IF(G344>0,(IF(OR(AND(1<=Fórmulas!F390,Fórmulas!F390<=2)),1,IF(OR(AND(2<Fórmulas!F390,Fórmulas!F390<=4)),2,IF(Fórmulas!F390>4,3)))),\"\")","v":""},{"$f":"IF(H344>0,(IF(OR(AND(1<=Fórmulas!G390,Fórmulas!G390<=2)),1,IF(OR(AND(2<Fórmulas!G390,Fórmulas!G390<=4)),2,IF(Fórmulas!G390>4,3)))),\"\")","v":""}]
[]
[null,"13.3 Risco de contaminação"]
[null,"Descrição do cultivo\t",null,{"$f":"D342","v":0}]
[null,"Área (ha)",null,{"$f":"D343","v":{"v":0,"d":"0.0"}}]
[null,"Risco máximo identificado (1 - baixo), (2 - médio) or (3 - alto)",null,{"$f":"MAX(D365:F365,Fórmulas!D437:L437,Fórmulas!D466:L466,Fórmulas!D494:I494)","v":0}]
[null,"Resultado Parcial",{"$f":"IF(D343=0,1,Fórmulas!D499)","v":{"v":1,"d":"1.00"}},"Referència: Chaves (2010); Kovach et al. (1992)"]
[]
[null,"13.4 Segurança do trabalho referente ao uso de pesticidas",null,null,"Número de pessoas","Fator de ponderação"]
[null,"Número de pessoas que aplicam ou manuseiam agrotóxicos\t\t",{"$nulls":3},{"v":1,"d":"1.0"}]
[null,"Número de pessoas que utilizam EPI conforme as normas de segurança\t\t\t\t",{"$nulls":3},{"v":1,"d":"1.0"}]
[{"$nulls":4},"Escolha uma opção\t"]
[null,"Armazenamento adequado das embalagens\t\t",{"$nulls":3},{"v":1,"d":"1.0"},"Sim"]
[null,"Devolução das embalagens de agrotóxicos\t\t",{"$nulls":3},{"v":1,"d":"1.0"},"Não"]
[]
[null,"Resultado Parcial",{"$f":"Fórmulas!G511","v":{"v":0.7,"d":"0.70"}},"Adaptação APOIA-NovoRural (Rodrigues et al, 2010)."]
[]
[null,"Resultado",{"$f":"(C371+C380)/2","v":0.85}]
[]
[14,"CONSERVAÇÃO DO SOLO E ÁGUA"]
[]
[null,null,"Área (ha)","Lavoura Permanente                ","Lavoura temporária","Pastagens","Silvicultura","Fator de ponderação"]
[{"$nulls":3},{"$f":"+'1 Questionário'!D86","v":0},{"$f":"+'1 Questionário'!D87","v":0},{"$f":"+'1 Questionário'!D88","v":0},{"$f":"+'1 Questionário'!D89","v":0}]
[null,"14.1 Grau de adoção de práticas para a conservação dos solos\n","Alto",{"$nulls":4},{"v":1,"d":"1.0"}]
[null,null,"Moderado",{"$nulls":4},0.6]
[null,null,"Incipiente",{"$nulls":4},0.3]
[null,null,"Situação crítica*",{"$nulls":4},0.1]
[null,"*Situação crítica (solo/água) - especificar"]
[{"$nulls":5},"Verificação (Uso da terra) =>",null,{"$f":"SUM(D388:G391)/('1 Questionário'!D86+'1 Questionário'!D87+'1 Questionário'!D88+'1 Questionário'!D89)","v":{"$error":"#DIV/0!"}}]
[{"$nulls":3},"Escolha uma opção  ","Fator de ponderação"]
[null,"14.2 Estratégias conservação/reservação - águas \t\n",null,null,{"v":1,"d":"1.0"},"Suficiente"]
[{"$nulls":4},0.4,"Insuficiente"]
[{"$nulls":4},0.1,"Situação crítica"]
[null,"Resultado",{"$f":"IF(Fórmulas!F523=0,\"\",(((Fórmulas!E523*2)+Fórmulas!F523)/3))","v":""},"Adaptação APOIA-NovoRural (Rodrigues et al, 2010)."]
[]
[15,"CONSERVAÇÃO DA BIODIVERSIDADE"]
[]
[null,null,"Area (ha)","Lavoura Permanente                ","Lavoura temporária","Pastagens","Silvicultura","Fator de ponderação"]
[{"$nulls":3},{"$f":"+D387","v":0},{"$f":"+E387","v":0},{"$f":"+F387","v":0},{"$f":"+G387","v":0}]
[null,"15.1 Grau de adoção de práticas que auxiliam na biodiversidade*\n\n","Alto",{"$nulls":4},{"v":1,"d":"1.0"}]
[null,null,"Moderado",{"$nulls":4},0.6]
[null,null,"Incipiente",{"$nulls":4},0.3]
[null,null,"Situação crítica**",{"$nulls":4},0.1]
[null,"Situação crítica (biodiversidade) - especificar"]
[null,"*Culturas intercalares, consórcio, rotações, integração, adubação verde; barreiras vegetais; arborização\t\t\t\t",{"$nulls":3},"Verification (Land Use) =>",null,{"$f":"SUM(D404:G407)/('1 Questionário'!D86+'1 Questionário'!D87+'1 Questionário'!D88+'1 Questionário'!D89)","v":{"$error":"#DIV/0!"}}]
[null,"** Uso de fogo em pastagens ou nas palhadas; áreas sem nenhuma cobertura vegetal; sucessões com a mesma cultura.\t\t\t\t\t\t"]
[null,"Resultado parcial",{"$f":"(Fórmulas!M529*Fórmulas!C529)+(Fórmulas!M530*Fórmulas!C530)+(Fórmulas!M531*Fórmulas!C531)+(Fórmulas!M532*Fórmulas!C532)","v":{"$error":"#DIV/0!"}}]
[]
[null,"15.2 Índice Shannon-Wiener (áreas produtivas e vegetação nativa)\t\t\t",null,null,{"$f":"Fórmulas!L549","v":{"$error":"#DIV/0!"}}]
[null,"Resultado parcial",{"$f":"Fórmulas!F544*(1-EXP((-Fórmulas!F545)*(E413*100)))","v":{"$error":"#DIV/0!"}}]
[{"$nulls":5},"Escolha uma opção  "]
[null,"15.3 Ocorrência de alta proporção (> 70% do perímetro) de monocultivos limítrofes ao imóvel rural  \t\t\t\t\t\t\t"]
[]
[null,"Resultado",{"$f":"IF(F416=\"Sim\",((((C411*3)+(C414*2))/5)*0.9),(((C411*3)+(C414*2))/5))","v":{"$error":"#DIV/0!"}},"Adaptação APOIA-NovoRural (Rodrigues et al, 2010)."]
[]
[16,"ESTADO DE CONSERVAÇÃO DOS HABITATS NATURAIS"]
[{"$nulls":7},"Fator de ponderação"]
[null,null,"Fitofisionomias (selecione)"]
[null,"16.1 Estágios sucessionais da vegetação nativa\n\n","Estágio avançado (área ha)",{"$nulls":4},{"v":1,"d":"1.0"}]
[null,null,"Estágio médio (área ha)",{"$nulls":4},0.9]
[null,null,"Estágio inicial (área ha)",{"$nulls":4},0.7]
[null,"Resultado parcial",{"$f":"IF('1 Questionário'!I93=0,0,Fórmulas!C558)","v":{"v":0,"d":"0.00"}},"Área vegetação nativa",{"$f":"+'1 Questionário'!I93","v":{"v":0,"d":"0.00"}},null,"                                       Verificação  =>",{"$f":"SUM(Fórmulas!F555:F557)","v":{"v":0,"d":"0.0%"}}]
[{"$nulls":6},"Fator de ponderação","Fator de ponderação"]
[{"$nulls":5},"Unidade"]
[null,"16.2 Nº de fragmentos com vegetação nativa (no imóvel rural) \t\t\t",{"$nulls":5},{"v":1,"d":"1.0"}]
[null,"Resultado parcial",{"$f":"IF(F429=\"\",\"\",(Fórmulas!D566))","v":""}]
[{"$nulls":5},"Escolha uma opção  "]
[null,"16.3 Fragmento(s) tem conexão com a vegetação nativa de imóveis rurais vizinhos \t\t\t\t\t\t"]
[{"$nulls":5},"Escolha uma opção  "]
[null,"16.4 Fragmento(s) protegidos do pastoreio e do fogo (aceiros com manutenção anual) \t\t\t\t\t\t"]
[]
[null,"Resultado",{"$f":"IF(H426=0,0,(Fórmulas!B561))","v":{"v":0,"d":"0.00"}},"Adaptação APOIA-NovoRural (Rodrigues et al, 2010)."]
[]
[17,"ADEQUAÇÃO DAS ÁREAS DE PRESERVAÇÃO PERMANENTE (APPs) E RESERVA LEGAL (RL)",{"$nulls":5},"Fator de ponderação"]
[]
[null,"APPs",{"$nulls":4},"Unidade (ha)"]
[null,"17.1 Uso e ocupação do solo nas APPs","Área antropizada com uso consolidado passível de ser explorada + vegetação nativa\t\t\t\t",{"$nulls":3},{"$f":"+'1 Questionário'!I99","v":{"v":0,"d":"0.00"}},0.7]
[null,null,"Área com supressão vegetal com obrigação de recomposição da veg. nativa\t\t\t\t\t",{"$nulls":3},{"$f":"'1 Questionário'!D100","v":{"v":0,"d":"0.00"}},0.1]
[{"$nulls":5},"Soma =>",{"$f":"+G441+G442","v":{"v":0,"d":"0.00"}}]
[{"$nulls":6}," Unidade (%)"]
[null,"17.2 Proporção das APPs efetivamente protegidas e com bom estado de conservação (%) \t\t\t\t"]
[]
[null,"Resultado parcial",{"$f":"IF(G445=\"\",0,Fórmulas!F582)","v":{"v":0,"d":"0.00"}},"Adaptação APOIA-NovoRural (Rodrigues et al, 2010)."]
[]
[null,"RL"]
[null,"Área de Reserva Legal (ha)  =>\t",null,{"$f":"Fórmulas!M598","v":{"v":0,"d":"0.00"}},{"$f":"'1 Questionário'!E105","v":{"v":0,"d":"0%"}}]
[null,"Áreas de/para RL que necessitam de recomposição\t",null,{"$f":"+Fórmulas!L602","v":{"v":0,"d":"0.00"}}]
[null,{"$f":"'1 Questionário'!C106","v":{"v":0,"d":"0.00"}},{"$f":"'1 Questionário'!D106","v":{"v":0,"d":"0.00"}},{"$f":"'1 Questionário'!E106","v":{"v":0,"d":"0.00"}},null,"Unidade (ha)","Fator de ponderação"]
[null,"17.3 Adequação da RL \n\n","Vegetação nativa excedente à RL\t\t",null,null,{"$f":"+'1 Questionário'!E106","v":{"v":0,"d":"0.00"}},{"v":1,"d":"1.0"}]
[null,null,"Área de RL fora do imóvel rural*\t\t",{"$nulls":3},0.7]
[null,null,"Áreas de/para RL não passíveis de recomposição\t\t",null,null,{"$f":"IF('1 Questionário'!F72<4,'2 Indicadores'!D450,'1 Questionário'!D93)","v":{"v":0,"d":"0.00"}},0.7]
[null,null,"Áreas de/para RL que necessitam de recomposição\t\t\t",{"$nulls":3},0.1]
[{"$nulls":4},"Verificação =>",{"$f":"(F454+F455+F456)/D450","v":{"$error":"#DIV/0!"}}]
[null,"Resultado parcial",{"$f":"IF(F457<0.99,\"\",Fórmulas!F592)","v":{"$error":"#DIV/0!"}},"Adaptação APOIA-NovoRural (Rodrigues et al, 2010)."]
[]
[null,"Resultado",{"$f":"IF(AND(C447=0.7,C458=1),1,((C447+C458)/2))","v":{"$error":"#DIV/0!"}}]

{"sheet":"3 Relatório","index":3,"n_rows":85,"n_cols":20,"rows_kept":85,"merged":[[0,0,1,2],[0,3,1,4],[64,16,64,18],[68,12,75,12],[76,12,84,12]]}
["ISA",null,null,"RELATÓRIO"]
[]
[{"$nulls":5},"Data de aplicação",null,{"$f":"IF('1 Questionário'!C34=\"\",\"\",'1 Questionário'!C34)","v":""}]
[null,"ÍNDICE FINAL",null,{"$f":"'3 Relatório'!Q68","v":""},null,"Descrição do Imóvel rural",null,{"$f":"'1 Questionário'!D70","v":0}]
[null,"Desvio padrão",null,{"$f":"STDEV(Q69:Q85)","v":{"$error":"#DIV/0!"}},null,"Área (ha)",null,{"$f":"'1 Questionário'!D72","v":{"v":0,"d":"0.0"}}]
{"$rows_empty":17}
[null,null,"Uso e ocupação do solo",{"$nulls":4},"Uso e ocupação do solo"]
[{"$nulls":7},"APPs (% área total)",null,null,{"$f":"'1 Questionário'!E99","v":{"v":0,"d":"0.0%"}}]
[{"$nulls":7},"Área a ser recuperada - APPs (% área total)",null,null,{"$f":"Fórmulas!G604","v":{"$error":"#DIV/0!"}}]
[{"$nulls":7},"Área a ser recuperada - APPs (ha)",null,null,{"$f":"'1 Questionário'!D100","v":0}]
[{"$nulls":7},"Área com vegetação nativa excedente a RL(ha)",null,null,{"$f":"'1 Questionário'!E106","v":0}]
[{"$nulls":7},"Nº de fragmentos com vegetação nativa",null,null,{"$f":"+'2 Indicadores'!F429","v":0}]
[{"$nulls":7},"Nº de cursos d'água",null,null,{"$f":"'1 Questionário'!E110","v":0}]
[{"$nulls":7},"Nº de nascentes",null,null,{"$f":"'1 Questionário'!E111","v":0}]
[{"$nulls":7},"Nº de lagos e lagoas naturais",null,null,{"$f":"'1 Questionário'!E112","v":0}]
[{"$nulls":7},"Nº de represas",null,null,{"$f":"'1 Questionário'!E113","v":0}]
[{"$nulls":7},"Área com irrigação (ha)",null,null,{"$f":"+'2 Indicadores'!C77","v":0}]
[]
[{"$nulls":7},"Problemas com abastecimento de água",null,null,{"$f":"IF('1 Questionário'!E121=\"x\",\"Sim\",\"Não\")","v":"Não"}]
[]
[]
[null,"Fertilidade do solo",{"$nulls":5},"Gestão"]
[null,"Matéria orgânica do solo (dag kg-1)",null,null,{"$f":"'2 Indicadores'!C243","v":{"v":0,"d":"0.0"}},null,null,"Renda bruta (R$/ano)",null,null,{"$f":"+K42/('1 Questionário'!D72+'1 Questionário'!D81)","v":{"$error":"#DIV/0!"}}]
[null,"Fósforo (mg dm-3)",null,null,{"$f":"'2 Indicadores'!C244","v":{"v":0,"d":"0.0"}},null,null,"Débitos / estimativa patrimonial",null,null,{"$f":"'2 Indicadores'!E111","v":{"$error":"#DIV/0!"}}]
[null,"Cálcio (cmolc dm-3)",null,null,{"$f":"'2 Indicadores'!C245","v":{"v":0,"d":"0.0"}},null,null,"Receita bruta anual / estimativa patrimonial",null,null,{"$f":"K42/'2 Indicadores'!C95","v":{"$error":"#DIV/0!"}}]
[null,"Magnésio (cmolc dm-3)",null,null,{"$f":"'2 Indicadores'!C246","v":{"v":0,"d":"0.0"}},null,null,"Receita bruta (R$/ano)",null,null,{"$f":"SUM('2 Indicadores'!D9:D11)+SUM('2 Indicadores'!D28:E30)","v":{"$error":"#DIV/0!"}}]
[null,"Potássio (mg dm-3)",null,null,{"$f":"'2 Indicadores'!C247","v":{"v":0,"d":"0.0"}},null,null,"Proporção principal atividade / receita bruta",null,null,{"$f":"+'2 Indicadores'!E9","v":{"$error":"#DIV/0!"}}]
[null,"Acidez ativa (pH)",null,null,{"$f":"'2 Indicadores'!C248","v":{"v":0,"d":"0.0"}}]
[null,"Alumínio (cmolc dm-3)",null,null,{"$f":"'2 Indicadores'!C249","v":{"v":0,"d":"0.0"}},null,null,"Média anual evolução patrimonial total (%)",null,null,{"$f":"'2 Indicadores'!F105","v":{"$error":"#DIV/0!"}}]
[null,"CTC (cmolc dm-3)",null,null,{"$f":"'2 Indicadores'!C250","v":{"v":0,"d":"0.0"}},null,null,"Média anual evol. Pat. (s/ valor. da terra) (%)",null,null,{"$f":"'2 Indicadores'!F106","v":{"$error":"#DIV/0!"}}]
[null,"Saturação por bases (%)",null,null,{"$f":"'2 Indicadores'!C251","v":{"v":0,"d":"0.0"}}]
[null,"K/CTC (%) (referência 3 - 5%)",null,null,{"$f":"IF(E43>0,((E43/1000*2.5577)/E46*100),\"\")","v":""},null,null,"Participação da mulher na gestão",null,null,{"$f":"'1 Questionário'!D66","v":{"v":0,"d":"0.0%"}}]
[null,"Ca/CTC (%) (referência 40 - 60%)",null,null,{"$f":"IF(E41>0,E41/E46*100,\"\")","v":""},null,null,"Processo sucessório",null,null,{"$f":"'1 Questionário'!D64","v":{"v":0,"d":"0.0%"}}]
[null,"Mg/CTC (%) (referência 10 - 20%)",null,null,{"$f":"IF(E42>0,E42/E46*100,\"\")","v":""}]
[{"$nulls":7},"Qte de agrotóxicos / área cultivada (L/ha/ano)",null,null,{"$f":"Fórmulas!D503","v":""}]
[null,"Produtividade",{"$nulls":5},"Volume anual de pesticidas (L)\t",null,null,{"$f":"Fórmulas!D500","v":""}]
[null,"Descrição da cultura",null,null,{"$f":"'2 Indicadores'!D15","v":{"v":0,"d":"0.0%"}},null,null,"Índice Final EIQ cumulativo (agrotóxicos)",null,null,{"$f":"SUM('2 Indicadores'!D357:F357,Fórmulas!D429:L429,Fórmulas!D458:L458,Fórmulas!D486:I486)","v":0}]
[null,"Unidade",null,null,{"$f":"'2 Indicadores'!D16","v":0}]
[null,"Produtividade",null,null,{"$f":"'2 Indicadores'!D17","v":0},null,null,"Biologia do solo"]
[{"$nulls":7},"Arilsulfatase (mg p-nitrofenol kg-1 h-1)",null,null,{"$f":"IF('2 Indicadores'!C255=\"\",\"\",'2 Indicadores'!C255)","v":""}]
[null,"Erosão do solo",{"$nulls":5},"ß-glicosidase (mg p-nitrofenol kg-1 h-1)",null,null,{"$f":"IF('2 Indicadores'!C256=\"\",\"\",'2 Indicadores'!C256)","v":""}]
[null,"Erosão do solo - área",null,null,{"$f":"'2 Indicadores'!E270","v":0},null,null,"IQS biológico",null,null,{"$f":"IF('2 Indicadores'!C258=\"\",\"\",'2 Indicadores'!C258)","v":""}]
[null,"Erosão do solo - intensidade",null,null,{"$f":"'2 Indicadores'!D270","v":0},null,null,"IQS química do solo",null,null,{"$f":"IF('2 Indicadores'!C261=\"\",\"\",'2 Indicadores'!C261)","v":""}]
[null,"Erosão do solo - comportamento (tendência)",null,null,{"$f":"'2 Indicadores'!D273","v":0},null,null,"IQS Fertbio",null,null,{"$f":"IF('2 Indicadores'!C262=\"\",\"\",'2 Indicadores'!C262)","v":""}]
[]
[null,"Descrição técnicas inovadoras adotadas",null,null,{"$f":"IF('2 Indicadores'!E210=\"\",\"\",'2 Indicadores'!E210)","v":""}]
[]
[]
[{"$nulls":16},"DATA"]
[{"$nulls":16},{"$f":"H3","v":""}]
[{"$nulls":13},"Desvio Padrão",null,{"$f":"STDEV(Q69:Q78,Q79:Q85)","v":{"$error":"#DIV/0!"}},"Atual","Histórico I","Histórico II"]
[{"$nulls":13},"Índice de sustentabilidade",null,null,{"$f":"IF(Q69>0,AVERAGE(Q69:Q85),\"\")","v":""},{"$f":"IF(R69>0,AVERAGE(R69:R85),\"\")","v":{"v":0.6207988730786138,"d":"0.62"}},{"$f":"IF(S69>0,AVERAGE(S69:S85),\"\")","v":{"v":0.5394117647058824,"d":"0.54"}}]
[{"$nulls":12},"Aspectos socioeconômicos","1.Produtividade e Preços de Venda",null,null,{"$f":"'2 Indicadores'!C22","v":{"v":0,"d":"0.00"}},0.75,0.63,0.7]
[{"$nulls":13},"2.Diversificação de Renda",null,null,{"$f":"'2 Indicadores'!C45","v":{"$error":"#DIV/0!"}},{"v":0.6205673489790091,"d":"0.62"},{"v":0.6,"d":"0.60"},0.7]
[{"$nulls":13},"3.Evolução Patrimonial e Endividamento",null,null,{"$f":"'2 Indicadores'!C115","v":{"$error":"#DIV/0!"}},{"v":0.8484019226384294,"d":"0.85"},{"v":0.7,"d":"0.70"},0.7]
[{"$nulls":13},"4.Serviços e Infraestrutura Públicos",null,null,{"$f":"'2 Indicadores'!C113","v":{"$error":"#DIV/0!"}},{"v":0.7777777777777778,"d":"0.78"},{"v":0.8,"d":"0.80"},0.7]
[{"$nulls":13},"5.Educação e Capacitação",null,null,{"$f":"'2 Indicadores'!C164","v":{"$error":"#DIV/0!"}},0.71,{"v":0.6,"d":"0.60"},0.7]
[{"$nulls":13},"6.Qualidade do Emprego",null,null,{"$f":"'2 Indicadores'!C186","v":{"v":0.7,"d":"0.70"}},{"v":0.7,"d":"0.70"},{"v":0.5,"d":"0.50"},0.7]
[{"$nulls":13},"7.Gestão do Empreendimento",null,null,{"$f":"'2 Indicadores'!C200","v":{"v":0,"d":"0.00"}},{"v":0.6857142857142858,"d":"0.69"},{"v":0.4,"d":"0.40"},0.7]
[{"$nulls":13},"8.Comercialização e Inovação",null,null,{"$f":"'2 Indicadores'!C218","v":{"v":0,"d":"0.00"}},{"v":0.7,"d":"0.70"},{"v":0.5,"d":"0.50"},0.7]
[{"$nulls":12},"Aspectos ambientais","9.Gerenciamento de Resíduos",null,null,{"$f":"'2 Indicadores'!C236","v":{"v":0.7,"d":"0.70"}},0.11,0.13,0.7]
[{"$nulls":13},"10.Fertilidade do solo",null,null,{"$f":"'2 Indicadores'!C265","v":{"v":0,"d":"0.00"}},{"v":0.5424491666666666,"d":"0.54"},0.48,0.7]
[{"$nulls":13},"11.Erosão do solo e Manutenção das Estradas",null,null,{"$f":"'2 Indicadores'!C289","v":0.35},0.44,0.37,0.7]
[{"$nulls":13},"12.Qualidade da água",null,null,{"$f":"'2 Indicadores'!C336","v":{"v":0,"d":"0.00"}},{"v":0.663655890003716,"d":"0.66"},0.54,0.7]
[{"$nulls":13},"13.Risco de Contaminação da Água e  Pesticidas",null,null,{"$f":"'2 Indicadores'!C382","v":0.85},0.29,0.48,0.7]
[{"$nulls":13},"14.Conservação do Solo e da Água",null,null,{"$f":"'2 Indicadores'!C398","v":""},{"v":0.631638418079096,"d":"0.63"},{"v":0.5,"d":"0.50"},0.7]
[{"$nulls":13},"15.Conservação da Biodiversidade",null,null,{"$f":"'2 Indicadores'!C418","v":{"$error":"#DIV/0!"}},{"v":0.7533760324774537,"d":"0.75"},{"v":0.6,"d":"0.60"},0.7]
[{"$nulls":13},"16.Estado de Conservação dos Habitats Naturais",null,null,{"$f":"'2 Indicadores'!C436","v":{"v":0,"d":"0.00"}},0.75,{"v":0.6,"d":"0.60"},0.7]
[{"$nulls":13},"17. Áreas de Preservação",null,null,{"$f":"'2 Indicadores'!C460","v":{"$error":"#DIV/0!"}},0.58,0.74,0.7]

{"sheet":"4 Plano de adequação","index":4,"n_rows":31,"n_cols":5,"rows_kept":31,"merged":[[0,3,1,3]]}
[{"$nulls":3},"PLANO DE ADEQUAÇÃO"]
[null,"ISA"]
[]
[]
[null,"PRODUTOR(A)",null,{"$f":"IF('1 Questionário'!C44=\"\",\"\",'1 Questionário'!C44)","v":""}]
[null,"MUNICÍPIO",null,{"$f":"IF('1 Questionário'!C54=\"\",\"\",'1 Questionário'!C54)","v":""}]
[null,"DATA DA APLICAÇÃO",null,{"$f":"IF('1 Questionário'!C34=\"\",\"\",'1 Questionário'!C34)","v":""}]
[]
[null,"TECHNICAL REGISTRATION",null,{"$f":"IF('1 Questionário'!C38=\"\",\"\",'1 Questionário'!C38)","v":""}]
[]
[null,"ITEM","ÍNDICE","PROPOSIÇÕES","PERÍODO DE EXECUÇÃO"]
[null,{"$f":"'3 Relatório'!N69","v":"1.Produtividade e Preços de Venda"},{"$f":"'3 Relatório'!Q69","v":{"v":0,"d":"0.00"}}]
[null,{"$f":"'3 Relatório'!N78","v":"10.Fertilidade do solo"},{"$f":"'3 Relatório'!Q78","v":{"v":0,"d":"0.00"}}]
[null,{"$f":"'3 Relatório'!N79","v":"11.Erosão do solo e Manutenção das Estradas"},{"$f":"'3 Relatório'!Q79","v":0.35}]
[null,{"$f":"'3 Relatório'!N80","v":"12.Qualidade da água"},{"$f":"'3 Relatório'!Q80","v":{"v":0,"d":"0.00"}}]
[null,{"$f":"'3 Relatório'!N81","v":"13.Risco de Contaminação da Água e  Pesticidas"},{"$f":"'3 Relatório'!Q81","v":0.85}]
[null,{"$f":"'3 Relatório'!N82","v":"14.Conservação do Solo e da Água"},{"$f":"'3 Relatório'!Q82","v":""}]
[null,{"$f":"'3 Relatório'!N83","v":"15.Conservação da Biodiversidade"},{"$f":"'3 Relatório'!Q83","v":{"$error":"#DIV/0!"}}]
[null,{"$f":"'3 Relatório'!N84","v":"16.Estado de Conservação dos Habitats Naturais"},{"$f":"'3 Relatório'!Q84","v":{"v":0,"d":"0.00"}}]
[null,{"$f":"'3 Relatório'!N85","v":"17. Áreas de Preservação"},{"$f":"'3 Relatório'!Q85","v":{"$error":"#DIV/0!"}}]
[null,{"$f":"'3 Relatório'!N70","v":"2.Diversificação de Renda"},{"$f":"'3 Relatório'!Q70","v":{"$error":"#DIV/0!"}}]
[null,{"$f":"'3 Relatório'!N71","v":"3.Evolução Patrimonial e Endividamento"},{"$f":"'3 Relatório'!Q71","v":{"$error":"#DIV/0!"}}]
[null,{"$f":"'3 Relatório'!N72","v":"4.Serviços e Infraestrutura Públicos"},{"$f":"'3 Relatório'!Q72","v":{"$error":"#DIV/0!"}}]
[null,{"$f":"'3 Relatório'!N73","v":"5.Educação e Capacitação"},{"$f":"'3 Relatório'!Q73","v":{"$error":"#DIV/0!"}}]
[null,{"$f":"'3 Relatório'!N74","v":"6.Qualidade do Emprego"},{"$f":"'3 Relatório'!Q74","v":{"v":0.7,"d":"0.70"}}]
[null,{"$f":"'3 Relatório'!N75","v":"7.Gestão do Empreendimento"},{"$f":"'3 Relatório'!Q75","v":{"v":0,"d":"0.00"}}]
[null,{"$f":"'3 Relatório'!N76","v":"8.Comercialização e Inovação"},{"$f":"'3 Relatório'!Q76","v":{"v":0,"d":"0.00"}}]
[null,{"$f":"'3 Relatório'!N77","v":"9.Gerenciamento de Resíduos"},{"$f":"'3 Relatório'!Q77","v":{"v":0.7,"d":"0.70"}}]
[null,"Licenciamento ambiental",{"$f":"'1 Questionário'!E129","v":{"v":0,"d":"0.00"}}]
[null,"Regularização do uso da água",{"$f":"'1 Questionário'!E127","v":{"v":0,"d":"0.00"}}]
[null,"Regularização RL e APP",{"$f":"'1 Questionário'!E131","v":{"v":0,"d":"0.00"}}]

{"sheet":"Plan1","index":5,"n_rows":0,"n_cols":0,"rows_kept":0,"hidden":true}

{"sheet":"Sheet3","index":6,"n_rows":0,"n_cols":0,"rows_kept":0,"hidden":true}

{"sheet":"Sheet4","index":7,"n_rows":0,"n_cols":0,"rows_kept":0,"hidden":true}

{"sheet":"Sheet5","index":8,"n_rows":0,"n_cols":0,"rows_kept":0,"hidden":true}

{"sheet":"Sheet6","index":9,"n_rows":0,"n_cols":0,"rows_kept":0,"hidden":true}

{"sheet":"Relatório de Assist (2)","index":10,"n_rows":48,"n_cols":19,"rows_kept":48,"hidden":true,"merged":[[0,11,0,16],[4,6,4,13],[4,15,4,16],[5,5,5,9],[5,12,5,16],[7,8,7,16],[8,8,8,16],[10,2,37,15],[38,2,38,15],[39,2,39,15],[40,2,40,15],[42,1,42,16],[45,2,45,4],[45,6,45,9],[45,11,45,15],[46,2,46,4],[46,11,46,15]]}
[{"$nulls":11},"RELATÓRIO DE ASSISTÊNCIA   TÉCNICA AO PRODUTOR RURAL ",{"$nulls":5},{"$f":"C9","v":"Visita N°"},{"$f":"D9","v":1}]
[]
[{"$nulls":10}," Formulário atualizado em: UPEC–05/01/2012"]
[]
[null,"  Produtor:",{"$nulls":12},"CPF:"]
[null,"  Município:",{"$nulls":8},"Comunidade:"]
[null,"  Convênio: ",{"$nulls":7}," META:",null," Nº Convênio:"]
[null,"  Nome  do Técnico / Matrícula:"]
[null,null,"Visita N°",1]
[{"$nulls":6},"ORIENTAÇÃO TÉCNICA (Situação Atual, Orientações e Recomendações) "]
{"$rows_empty":32}
[null,"Assinaturas"]
[]
[]
[]
[null,null,"Data",{"$nulls":5},"Técnico Responsável / Nº Conselho",null,null," Produtor"]
[null,"MOD.230-07 E MAPA/EMBRAPA",{"$nulls":9}," Formulário atualizado em: UPEC–13/03/2013"]

{"sheet":"Fórmulas","index":11,"n_rows":605,"n_cols":14,"rows_kept":605,"merged":[[0,1,1,2],[0,3,1,5],[3,1,3,12],[5,1,5,3],[5,5,5,7],[6,1,6,2],[6,5,7,7],[7,1,8,2],[7,3,8,3],[9,1,9,2],[10,1,10,2],[18,7,19,7],[19,1,20,1],[19,2,19,3],[20,2,20,3],[30,1,30,2],[30,5,30,7],[37,1,37,2],[37,5,37,8],[49,1,49,2],[49,4,49,5],[49,8,49,9],[50,1,50,2],[50,4,50,5],[50,8,50,9],[51,1,51,2],[51,4,51,5],[51,8,51,9],[52,1,52,2],[52,4,52,5],[52,8,52,9],[53,1,53,2],[53,4,53,5],[53,8,53,9],[54,1,54,2],[54,4,54,5],[54,8,54,9],[55,4,55,5],[56,1,56,2],[56,4,56,5],[56,9,56,10],[58,9,58,10],[59,9,59,10],[60,9,60,10],[61,9,61,10],[62,9,62,10],[63,9,63,10],[64,9,64,10],[64,11,64,12],[66,1,66,2],[66,5,66,8],[75,1,75,2],[75,5,75,8],[85,1,85,2],[85,5,85,8],[92,1,92,2],[92,5,92,10],[93,5,93,10],[102,1,102,2],[102,5,102,7],[103,5,104,7],[115,1,115,2],[126,1,126,2],[126,5,126,7],[133,1,133,2],[133,5,133,8],[153,1,153,5],[154,1,154,4],[154,5,155,5],[154,7,154,9],[155,7,155,8],[156,7,156,8],[157,7,157,8],[158,7,158,8],[162,1,162,10],[163,1,167,1],[163,2,163,3],[163,4,163,5],[163,6,167,6],[163,7,163,8],[163,9,163,10],[168,1,172,1],[168,4,168,5],[168,6,172,6],[168,7,168,8],[168,9,168,10],[175,1,175,5],[176,1,176,4],[176,5,177,5],[185,0,185,13],[186,0,189,0],[186,1,186,2],[186,3,186,4],[186,5,186,6],[186,7,189,7],[186,8,186,9],[186,10,186,11],[186,12,186,13],[190,0,193,0],[190,1,190,2],[190,3,190,4],[190,5,190,6],[190,7,193,7],[190,8,190,9],[190,10,190,11],[190,12,190,13],[198,1,198,2],[198,4,198,10],[199,7,199,8],[199,9,199,10],[208,1,208,2],[208,4,208,10],[209,7,209,8],[209,9,209,10],[217,1,217,2],[217,4,217,10],[218,7,218,8],[218,9,218,10],[226,1,226,2],[226,4,226,8],[234,1,234,2],[234,4,234,8],[242,1,242,2],[242,4,242,8],[250,1,250,2],[250,4,250,8],[251,4,251,5],[251,6,251,8],[283,1,283,2],[283,4,283,5],[296,4,298,11],[300,1,300,2],[300,4,300,9],[308,1,308,5],[308,6,308,9],[309,6,309,7],[309,8,309,9],[310,6,312,7],[310,8,312,9],[317,1,317,5],[317,6,317,9],[318,6,318,7],[318,8,318,9],[319,3,319,5],[319,6,323,7],[319,8,323,9],[326,1,326,5],[326,6,326,9],[327,1,327,2],[327,3,327,4],[327,6,327,7],[327,8,327,9],[328,1,328,2],[328,3,328,4],[328,6,331,7],[328,8,331,9],[329,1,329,2],[329,3,329,4],[334,1,334,5],[334,6,334,9],[335,1,335,2],[335,3,335,4],[335,6,335,7],[335,8,335,9],[336,1,336,2],[336,3,336,4],[336,6,338,7],[336,8,338,9],[337,1,337,2],[337,3,337,4],[341,1,341,5],[342,1,345,5],[347,1,347,3],[348,1,349,3],[351,1,351,2],[351,4,351,7],[352,4,352,7],[353,4,353,7],[358,1,358,2],[358,4,358,7],[359,4,359,5],[359,6,359,7],[360,4,363,5],[360,6,363,7],[365,1,365,2],[365,4,365,7],[366,4,366,5],[366,6,366,7],[367,4,371,5],[367,6,371,7],[373,1,373,3],[373,5,373,11],[374,1,375,3],[374,5,375,11],[377,1,377,2],[379,4,379,12],[384,1,384,13],[410,1,410,2],[411,1,411,2],[412,1,412,2],[413,1,413,2],[414,1,414,2],[415,1,415,2],[417,1,417,2],[418,1,418,2],[419,1,419,2],[420,1,420,2],[421,1,421,2],[422,1,422,2],[423,1,423,2],[424,1,424,2],[425,1,425,2],[426,1,426,2],[427,1,427,2],[428,1,428,2],[431,1,431,2],[432,1,432,2],[433,1,433,2],[434,1,434,2],[436,1,436,2],[439,1,439,2],[440,1,440,2],[441,1,441,2],[442,1,442,2],[443,1,443,2],[444,1,444,2],[446,1,446,2],[447,1,447,2],[448,1,448,2],[449,1,449,2],[450,1,450,2],[451,1,451,2],[452,1,452,2],[453,1,453,2],[454,1,454,2],[455,1,455,2],[456,1,456,2],[457,1,457,2],[460,1,460,2],[461,1,461,2],[462,1,462,2],[463,1,463,2],[465,1,465,2],[467,1,467,2],[468,1,468,2],[469,1,469,2],[470,1,470,2],[471,1,471,2],[472,1,472,2],[474,1,474,2],[475,1,475,2],[476,1,476,2],[477,1,477,2],[478,1,478,2],[479,1,479,2],[480,1,480,2],[481,1,481,2],[482,1,482,2],[483,1,483,2],[484,1,484,2],[485,1,485,2],[488,1,488,2],[489,1,489,2],[490,1,490,2],[491,1,491,2],[493,1,493,2],[495,1,495,2],[496,1,496,2],[497,1,497,2],[498,1,498,2],[499,1,499,2],[500,1,500,2],[501,1,501,2],[502,1,502,2],[507,1,507,2],[507,5,507,7],[508,5,509,7],[514,1,514,2],[514,4,514,8],[518,1,519,1],[518,2,519,2],[519,4,519,7],[527,1,527,2],[533,1,533,2],[537,7,537,8],[538,7,538,11],[540,5,540,6],[541,4,541,6],[545,5,545,6],[548,7,548,8],[551,1,551,6],[551,10,551,13],[552,1,553,6],[552,10,552,12],[553,10,553,12],[554,10,554,12],[557,10,557,13],[558,10,558,12],[559,10,559,12],[560,10,560,12],[561,10,561,12],[562,1,564,1],[562,2,564,2],[562,3,564,5],[562,10,562,12],[563,10,563,12],[564,10,564,12],[566,1,566,2],[568,1,569,11],[570,1,571,11],[572,1,573,11],[575,1,575,3],[575,4,575,5],[576,1,576,3],[576,4,576,5],[579,1,579,3],[579,5,579,8],[580,1,580,2],[581,1,581,2],[584,1,584,5],[587,1,587,3],[587,5,587,8],[588,1,588,2],[589,1,589,2],[590,1,590,2],[591,1,591,2],[592,1,592,3],[593,1,593,4],[600,1,600,4],[600,8,600,10],[601,1,601,4],[601,8,601,10],[602,1,602,4],[603,1,603,4],[604,1,604,4]]}
[null,"ISA",null,"FÓRMULAS"]
[]
[]
[null,"INDICADORES"]
[]
[1,"Fator de Ponderação\t\t",{"$nulls":3},"Fórmulas\t\t\t\t"]
[null,"> 20%",null,0.9,null,"Fórmula (R parcial) = Yo + ax",{"$nulls":3},"UNIDADES I",null,"UNIDADES II"]
[null,"produtividade ou preço de venda = a regional\t\n\t",null,0.7,{"$nulls":5},"Algodão",null,"Sc/ha"]
[{"$nulls":5},"yo",{"v":-0.3,"d":"-0.30"},null,null,"Arroz",null,"Ton./ha"]
[null,"< 20%",null,0.5,null,"a",0.01,null,null,"Avicultura",null,"Kg/ha"]
[null,"< 40%",null,0.3,null,{"$f":"IF(ISBLANK('2 Indicadores'!D17),\"\",(G9+G10*(100+(Fórmulas!E17*100))))","v":""},{"$f":"IF(ISBLANK('2 Indicadores'!E17),\"\",(G9+G10*(100+(Fórmulas!F17*100))))","v":""},{"$f":"IF(ISBLANK('2 Indicadores'!F17),\"\",(G9+G10*(100+(Fórmulas!G17*100))))","v":""},null,"Batata",null," @/ha/ano"]
[{"$nulls":5},{"$f":"IF(ISBLANK('2 Indicadores'!D18),\"\",(G9+G10*(100+(Fórmulas!E18*100))))","v":""},{"$f":"IF(ISBLANK('2 Indicadores'!E18),\"\",(G9+G10*(100+(Fórmulas!F18*100))))","v":""},{"$f":"IF(ISBLANK('2 Indicadores'!F18),\"\",(G9+G10*(100+(Fórmulas!G18*100))))","v":""},null,"Café",null,"L de leite/ha/ano"]
[{"$nulls":9},"Cana de açúcar",null,"L de leite/vaca/dia"]
[{"$nulls":5},{"$f":"AVERAGE(Fórmulas!E20:G21)","v":{"$error":"#DIV/0!"}},{"$nulls":3},"Floricultura",null,"Kg/dia"]
[{"$nulls":5},{"$f":"IF('3 Relatório'!K39<300,Fórmulas!F14*0.7,Fórmulas!F14)","v":{"$error":"#DIV/0!"}},{"$f":"IF(F15<0,0,F15)","v":{"$error":"#DIV/0!"}},null,null,"Fruticultura",null,"Kg de alimento/kg de carne produzida"]
[{"$nulls":9},"Grãos",null,"Leitões comercializados/porca/ano"]
[null,"Variação do item 1.3 em relação ao item 1.5",null,null,{"$f":"IF('2 Indicadores'!D17>0,(('2 Indicadores'!D17/'2 Indicadores'!D19)-1),\"\")","v":""},{"$f":"IF('2 Indicadores'!E17>0,(('2 Indicadores'!E17/'2 Indicadores'!E19)-1),\"\")","v":""},{"$f":"IF('2 Indicadores'!F17>0,(('2 Indicadores'!F17/'2 Indicadores'!F19)-1),\"\")","v":""},{"v":1,"d":"1.0"},null,"Hortaliças",null,"Ovos/galinha/ano"]
[null,"Variação do item 1.4 em relação ao item 1.6",null,null,{"$f":"IF('2 Indicadores'!D18>0,(('2 Indicadores'!D18/'2 Indicadores'!D20)-1),\"\")","v":""},{"$f":"IF('2 Indicadores'!E18>0,(('2 Indicadores'!E18/'2 Indicadores'!E20)-1),\"\")","v":""},{"$f":"IF('2 Indicadores'!F18>0,(('2 Indicadores'!F18/'2 Indicadores'!F20)-1),\"\")","v":""},{"v":1,"d":"1.0"},null,"Milho",null,"Conversão Alimentar/dúzia de ovos"]
[{"$nulls":4},{"v":1,"d":"1.0"},{"v":1,"d":"1.0"},{"v":1,"d":"1.0"},"Matriz de ponderação\t",null,"Óleo de palma",null,"Conversão Alimentar/Kg"]
[null,"Resultado parcial","Produtividade\t",null,{"$f":"IF(ISBLANK('2 Indicadores'!D17),\"\",IF(Fórmulas!F11>1,1,Fórmulas!F11))","v":""},{"$f":"IF(ISBLANK('2 Indicadores'!E17),\"\",IF(Fórmulas!G11>1,1,Fórmulas!G11))","v":""},{"$f":"IF(ISBLANK('2 Indicadores'!F17),\"\",IF(Fórmulas!H11>1,1,Fórmulas!H11))","v":""},null,null,"Outros",null,"Percentagem de postura"]
[null,null,"Preço de venda\t",null,{"$f":"IF(ISBLANK('2 Indicadores'!D18),\"\",IF(Fórmulas!F12>1,1,Fórmulas!F12))","v":""},{"$f":"IF(ISBLANK('2 Indicadores'!E18),\"\",IF(Fórmulas!G12>1,1,Fórmulas!G12))","v":""},{"$f":"IF(ISBLANK('2 Indicadores'!F18),\"\",IF(Fórmulas!H12>1,1,Fórmulas!H12))","v":""},null,null,"Ovos"]
[{"$nulls":9},"Pecuária"]
[{"$nulls":9},"Pecuária de corte"]
[{"$nulls":9},"Pecuária de leite"]
[{"$nulls":9},"Pisicultura"]
[{"$nulls":9},"Silvicultura"]
[{"$nulls":9},"Soja"]
[{"$nulls":9},"Suínocultura"]
[{"$nulls":9},"Trigo"]
[]
[2,"Fator de Ponderação\t\t",{"$nulls":3},"Fórmulas\t\t\t\t",{"$nulls":4},0.3]
[null,"item 2.3","1 - (F362 *0,3)",null,null,{"$f":"1-(('2 Indicadores'!F39^2*Fórmulas!K31)+('2 Indicadores'!F40^2*Fórmulas!K32)+('2 Indicadores'!F41^2*Fórmulas!K33)+('2 Indicadores'!F42^2*Fórmulas!K34))","v":{"$error":"#DIV/0!"}},{"$f":"IF(AND('2 Indicadores'!F39>80%,'2 Indicadores'!F43=\"sim\"),F32-10%,F32)","v":{"$error":"#DIV/0!"}},{"$f":"IF(Fórmulas!G32<0.1,0.1,Fórmulas!G32)","v":{"$error":"#DIV/0!"}},null,null,0.3]
[null,"item 2.3","1 - (F372 *0,3)",{"$nulls":7},{"v":1,"d":"1.0"}]
[null,"item 2.3","1 - (F382 *1)",{"$nulls":7},{"v":2,"d":"2.0"}]
[null,"item 2.3","1 - (F392 *2)"]
[]
[]
[3,"Fator de Ponderação\t\t",{"$nulls":3},"Fórmulas",{"$nulls":4},{"$f":"+Fórmulas!M38","v":{"$error":"#DIV/0!"}},null,{"$f":"(+(Fórmulas!E57-Fórmulas!J57)/('2 Indicadores'!C95-'2 Indicadores'!D95))","v":{"$error":"#DIV/0!"}}]
[null,"item 3.1",0.67,null,null,{"$f":"(Fórmulas!M38*'2 Indicadores'!G100+Fórmulas!M39*'2 Indicadores'!G101+Fórmulas!M40*'2 Indicadores'!G102+Fórmulas!M41*'2 Indicadores'!G103+Fórmulas!M42*'2 Indicadores'!G104)","v":{"$error":"#DIV/0!"}},{"$f":"IF('2 Indicadores'!F106>26%,F39*((1+('2 Indicadores'!F106-0.26))),F39)","v":{"$error":"#DIV/0!"}},{"$f":"IF('2 Indicadores'!F105>0,G39,1-(0.3-10*'2 Indicadores'!F105))","v":{"$error":"#DIV/0!"}},{"$f":"IF(H39<0,0,H39)","v":{"$error":"#DIV/0!"}},null,{"$f":"+Fórmulas!M39","v":{"$error":"#DIV/0!"}},null,{"$f":"('2 Indicadores'!$D$59-'2 Indicadores'!$E$59)/('2 Indicadores'!$C$95-'2 Indicadores'!$D$95)","v":{"$error":"#DIV/0!"}}]
[null,"item 3.2",{"v":1,"d":"1.00"},{"$nulls":7},{"$f":"+Fórmulas!M40","v":{"$error":"#DIV/0!"}},null,{"$f":"('2 Indicadores'!$D$67-'2 Indicadores'!$E$67)/('2 Indicadores'!$C$95-'2 Indicadores'!$D$95)","v":{"$error":"#DIV/0!"}}]
[null,"item 3.3",{"v":1,"d":"1.00"},{"$nulls":7},{"$f":"+Fórmulas!M41","v":{"$error":"#DIV/0!"}},null,{"$f":"('2 Indicadores'!$D$73-'2 Indicadores'!$F$73)/('2 Indicadores'!$C$95-'2 Indicadores'!$D$95)","v":{"$error":"#DIV/0!"}}]
[null,"item 3.4",{"v":1,"d":"1.00"}]
[null,"UNIDADES III",{"$nulls":10},{"$f":"M42+M41+M40+M39+M38","v":{"$error":"#DIV/0!"}}]
[null,"Aspersão",{"$nulls":7},"Verificação",{"$f":"SUM(Fórmulas!M38:M42)","v":{"$error":"#DIV/0!"}}]
[null,"Gotejamento/microaspersão"]
[null,"Pivô central"]
[null,"Outras categorias",null,"Item 3.2"]
[null,"Diversos tipos de irrigação",null,"Fórmula - VR(valor residual) = (1-T)N x VI, em que: T = taxa de depreciação; N = tempo (nº de anos); e VI = valor inicial"]
[{"$nulls":12},"UNIDADES IV"]
[null,"Categorias\t",null,"Ponderação","Valor total atual\t",null,"Área total","Ponderação","Valor histórico\t",null,"Área total (%)",null,"Estoque de grãos"]
[null,"Vegetação nativa e outros\t",null,{"v":1,"d":"1.00"},{"$f":"('2 Indicadores'!C92*D51)*G51*('3 Relatório'!$H$5)","v":{"$error":"#DIV/0!"}},null,{"$f":"'1 Questionário'!E90+'1 Questionário'!E91+'1 Questionário'!E92+'1 Questionário'!E93+'1 Questionário'!E94","v":{"$error":"#DIV/0!"}},{"$f":"+D51","v":{"v":1,"d":"1.00"}},{"$f":"(K51*H51)*'2 Indicadores'!D89*'2 Indicadores'!D92","v":{"$error":"#DIV/0!"}},null,{"$f":"+('2 Indicadores'!D85+'2 Indicadores'!D84+'2 Indicadores'!D86+'2 Indicadores'!D87+'2 Indicadores'!D88)/'2 Indicadores'!D89","v":{"$error":"#DIV/0!"}},null,"Bovinos"]
[null,"Pastagens\t",null,{"v":1,"d":"1.00"},{"$f":"('2 Indicadores'!C92*D52)*G52*('3 Relatório'!$H$5)","v":{"$error":"#DIV/0!"}},null,{"$f":"'1 Questionário'!E88","v":{"$error":"#DIV/0!"}},{"$f":"+D52","v":{"v":1,"d":"1.00"}},{"$f":"(K52*H52)*'2 Indicadores'!D89*'2 Indicadores'!D92","v":{"$error":"#DIV/0!"}},null,{"$f":"+'2 Indicadores'!D82/'2 Indicadores'!D89","v":{"$error":"#DIV/0!"}},null,"Equinos/Moares"]
[null,"Lavoura temporária\t",null,{"v":1,"d":"1.00"},{"$f":"('2 Indicadores'!C92*D53)*G53*('3 Relatório'!$H$5)","v":{"$error":"#DIV/0!"}},null,{"$f":"'1 Questionário'!E87","v":{"$error":"#DIV/0!"}},{"$f":"+D53","v":{"v":1,"d":"1.00"}},{"$f":"K53*'2 Indicadores'!D89*('2 Indicadores'!D92*H53)","v":{"$error":"#DIV/0!"}},null,{"$f":"+'2 Indicadores'!D81/'2 Indicadores'!D89","v":{"$error":"#DIV/0!"}},null,"Suínos"]
[null,"Irrigação  (R$1.000,00/ha)",null,{"v":5000,"d":"5,000.00"},{"$f":"+'3 Relatório'!H5*G54*D54","v":{"$error":"#DIV/0!"}},null,{"$f":"'2 Indicadores'!C77/'3 Relatório'!H5","v":{"$error":"#DIV/0!"}},{"$f":"+D54","v":{"v":5000,"d":"5,000.00"}},{"$f":"+'2 Indicadores'!D89*K54*H54","v":{"$error":"#DIV/0!"}},null,{"$f":"+'2 Indicadores'!D77/'3 Relatório'!H5","v":{"$error":"#DIV/0!"}},null,"Caprinos/Ovinos"]
[null,"Lav. perene/silvicutura\t",null,{"v":1,"d":"1.00"},{"$f":"('2 Indicadores'!C92*D55)*G55*('3 Relatório'!$H$5)","v":{"$error":"#DIV/0!"}},null,{"$f":"'1 Questionário'!E86+'1 Questionário'!E89","v":{"$error":"#DIV/0!"}},{"$f":"+D55","v":{"v":1,"d":"1.00"}},{"$f":"K55*'2 Indicadores'!D89*('2 Indicadores'!D92*H55)","v":{"$error":"#DIV/0!"}},null,{"$f":"+('2 Indicadores'!D80+'2 Indicadores'!D83)/'2 Indicadores'!D89","v":{"$error":"#DIV/0!"}},null,"Aves"]
[{"$nulls":6},{"$f":"+G55+G53+G52+G51","v":{"$error":"#DIV/0!"}},null,null,"Histórico ",{"$f":"+K55+K53+K52+K51","v":{"$error":"#DIV/0!"}},null,"Outros"]
[null,"Valor Total da terra\t",null,null,{"$f":"E51+E52+E53+E54+E55","v":{"$error":"#DIV/0!"}},null,null,"",null,{"$f":"I51+I52+I53+I54+I55","v":{"$error":"#DIV/0!"}}]
[]
[null,"Evolução decorrente da modificação do uso do solo",{"$nulls":5},{"$f":"J59/'2 Indicadores'!C95","v":{"$error":"#DIV/0!"}},null,{"$f":"(((Fórmulas!G53-Fórmulas!K53)*'3 Relatório'!H5*'2 Indicadores'!C92*1.1)+((Fórmulas!G54-Fórmulas!K54)*'3 Relatório'!H5*('2 Indicadores'!C92+1000))+((Fórmulas!G55-Fórmulas!K55)*'3 Relatório'!H5*'2 Indicadores'!C92*1.3))","v":{"$error":"#DIV/0!"}}]
[{"$nulls":9},{"$f":"('2 Indicadores'!$C$92*Fórmulas!D51)*Fórmulas!K51*'3 Relatório'!$H$5","v":{"$error":"#DIV/0!"}}]
[null,"Evolução patrimonial (sem a valorização do preço da terra)",{"$nulls":5},{"$f":"IF('2 Indicadores'!D95>0,('2 Indicadores'!C95/L65-1),\"\")","v":{"$error":"#DIV/0!"}},null,{"$f":"('2 Indicadores'!$C$92*Fórmulas!D52)*Fórmulas!K52*'3 Relatório'!$H$5","v":{"$error":"#DIV/0!"}}]
[{"$nulls":9},{"$f":"('2 Indicadores'!$C$92*Fórmulas!D53)*Fórmulas!K53*'3 Relatório'!$H$5","v":{"$error":"#DIV/0!"}}]
[null,"Evolução patrimonial total ",{"$nulls":5},{"$f":"IF('2 Indicadores'!C95>0,('2 Indicadores'!C95/'2 Indicadores'!D95-1),\"\")","v":{"$error":"#DIV/0!"}},null,{"$f":"Fórmulas!I54","v":{"$error":"#DIV/0!"}}]
[{"$nulls":9},{"$f":"('2 Indicadores'!$C$92*Fórmulas!D55)*Fórmulas!K55*'3 Relatório'!$H$5","v":{"$error":"#DIV/0!"}}]
[{"$nulls":9},{"$f":"SUM(J60:K64)","v":{"$error":"#DIV/0!"}},null,{"$f":"+J65+'2 Indicadores'!E59+'2 Indicadores'!E67+'2 Indicadores'!F73","v":{"$error":"#DIV/0!"}}]
[]
[null,"Fator de Ponderação\t",{"$nulls":3},"Fórmulas"]
[null,{"v":0,"d":"0%"},0.7,null,null,{"$f":"IF('2 Indicadores'!E111=0,0.7,0)","v":{"$error":"#DIV/0!"}},{"$f":"SUM(F68:F71)","v":{"$error":"#DIV/0!"}}]
[null,"0-7,5%","y = 0,04x + 0,7",null,null,{"$f":"IF('2 Indicadores'!E111>0,G69,0)","v":{"$error":"#DIV/0!"}},{"$f":"IF('2 Indicadores'!E111>=0.075,0,H69)","v":{"$error":"#DIV/0!"}},{"$f":"0.04*('2 Indicadores'!E111*100)+0.7","v":{"$error":"#DIV/0!"}}]
[null,"7,5-30%","y = -0,04x + 1,3",null,null,{"$f":"IF('2 Indicadores'!E111>=0.075,G70,0)","v":{"$error":"#DIV/0!"}},{"$f":"IF('2 Indicadores'!E111>0.3,0,H70)","v":{"$error":"#DIV/0!"}},{"$f":"-0.04*('2 Indicadores'!E111*100)+1.3","v":{"$error":"#DIV/0!"}}]
[null,"15-30%","y = -0,4x + 1,29",null,null,{"$f":"IF('2 Indicadores'!E111>0.3,0.1,0)","v":{"$error":"#DIV/0!"}}]
[null,">30%",0.1]
[null,">25%",0.1]
[]
[]
[4,"Fator de Ponderação\t\t",{"$nulls":3},"Fórmulas"]
[null,"Água",{"v":1,"d":"1.0"},null,null,{"$f":"IF(G77>0,1,0)","v":0},{"$f":"+'2 Indicadores'!D130+'2 Indicadores'!D127+'2 Indicadores'!D126+'2 Indicadores'!D125+'2 Indicadores'!D124*I77+'2 Indicadores'!D131+'2 Indicadores'!D128+'2 Indicadores'!D129","v":0},{"$f":"(('2 Indicadores'!D124*I77+'2 Indicadores'!D125+'2 Indicadores'!D126+'2 Indicadores'!D127+'2 Indicadores'!D128+'2 Indicadores'!D129+'2 Indicadores'!D130+'2 Indicadores'!D131)+('2 Indicadores'!E124*I77+'2 Indicadores'!E125+'2 Indicadores'!E126+'2 Indicadores'!E127+'2 Indicadores'!E128+'2 Indicadores'!E129+'2 Indicadores'!E130+'2 Indicadores'!E131))/H79","v":0},1,null,1]
[null,"Eletricidade",{"v":1,"d":"1.0"},null,null,{"$f":"IF(G78>0,1,0)","v":0},{"$f":"+'2 Indicadores'!E130+'2 Indicadores'!E127+'2 Indicadores'!E126+'2 Indicadores'!E125+'2 Indicadores'!E124*I77+'2 Indicadores'!E131+'2 Indicadores'!E128+'2 Indicadores'!E129","v":0},{"$f":"+F80+F79+F78+F77","v":0},null,null,0.5]
[null,"Estrada",{"v":1,"d":"1.0"},{"$nulls":4},{"$f":"IF(H78=0,1,H78)","v":{"v":1,"d":"1.00"}},null,null,0]
[null,"Saúde",{"v":1,"d":"1.0"}]
[null,"Transporte",{"v":1,"d":"1.0"}]
[null,"Segurança",{"v":1,"d":"1.0"}]
[null,"Internet\t",{"v":1,"d":"1.0"}]
[null,"Coleta de lixo",{"v":1,"d":"1.0"}]
[]
[null,"Fator de Ponderação\t\t",{"$nulls":3},"Fórmulas"]
[null,"Hortaliças",{"v":1,"d":"1.0"},null,null,{"$f":"IF(G87>0,1,0)","v":0},{"$f":"'2 Indicadores'!D137+'2 Indicadores'!D138+'2 Indicadores'!D139","v":0}]
[null,"Pomar",{"v":1,"d":"1.0"},null,null,{"$f":"IF(G88>0,1,0)","v":0},{"$f":"'2 Indicadores'!E137+'2 Indicadores'!E138+'2 Indicadores'!E139","v":0}]
[null,"Leite, ovos, carne",{"v":1,"d":"1.0"},null,null,{"$f":"IF(('2 Indicadores'!D137+'2 Indicadores'!D138+'2 Indicadores'!D139)=0,0,(('2 Indicadores'!D137+'2 Indicadores'!D138+'2 Indicadores'!D139)+('2 Indicadores'!E137+'2 Indicadores'!E138+'2 Indicadores'!E139))/F90)","v":0}]
[{"$nulls":5},{"$f":"SUM(F87:F88)","v":0}]
[]
[]
[5,"Fator de Ponderação\t\t",{"$nulls":3},"Fórmulas"]
[null,{"$f":"+'2 Indicadores'!B148:C148","v":"Menos de 9 anos de estudo\t"},0.7,null,null,"Fórmula: limiar de sustentabilidade (0,7) => adultos com no mínimo 5 anos de escolaridade (equivalente a 4 anos na grade escolar antiga) e crianças na rede de ensino. Cursos de capacitação direcionados para a atividade e mão de obra qualificada => acréscimo máx. 0,3 nota final\t\t\t\t\t\n\t\t\t\t\t\n\t\t\t\t\t\n\t\t\t\t\t\t\n\t\t"]
[null,{"$f":"+'2 Indicadores'!B149:C149","v":"Ensino Fundamental completo\t"},{"v":1,"d":"1.0"},null,null,{"$f":"IF('2 Indicadores'!D147>0,((('2 Indicadores'!D148*'2 Indicadores'!F148+'2 Indicadores'!D149*'2 Indicadores'!F149+'2 Indicadores'!D150*'2 Indicadores'!F150+'2 Indicadores'!D151*'2 Indicadores'!F151))*0.7),0)","v":0},{"$f":"IF('2 Indicadores'!D147>0,(('2 Indicadores'!D155*'2 Indicadores'!F155+'2 Indicadores'!D156*'2 Indicadores'!F156))*0.3,0)","v":0},{"$f":"+'2 Indicadores'!D147+'2 Indicadores'!E147","v":0},{"$f":"IF('2 Indicadores'!D161>0,(('2 Indicadores'!D162*'2 Indicadores'!F162)*0.7),0)","v":0},null,{"$f":"I97+G97","v":{"$error":"#DIV/0!"}}]
[null,{"$f":"+'2 Indicadores'!B150:C150","v":"Ensino Médio completo\t"},1.2,null,null,{"$f":"IF('2 Indicadores'!E147>0,((('2 Indicadores'!E148*'2 Indicadores'!F148+'2 Indicadores'!E149*'2 Indicadores'!F149+'2 Indicadores'!E150*'2 Indicadores'!F150+'2 Indicadores'!E151*'2 Indicadores'!F151))*0.7),0)","v":0},{"$f":"IF('2 Indicadores'!E147>0,(('2 Indicadores'!E155*'2 Indicadores'!F155+'2 Indicadores'!E156*'2 Indicadores'!F156))*0.3,0)","v":0},{"$f":"+'2 Indicadores'!D161+'2 Indicadores'!E161","v":0},{"$f":"IF('2 Indicadores'!E161>0,(('2 Indicadores'!E162*'2 Indicadores'!F162))*0.7,0)","v":0},null,{"$f":"K95","v":{"$error":"#DIV/0!"}}]
[null,{"$f":"+'2 Indicadores'!B151:C151","v":"Curso superior\t"},1.5,null,null,{"$f":"(F95+F96)/H95","v":{"$error":"#DIV/0!"}},{"$f":"(G95+G96)/H95","v":{"$error":"#DIV/0!"}},{"$f":"(I95+I96)/H96","v":{"$error":"#DIV/0!"}},{"$f":"IF(OR('2 Indicadores'!D161>0,'2 Indicadores'!E161>0),((H97+F97)/2),F97)","v":{"$error":"#DIV/0!"}}]
[null,{"$f":"+'2 Indicadores'!B155:C155","v":"Capacitação curta temporada\t"},0.5]
[null,{"$f":"+'2 Indicadores'!B156:C156","v":"Capacitação longa temporada"},0.8]
[null,{"$f":"+'2 Indicadores'!B162:C162","v":"Frequenta rede de ensino \t"},{"v":1,"d":"1.0"}]
[]
[]
[6,"Fator de Ponderação\t\t",{"$nulls":3},"Formulas"]
[null,{"$f":"+'2 Indicadores'!B171:D171","v":"Registro de funcionários (carteira de trabalho)\t\t"},{"v":1,"d":"1.0"},null,null,"Fórmula: = 0,7 se houver o cumprimento da lei referente ao registro e pagamento de hora extra de todos os funcionários; auxílios e benefícios acréscimo - máx.0,3 \t\t\n\t\t"]
[null,{"$f":"+'2 Indicadores'!B172:D172","v":"Pagamento de hora extra ou ausência de hora extra\t\t\t\t"},{"v":1,"d":"1.0"}]
[null,{"$f":"+'2 Indicadores'!B177:D177","v":"Acima de 1 salário mínimo\t\t"},{"v":1,"d":"1.0"},null,null,{"$f":"IF('2 Indicadores'!D170>0,((('2 Indicadores'!D171*'2 Indicadores'!$F$171+'2 Indicadores'!D172*'2 Indicadores'!$F$172)/('2 Indicadores'!D170*2))*0.7),0.7)","v":{"v":0.7,"d":"0.70"}},{"$f":"IF('2 Indicadores'!D170>0,(('2 Indicadores'!D177*'2 Indicadores'!$F$177+'2 Indicadores'!D178*'2 Indicadores'!$F$178+'2 Indicadores'!D179*'2 Indicadores'!$F$179+'2 Indicadores'!D180*'2 Indicadores'!$F$180+'2 Indicadores'!D181*'2 Indicadores'!$F$181+'2 Indicadores'!D182*'2 Indicadores'!$F$182+'2 Indicadores'!D183*'2 Indicadores'!$F$183+'2 Indicadores'!D184*'2 Indicadores'!$F$184)/('2 Indicadores'!D170*8)*0.3),0)","v":0},{"$f":"(F106+G106)","v":{"v":0.7,"d":"0.70"}}]
[null,{"$f":"+'2 Indicadores'!B178:D178","v":"Auxílio alimentação\t\t"},{"v":1,"d":"1.0"},null,null,{"$f":"IF('2 Indicadores'!E170>0,((('2 Indicadores'!E171*'2 Indicadores'!$F$171+'2 Indicadores'!E172*'2 Indicadores'!$F$172)/('2 Indicadores'!E170*2))*0.7),0.7)","v":{"v":0.7,"d":"0.70"}},{"$f":"IF('2 Indicadores'!E170>0,(('2 Indicadores'!E177*'2 Indicadores'!$F$177+'2 Indicadores'!E178*'2 Indicadores'!$F$178+'2 Indicadores'!E179*'2 Indicadores'!$F$179+'2 Indicadores'!E180*'2 Indicadores'!$F$180+'2 Indicadores'!E181*'2 Indicadores'!$F$181+'2 Indicadores'!E182*'2 Indicadores'!$F$182+'2 Indicadores'!E183*'2 Indicadores'!$F$183+'2 Indicadores'!E184*'2 Indicadores'!$F$184)/('2 Indicadores'!E170*8)*0.3),0)","v":0},{"$f":"(F107+G107)","v":{"v":0.7,"d":"0.70"}}]
[null,{"$f":"+'2 Indicadores'!B179:D179","v":"Auxílio moradia\t\t"},{"v":1,"d":"1.0"},null,null,{"$f":"+H106","v":{"v":0.7,"d":"0.70"}},{"$f":"IF('2 Indicadores'!E170>0,(H107+F108)/2,F108)","v":{"v":0.7,"d":"0.70"}},{"$f":"IF(SUM('2 Indicadores'!D170:E170)=0,0.7,Fórmulas!G108)","v":{"v":0.7,"d":"0.70"}}]
[null,{"$f":"+'2 Indicadores'!B180:D180","v":"Auxílio educação e transporte\t\t"},{"v":1,"d":"1.0"}]
[null,{"$f":"+'2 Indicadores'!B181:D181","v":"Participação nos lucros\t\t"},{"v":5,"d":"5.0"}]
[null,{"$f":"+'2 Indicadores'!B182:D182","v":"Seguro contra acidentes\t\t"},{"v":3,"d":"3.0"}]
[null,{"$f":"+'2 Indicadores'!B183:D183","v":"Acesso a lazer\t\t"},{"v":1,"d":"1.0"}]
[null,{"$f":"+'2 Indicadores'!B184:D184","v":"Espaço para cultivo de alimentos \t\t"},{"v":3,"d":"3.0"}]
[]
[]
[7,"Fator de Ponderação\t\t"]
[null,"Fluxo de caixa",0.5]
[null,"Custo de produção",0.5]
[null,"Assistência Técnica",{"v":1,"d":"1.0"}]
[null,"Associação",{"v":1,"d":"1.0"}]
[null,"Regularização ambiental",{"v":1,"d":"1.0"}]
[null,"Crédito investimento",0.4]
[null,"Crédito custeio",0.4]
[null,"Crédito comercialização",0.2]
[]
[]
[8,"Fator de Ponderação\t\t",{"$nulls":3},"Fórmulas"]
[null,{"$f":"+'2 Indicadores'!B205:D205","v":"Diversificação de compradores, busca de preços, preços pré-venda"},0.4,null,null,{"$f":"(G128*C128+G129*C129+G130*C130+G131*C131)","v":{"v":0,"d":"0.00"}},{"$f":"IF('2 Indicadores'!E205=\"Sim\",1,0)","v":0}]
[null,{"$f":"+'2 Indicadores'!B206:D206","v":"Produtos certificados, agrega valor, mercado institucional\t\t"},0.4,{"$nulls":3},{"$f":"IF('2 Indicadores'!E206=\"Sim\",1,0)","v":0}]
[null,{"$f":"+'2 Indicadores'!B209:D209","v":"Adoção de técnicas inovadoras*\t\t\t"},0.3,{"$nulls":3},{"$f":"IF('2 Indicadores'!E209=\"Sim\",1,0)","v":0}]
[null,{"$f":"+'2 Indicadores'!B211:D211","v":"Capacidade de inovação ou liderança na comunidade\t\t"},0.4,{"$nulls":3},{"$f":"IF('2 Indicadores'!E211=\"Sim\",1,0)","v":0}]
[]
[]
[9,"Fator de Ponderação\t\t",{"$nulls":3},"Fórmulas"]
[null,"Esgoto residências",{"v":1,"d":"1.0"},null,null,{"$f":"IF(G135>1,1,G135)","v":{"$error":"#DIV/0!"}},{"$f":"IF(H135>0,I135/H135,I135)","v":{"$error":"#DIV/0!"}},{"$f":"COUNTIF('2 Indicadores'!E223:F231,\">=0\")","v":0},{"$f":"'2 Indicadores'!F223+'2 Indicadores'!F224+'2 Indicadores'!E227+'2 Indicadores'!E230+'2 Indicadores'!E231","v":{"$error":"#DIV/0!"}},null,"Não se aplica"]
[null,"Lixo",{"v":1,"d":"1.0"},null,null,{"$f":"IF('2 Indicadores'!E234=\"Sim\",Fórmulas!F135*0.7,Fórmulas!F135)","v":{"$error":"#DIV/0!"}}]
[null,"Resíduo orgânico",{"v":1,"d":"1.0"}]
[null,"Efluentes líquidos",{"v":1,"d":"1.0"}]
[null,"Efluentes gasosos",{"v":1,"d":"1.0"}]
[]
[null,"UNIDADES V",{"$nulls":3},"Fator de ponderação"]
[null,"Ausência de coleta e tratamento de esgoto",{"$nulls":3},{"v":1E-4,"d":"0.00"},{"$f":"IF('2 Indicadores'!$D$223=Fórmulas!B142,1,0)","v":0},{"$f":"G142*F142","v":0},{"$f":"IF('2 Indicadores'!$E$223=Fórmulas!B142,1,0)","v":0},{"$f":"I142*F142","v":0},{"$f":"SUM(G142:G146)","v":0},{"$f":"SUM(I142:I146)","v":0},{"$f":"L142+K142","v":0}]
[null,"Fossa rudimentar; fossa negra sem revestimento\t",{"$nulls":3},0.25,{"$f":"IF('2 Indicadores'!$D$223=Fórmulas!B143,1,0)","v":0},{"$f":"G143*F143","v":0},{"$f":"IF('2 Indicadores'!$E$223=Fórmulas!B143,1,0)","v":0},{"$f":"I143*F143","v":0},{"$f":"SUM(H142:H146)","v":0},{"$f":"SUM(J142:J146)","v":0},{"$f":"SUM(K143:L143)/M142","v":{"$error":"#DIV/0!"}}]
[null,"Fossa, filtro, sumidouro",{"$nulls":3},{"v":0.7,"d":"0.70"},{"$f":"IF('2 Indicadores'!$D$223=Fórmulas!B144,1,0)","v":0},{"$f":"G144*F144","v":0},{"$f":"IF('2 Indicadores'!$E$223=Fórmulas!B144,1,0)","v":0},{"$f":"I144*F144","v":0}]
[null,"Fossa séptica com manutenção",{"$nulls":3},{"v":0.8,"d":"0.80"},{"$f":"IF('2 Indicadores'!$D$223=Fórmulas!B145,1,0)","v":0},{"$f":"G145*F145","v":0},{"$f":"IF('2 Indicadores'!$E$223=Fórmulas!B145,1,0)","v":0},{"$f":"I145*F145","v":0}]
[null,"Fossa Biodigestora, Fossa TEVAP; separação e tratamento águas cinzas\t",{"$nulls":3},{"v":1,"d":"1.00"},{"$f":"IF('2 Indicadores'!$D$223=Fórmulas!B146,1,0)","v":0},{"$f":"G146*F146","v":0},{"$f":"IF('2 Indicadores'!$E$223=Fórmulas!B146,1,0)","v":0},{"$f":"I146*F146","v":0}]
[null,"UNIDADES VI"]
[null,"Queimado/descartado em local inapropriado",{"$nulls":3},{"v":1E-4,"d":"0.00"},{"$f":"IF('2 Indicadores'!$D$224=Fórmulas!B148,1,0)","v":0},{"$f":"G148*F148","v":0},{"$f":"IF('2 Indicadores'!$E$224=Fórmulas!B148,1,0)","v":0},{"$f":"I148*F148","v":0},{"$f":"SUM(G148:G151)","v":0},{"$f":"SUM(I148:I151)","v":0},{"$f":"L148+K148","v":0}]
[null,"Enterrado no imóvel rural",{"$nulls":3},{"v":0.3,"d":"0.30"},{"$f":"IF('2 Indicadores'!$D$224=Fórmulas!B149,1,0)","v":0},{"$f":"G149*F149","v":0},{"$f":"IF('2 Indicadores'!$E$224=Fórmulas!B149,1,0)","v":0},{"$f":"I149*F149","v":0},{"$f":"SUM(H148:H151)","v":0},{"$f":"SUM(J148:J151)","v":0},{"$f":"SUM(K149:L149)/M148","v":{"$error":"#DIV/0!"}}]
[null,"Lixo levado pelo produtor",{"$nulls":3},{"v":0.8,"d":"0.80"},{"$f":"IF('2 Indicadores'!$D$224=Fórmulas!B150,1,0)","v":0},{"$f":"G150*F150","v":0},{"$f":"IF('2 Indicadores'!$E$224=Fórmulas!B150,1,0)","v":0},{"$f":"I150*F150","v":0}]
[null,"Lixo coletado pela prefeitura",{"$nulls":3},{"v":1,"d":"1.00"},{"$f":"IF('2 Indicadores'!$D$224=Fórmulas!B151,1,0)","v":0},{"$f":"G151*F151","v":0},{"$f":"IF('2 Indicadores'!$E$224=Fórmulas!B151,1,0)","v":0},{"$f":"I151*F151","v":0}]
[]
[]
[10,"MOS - Fator Ponderação\t\t\t\t"]
[null,"Classificação\t\t\t",{"$nulls":3},"Ponderação",null,"Classes de textura (dag kg-1 de argila)"]
[null,"Arenosa","Média\t","Argilosa","Muito Argilosa",null,null,"Arenosa",null,"≤ 15"]
[null,{"v":0,"d":"0.00"},{"v":0,"d":"0.00"},{"v":0,"d":"0.00"},{"v":0,"d":"0.00"},{"v":0.1,"d":"0.10"},null,"Média",null,"16 a 34"]
[null,{"v":0.8,"d":"0.80"},{"v":1.6,"d":"1.60"},{"v":2.4,"d":"2.40"},{"v":2.8,"d":"2.80"},{"v":0.5,"d":"0.50"},null,"Argilosa",null,"35 a 60"]
[null,{"v":1.1,"d":"1.10"},{"v":2.1,"d":"2.10"},{"v":3.1,"d":"3.10"},{"v":3.6,"d":"3.60"},{"v":0.7,"d":"0.70"},null,"Muito argilosa",null,"> 60"]
[null,{"v":1.5,"d":"1.50"},{"v":3,"d":"3.00"},{"v":4.5,"d":"4.50"},{"v":5.2,"d":"5.20"},{"v":1,"d":"1.00"}]
[null,{"v":4.5,"d":"4.50"},{"v":9,"d":"9.00"},{"v":13.5,"d":"13.50"},{"v":15.6,"d":"15.60"},{"v":0.7,"d":"0.70"}]
[]
[null,"MOS - Fórmulas"]
[null,"Arenosa"," Yo + ax + bx2 + cx3 ",null,"Fórmula2 = Yo + ax ",null,"Média"," Yo + ax + bx2 + cx3 ",null,"Fórmula2 = Yo + ax ",null,null,{"$f":"IF(AND('2 Indicadores'!E242=\"Arenosa\"),IF('2 Indicadores'!C243<1.5,Fórmulas!E167,Fórmulas!F167),0)","v":{"v":0,"d":"0.00"}}]
[null,null,"Yo",{"v":0.1,"d":"0.100"},"Yo",1.15,null,"Yo",{"v":0.1,"d":"0.100"},"Yo",1.15,null,{"$f":"IF(AND('2 Indicadores'!E242=\"Média\"),IF('2 Indicadores'!C243<3,Fórmulas!J167,Fórmulas!K167),0)","v":{"v":0,"d":"0.00"}}]
[null,null,"a",{"v":0.3597,"d":"0.360"},"a",{"v":-0.1,"d":"-0.10"},null,"a",{"v":0.0024,"d":"0.002"},"a",-0.05,null,{"$f":"IF(AND('2 Indicadores'!E242=\"Argilosa\"),IF('2 Indicadores'!C243<4.5,Fórmulas!E172,Fórmulas!F172),0)","v":{"v":0,"d":"0.00"}}]
[null,null,"b",{"v":0.1926,"d":"0.193"},{"$f":"D165+D166*'2 Indicadores'!C243+D167*'2 Indicadores'!C243^2+D168*'2 Indicadores'!C243^3","v":{"v":0.1,"d":"0.10"}},{"$f":"F165+F166*'2 Indicadores'!C243","v":1.15},null,"b",{"v":0.2183,"d":"0.218"},{"$f":"I165+I166*'2 Indicadores'!C243+I167*'2 Indicadores'!C243^2+I168*'2 Indicadores'!C243^3","v":{"v":0.1,"d":"0.10"}},{"$f":"K165+K166*'2 Indicadores'!C243","v":1.15},null,{"$f":"IF(AND('2 Indicadores'!E242=\"Muito argilosa\"),IF('2 Indicadores'!C243<5.2,Fórmulas!J172,Fórmulas!K172),0)","v":{"v":0,"d":"0.00"}}]
[null,null,"c",{"v":-0.0216,"d":"-0.022"},{"$nulls":3},"c",{"v":-0.0397,"d":"-0.040"},{"$nulls":3},{"$f":"(M164+M165+M166+M167)","v":{"v":0,"d":"0.00"}}]
[null,"Argilosa"," Yo + ax + bx2 + cx3 ",null,"Fórmula2 = Yo + ax ",null,"Muito argilosa"," Yo + ax + bx2 + cx3 ",null,"Fórmula2 = Yo + ax "]
[null,null,"Yo",{"v":0.1,"d":"0.100"},"Yo",1.15,null,"Yo",{"v":0.1,"d":"0.100"},"Yo",1.15]
[null,null,"a",{"v":-0.0452,"d":"-0.045"},"a",{"v":-0.03333,"d":"-0.03"},null,"a",{"v":-0.0486,"d":"-0.049"},"a",{"v":-0.0288,"d":"-0.03"}]
[null,null,"b",{"v":0.1269,"d":"0.127"},{"$f":"D170+D171*'2 Indicadores'!C243+D172*'2 Indicadores'!C243^2+D173*'2 Indicadores'!C243^3","v":{"v":0.1,"d":"0.10"}},{"$f":"F170+F171*'2 Indicadores'!C243","v":1.15},null,"b",{"v":0.0984,"d":"0.098"},{"$f":"I170+I171*'2 Indicadores'!C243+I172*'2 Indicadores'!C243^2+I173*'2 Indicadores'!C243^3","v":{"v":0.1,"d":"0.10"}},{"$f":"K170+K171*'2 Indicadores'!C243","v":1.15}]
[null,null,"c",{"v":-0.0161,"d":"-0.016"},{"$nulls":3},"c",{"v":-0.0107,"d":"-0.011"}]
[]
[]
[null,"P - Fator Ponderação\t\t\t\t"]
[null,"Classificação\t\t\t",{"$nulls":3},"Ponderação"]
[null,"Arenosa","Média\t","Argilosa","Muito Argilosa"]
[null,{"v":0,"d":"0.00"},{"v":0,"d":"0.00"},{"v":0,"d":"0.00"},{"v":0,"d":"0.00"},{"v":0.1,"d":"0.10"}]
[null,{"v":12.1,"d":"12.10"},{"v":10.1,"d":"10.10"},{"v":5.1,"d":"5.10"},{"v":3.1,"d":"3.10"},0.25]
[null,{"v":18.1,"d":"18.10"},{"v":15.1,"d":"15.10"},{"v":8.1,"d":"8.10"},{"v":4.1,"d":"4.10"},{"v":0.5,"d":"0.50"}]
[null,{"v":25.1,"d":"25.10"},{"v":20.1,"d":"20.10"},{"v":12.1,"d":"12.10"},{"v":6.1,"d":"6.10"},{"v":0.7,"d":"0.70"}]
[null,{"v":40,"d":"40.00"},{"v":30,"d":"30.00"},{"v":18,"d":"18.00"},{"v":9,"d":"9.00"},{"v":1,"d":"1.00"}]
[null,{"v":400,"d":"400.00"},{"v":300,"d":"300.00"},{"v":180,"d":"180.00"},{"v":90,"d":"90.00"},{"v":0.7,"d":"0.70"}]
[]
["P - Fórmulas"]
["Arenosa"," Yo + ax ",null,"F2 = Yo + ax + bx2 ",null,"F3 = Yo + ax ",null,"Média","F1 = Yo + ax + bx2 ",null,"F2 = Yo + ax + bx2 ",null,"F3 = Yo + ax "]
[null,"Yo",{"v":0.1,"d":"0.10"},"Yo",{"v":-0.4748,"d":"-0.47"},"Yo",{"v":1.0233,"d":"1.02"},null,"Yo",{"v":0.1,"d":"0.10"},"Yo",{"v":-0.3015,"d":"-0.30"},"Yo",{"v":1.0333,"d":"1.03"}]
[null,"a",{"v":0.0124,"d":"0.01"},"a",{"v":0.0721,"d":"0.07"},"a",{"v":-0.0008,"d":"-0.00"},null,"a",{"v":-0.0087,"d":"-0.01"},"a",{"v":0.0639,"d":"0.06"},"a",{"v":-0.0011,"d":"-0.00"}]
[{"$nulls":3},"b",{"v":-1E-3,"d":"-0.00"},{"$nulls":3},"b",{"v":2.3E-3,"d":"0.00"},"b",{"v":-0.0007,"d":"-0.00"}]
["Argilosa","F1 = Yo + ax + bx2 ",null,"F2 = Yo + ax + bx2 ",null,"F3 = Yo + ax ",null,"Muito argilosa","F1 = Yo + ax + bx2 ",null,"F2 = Yo + ax + bx2 ",null,"F3 = Yo + ax "]
[null,"Yo",{"v":0.1,"d":"0.10"},"Yo",{"v":0.1034,"d":"0.10"},"Yo",{"v":1.04333,"d":"1.04"},null,"Yo",{"v":0.1,"d":"0.10"},"Yo",{"v":0.1076,"d":"0.11"},"Yo",{"v":1.0333,"d":"1.03"}]
[null,"a",{"v":-0.0045,"d":"-0.00"},"a",{"v":0.0483,"d":"0.05"},"a",{"v":-1.9E-3,"d":"-0.00"},null,"a",{"v":-0.1041,"d":"-0.10"},"a",{"v":0.0928,"d":"0.09"},"a",{"v":-0.0037,"d":"-0.00"}]
[null,"b",{"v":0.0067,"d":"0.01"},"b",{"v":8.56e-05,"d":"0.00"},{"$nulls":3},"b",{"v":0.0492,"d":"0.05"},"b",{"v":0.0007,"d":"0.00"}]
[null,{"$f":"C188+C189*'2 Indicadores'!C244","v":{"v":0.1,"d":"0.10"}},{"$f":"E188+E189*'2 Indicadores'!C244+E190*'2 Indicadores'!C244^2","v":{"v":-0.4748,"d":"-0.47"}},{"$f":"0.1946+0.0201*'2 Indicadores'!C244","v":{"v":0.1946,"d":"0.19"}},{"$f":"G188+G189*'2 Indicadores'!C244","v":{"v":1.0233,"d":"1.02"}},{"$f":"IF('2 Indicadores'!C244<=12.1,B195,IF(AND('2 Indicadores'!C244>12.1,'2 Indicadores'!C244<25.1),C195,IF('2 Indicadores'!C244>40,E195,D195)))","v":{"v":0.1,"d":"0.10"}},{"$nulls":3},{"$f":"J188+J189*'2 Indicadores'!C244+J190*'2 Indicadores'!C244^2","v":{"v":0.1,"d":"0.10"}},{"$f":"L188+L189*'2 Indicadores'!C244+L190*'2 Indicadores'!C244^2","v":{"v":-0.3015,"d":"-0.30"}},{"$f":"N188+N189*'2 Indicadores'!C244","v":{"v":1.0333,"d":"1.03"}},{"$f":"IF(AND('2 Indicadores'!C244>15.1,'2 Indicadores'!C244<30),K195,IF('2 Indicadores'!C244>=30,L195,J195))","v":{"v":0.1,"d":"0.10"}}]
[null,{"$f":"C192+C193*'2 Indicadores'!C244+C194*'2 Indicadores'!C244^2","v":{"v":0.1,"d":"0.10"}},{"$f":"E192+E193*'2 Indicadores'!C244+E194*'2 Indicadores'!C244^2","v":{"v":0.1034,"d":"0.10"}},{"$f":"G192+G193*'2 Indicadores'!C244","v":{"v":1.04333,"d":"1.04"}},{"$f":"IF(AND('2 Indicadores'!C244>8.1,'2 Indicadores'!C244<18),C196,IF('2 Indicadores'!C244>=18,D196,B196))","v":{"v":0.1,"d":"0.10"}},{"$nulls":4},{"$f":"J192+J193*'2 Indicadores'!C244+J194*'2 Indicadores'!C244^2","v":{"v":0.1,"d":"0.10"}},{"$f":"L192+L193*'2 Indicadores'!C244+L194*'2 Indicadores'!C244^2","v":{"v":0.1076,"d":"0.11"}},{"$f":"N192+N193*'2 Indicadores'!C244","v":{"v":1.0333,"d":"1.03"}},{"$f":"IF(AND('2 Indicadores'!C244>4.1,'2 Indicadores'!C244<9),K196,IF('2 Indicadores'!C244>=9,L196,J196))","v":{"v":0.1,"d":"0.10"}}]
[null,{"$f":"IF(AND('2 Indicadores'!E242=\"Arenosa\"),IF('2 Indicadores'!C244<0,0,IF(Fórmulas!F195>1,1,Fórmulas!F195)),0)","v":{"v":0,"d":"0.00"}},{"$f":"IF(AND('2 Indicadores'!E242=\"Média\"),IF('2 Indicadores'!C244<0,0,IF(Fórmulas!M195>1,1,Fórmulas!M195)),0)","v":{"v":0,"d":"0.00"}},{"$f":"IF(AND('2 Indicadores'!E242=\"Argilosa\"),IF('2 Indicadores'!C244<0,0,IF(Fórmulas!E196>1,1,Fórmulas!E196)),0)","v":{"v":0,"d":"0.00"}},{"$f":"IF(AND('2 Indicadores'!E242=\"Muito argilosa\"),IF('2 Indicadores'!C244<0,0,IF(Fórmulas!M196>1,1,Fórmulas!M196)),0)","v":{"v":0,"d":"0.00"}},{"$f":"(B197+C197+D197+E197)","v":{"v":0,"d":"0.00"}}]
[]
[null,"Ca - Fator Ponderação\t",null,null,"Ca - Fórmulas"]
[null,"Classificação"," Ponderação",null,"F1 = Yo + ax + bx2 ",null,null,"F2 = Yo + ax + bx2 ",null,"F3 = Yo + ax "]
[null,{"v":0,"d":"0.00"},{"v":0.1,"d":"0.10"},null,"Yo",{"v":0.1,"d":"0.10"},null,"Yo",{"v":0.3213,"d":"0.32"},"Yo",{"v":1.075,"d":"1.08"}]
[null,0.41,0.25,null,"a",{"v":0.3839,"d":"0.38"},null,"a",{"v":0.1381,"d":"0.14"},"a",{"v":-0.0188,"d":"-0.02"}]
[null,1.21,{"v":0.5,"d":"0.50"},null,"b",{"v":-0.0441,"d":"-0.04"},null,"b",{"v":0.0079,"d":"0.01"}]
[null,2.41,{"v":0.7,"d":"0.70"}]
[null,{"v":4,"d":"4.00"},{"v":1,"d":"1.00"},null,null,{"$f":"F201+F202*'2 Indicadores'!C245+F203*'2 Indicadores'!C245^2","v":{"v":0.1,"d":"0.10"}},{"$f":"I201+I202*'2 Indicadores'!C245+I203*'2 Indicadores'!C245^2","v":{"v":0.3213,"d":"0.32"}},{"$f":"K201+K202*'2 Indicadores'!C245","v":{"v":1.075,"d":"1.08"}},{"$f":"IF(AND('2 Indicadores'!C245>1.21,'2 Indicadores'!C245<4),G205,IF('2 Indicadores'!C245>=4,H205,F205))","v":{"v":0.1,"d":"0.10"}}]
[null,{"v":20,"d":"20.00"},{"v":0.7,"d":"0.70"}]
[]
[]
[null,"Mg - Fator Ponderação\t",null,null,"Mg - Fórmulas"]
[null,"Classificação"," Ponderação",null,"F1 = Yo + ax + bx2 ",null,null,"F2 = Yo + ax + bx2 ",null,"F3 = Yo + ax "]
[null,{"v":0,"d":"0.00"},{"v":0.1,"d":"0.10"},null,"Yo",{"v":0.1,"d":"0.10"},null,"Yo",{"v":0.3213,"d":"0.32"},"Yo",{"v":1.075,"d":"1.08"}]
[null,0.16,0.25,null,"a",{"v":0.9737,"d":"0.97"},null,"a",{"v":0.3601,"d":"0.36"},"a",-0.05]
[null,0.46,{"v":0.5,"d":"0.50"},null,"b",{"v":-0.2264,"d":"-0.23"},null,"b",{"v":0.0616,"d":"0.06"}]
[null,0.91,{"v":0.7,"d":"0.70"},null,null,{"$f":"F211+F212*'2 Indicadores'!C246+F213*'2 Indicadores'!C246^2","v":{"v":0.1,"d":"0.10"}},{"$f":"I211+I212*'2 Indicadores'!C246+I213*'2 Indicadores'!C246^2","v":{"v":0.3213,"d":"0.32"}},{"$f":"K211+K212*'2 Indicadores'!C246","v":{"v":1.075,"d":"1.08"}},{"$f":"IF(AND('2 Indicadores'!C246>0.46,'2 Indicadores'!C246<1.5),G214,IF('2 Indicadores'!C246>=1.5,H214,F214))","v":{"v":0.1,"d":"0.10"}}]
[null,{"v":1.5,"d":"1.50"},{"v":1,"d":"1.00"}]
[null,{"v":7.5,"d":"7.50"},{"v":0.7,"d":"0.70"}]
[]
[null,"K - Fator Ponderação\t",null,null,"K - Fórmulas"]
[null,"Classificação"," Ponderação",null,"F1 = Yo + ax + bx2 ",null,null,"F2 = Yo + ax + bx2 ",null,"F3 = Yo + ax "]
[null,{"v":0,"d":"0.00"},{"v":0.1,"d":"0.10"},null,"Yo",{"v":0.1,"d":"0.10"},null,"Yo",{"v":0.2066,"d":"0.21"},"Yo",{"v":1.075,"d":"1.08"}]
[null,{"v":16,"d":"16.00"},0.25,null,"a",{"v":0.0091,"d":"0.01"},null,"a",{"v":0.0074,"d":"0.01"},"a",{"v":-6.2E-4,"d":"-0.00"}]
[null,{"v":41,"d":"41.00"},{"v":0.5,"d":"0.50"},null,"b",{"v":1.5244E-5,"d":"0.00"},null,"b",{"v":-6.8888E-6,"d":"-0.00"}]
[null,{"v":71,"d":"71.00"},{"v":0.7,"d":"0.70"},null,null,{"$f":"F220+F221*'2 Indicadores'!C247+F222*'2 Indicadores'!C247^2","v":{"v":0.1,"d":"0.10"}},{"$f":"I220+I221*'2 Indicadores'!C247+I222*'2 Indicadores'!C247^2","v":{"v":0.2066,"d":"0.21"}},{"$f":"K220+K221*'2 Indicadores'!C247","v":{"v":1.075,"d":"1.08"}},{"$f":"IF(AND('2 Indicadores'!C247>41,'2 Indicadores'!C247<120),G223,IF('2 Indicadores'!C247>=120,H223,F223))","v":{"v":0.1,"d":"0.10"}}]
[null,{"v":120,"d":"120.00"},{"v":1,"d":"1.00"}]
[null,{"v":600,"d":"600.00"},{"v":0.7,"d":"0.70"}]
[]
[null,"pH - Fator Ponderação\t",null,null,"pH em água - Fórmulas"]
[null,"Classificação"," Ponderação",null,"F1 = Yo + ax + bx2 ",null,null,"F2 = Yo + ax + bx2 "]
[null,{"v":5.1,"d":"5.10"},{"v":0.3,"d":"0.30"},null,"Yo",{"v":-19.1,"d":"-19.10"},null,"Yo",{"v":-42.5,"d":"-42.50"}]
[null,{"v":5.2,"d":"5.20"},{"v":0.4,"d":"0.40"},null,"a",6.35,null,"a",14.75]
[null,{"v":5.5,"d":"5.50"},{"v":0.7,"d":"0.70"},null,"b",{"v":-0.5,"d":"-0.50"},null,"b",-1.25]
[null,{"v":6,"d":"6.00"},{"v":1,"d":"1.00"},null,{"$f":"-4.8+(1*'2 Indicadores'!C248)","v":{"v":-4.8,"d":"-4.80"}},{"$f":"F229+F230*'2 Indicadores'!C248+F231*'2 Indicadores'!C248^2","v":{"v":-19.1,"d":"-19.10"}},{"$f":"I229+I230*'2 Indicadores'!C248+I231*'2 Indicadores'!C248^2","v":{"v":-42.5,"d":"-42.50"}},{"$f":"IF('2 Indicadores'!C248>=6.6,I232,IF(AND('2 Indicadores'!C248>=6,'2 Indicadores'!C248<6.6),G232,IF(AND('2 Indicadores'!C248>5.2,'2 Indicadores'!C248<6),F232,E232)))","v":{"v":-4.8,"d":"-4.80"}}]
[null,{"v":6.4,"d":"6.40"},{"v":0.7,"d":"0.70"}]
[]
[null,"Al - Fator Ponderação\t",null,null,"Al - Fórmulas"]
[null,"Classificação"," Ponderação",null,"F1 = Yo + ax + bx2 ",null,null,"F2 = Yo + ax + bx2 "]
[null,{"v":0,"d":"0.00"},{"v":0.7,"d":"0.70"},null,"Yo",{"v":0.7,"d":"0.70"},null,"Yo",{"v":0.8406,"d":"0.84"}]
[null,0.21,{"v":0.6,"d":"0.60"},null,"a",{"v":-0.535,"d":"-0.54"},null,"a",{"v":-0.7525,"d":"-0.75"}]
[null,0.51,{"v":0.5,"d":"0.50"},null,"b",{"v":0.2801,"d":"0.28"},null,"b",{"v":0.1661,"d":"0.17"}]
[null,1.01,0.25,null,null,{"$f":"F237+F238*'2 Indicadores'!C249+F239*'2 Indicadores'!C249^2","v":{"v":0.7,"d":"0.70"}},{"$f":"I237+I238*'2 Indicadores'!C249+I239*'2 Indicadores'!C249^2","v":{"v":0.8406,"d":"0.84"}},{"$f":"IF('2 Indicadores'!C249>=0.51,G240,F240)","v":{"v":0.7,"d":"0.70"}}]
[null,{"v":2,"d":"2.00"},{"v":0,"d":"0.00"}]
[]
[null,"CTC - Fator Ponderação\t",null,null,"CTC - Fórmulas"]
[null,"Classificação"," Ponderação",null,"F1 = Yo + ax"]
[null,{"v":0,"d":"0.00"},{"v":0.1,"d":"0.10"},null,"Yo",0.1654]
[null,{"v":1.6,"d":"1.60"},0.25,null,"a",{"v":0.0584,"d":"0.06"}]
[null,{"v":4.3,"d":"4.30"},{"v":0.5,"d":"0.50"}]
[null,{"v":8.6,"d":"8.60"},{"v":0.7,"d":"0.70"},null,null,{"$f":"F245+F246*'2 Indicadores'!C250","v":{"v":0.1654,"d":"0.17"}},{"$f":"IF(F248>1,1,F248)","v":{"v":0.1654,"d":"0.17"}},{"$f":"G248","v":{"v":0.1654,"d":"0.17"}}]
[null,{"v":15,"d":"15.00"},{"v":1,"d":"1.00"}]
[]
[null,"V - Fator Ponderação\t",null,null,"V - Fórmulas"]
[null,"Classificação"," Ponderação",null,"Fórmula1 = Yo + ax ",null,"Fórmula2 = Yo + ax+bx2 "]
[null,{"v":0,"d":"0.00"},{"v":0.1,"d":"0.10"},null,"Yo",{"v":0.3,"d":"0.30"},null,"Yo",{"v":0.1,"d":"0.10"}]
[null,{"v":15,"d":"15.00"},0.25,null,"a",{"v":0.0067,"d":"0.01"},null,"a",{"v":0.0067,"d":"0.01"}]
[null,{"v":30,"d":"30.00"},{"v":0.5,"d":"0.50"},{"$nulls":4},"b",{"v":0.0002,"d":"0.00"}]
[null,{"v":60,"d":"60.00"},{"v":0.7,"d":"0.70"},null,null,{"$f":"F253+F254*'2 Indicadores'!C251","v":{"v":0.3,"d":"0.30"}},{"$f":"I253+I254*'2 Indicadores'!C251+I255*'2 Indicadores'!C251^2","v":{"v":0.1,"d":"0.10"}},{"$f":"IF('2 Indicadores'!C251<30,G256,F256)","v":{"v":0.1,"d":"0.10"}}]
[null,{"v":80,"d":"80.00"},{"v":1,"d":"1.00"}]
[]
[null,"CONVERSÃO DE UNIDADES"]
[null,null,"De","Para",null,null,"De","Para",null,"De","Para"]
[null,null,"Unidade","Unidade","Fator de conversão",null,"%; dag/kg","g/dm3; g/kg; g/L",null,"g/dm3; g/kg; g/L","%; dag/kg"]
[null,"Teor de argila","%; dag/kg","g/dm3; g/kg; g/L",10,null,null,{"$f":"G262*10","v":0},null,null,{"$f":"J262/10","v":0}]
[null,"Matéria Orgânica","%; dag/kg","g/dm3; g/kg; g/L",10,null,null,{"$f":"G263*10","v":0},null,null,{"$f":"J263/10","v":0}]
[null,null,"De","Para"]
[null,null,"Unit ","Unit ","Conversion factor"]
[null,"P disponível","mg/dm3; mg/kg; mg/L","ppm",1]
[null,"K trocável","mg/dm3; mg/kg; mg/L","ppm",1]
[null,null,"De","Para",null,null,"De","Para",null,"De","Para"]
[null,null,"Unidade","Unidade","Fator de conversão",null,"cmolc/dm3","mmolc/dm3",null,"mmolc/dm3","cmolc/dm3"]
[null,"Ca trocável","cmolc/dm3; meq/100 cm3; meq/ 100ml; meq/ 100g","mmolc/dm3; mmolc/kg",10,null,null,{"$f":"G270*10","v":0},null,null,{"$f":"J270/10","v":0}]
[null,"Mg trocável","cmolc/dm3. meq/100 cm3; meq/ 100ml; meq/ 100g","mmolc/dm3; mmolc/kg",10,null,null,{"$f":"G271*10","v":0},null,null,{"$f":"J271/10","v":0}]
[null,"Al trocável","cmolc/dm3. meq/100 cm3; meq/ 100ml; meq/ 100g","mmolc/dm3; mmolc/kg",10,null,null,{"$f":"G272*10","v":0},null,null,{"$f":"J272/10","v":0}]
[null,"CTC","cmolc/dm3. meq/100 cm3; meq/ 100ml; meq/ 100g","mmolc/dm3; mmolc/kg",10,null,null,{"$f":"G273*10","v":0},null,null,{"$f":"J273/10","v":0}]
[null,null,"De","Para"]
[null,null,"Unidade","Unidade","Fator de conversão"]
[null,"Macronutrientes","%","g/kg",10]
[null,"Micronutrientes","ppm","mg/kg",1]
[null,"P ","P2O5","P",0.437]
[null,"K ","K2O","K",{"v":0.83,"d":"0.830"}]
[null,"Ca ","CaO","Ca",0.715]
[null,"Mg","MgO","Mg",0.602]
[]
[{"$nulls":10},"UNIDADES VIII",null,"UNIDADES IX"]
[11,"Fator de Ponderação\t\t",null,null,"Fórmulas",null,"< 5%","5% - 10%","> 10%",null,"Inicial",null,"Redução"]
[null,"item 15.1","Ponderação",{"$nulls":3},{"$f":"IF(E293>0,1,\" \")","v":" "},{"$f":"IF(G293>0,1,\" \")","v":" "},{"$f":"IF(I293>0,1,\" \")","v":" "},null,"Intermediário",null,"Inalterado"]
[null,"< 5%",0.55,{"$nulls":3},{"$f":"IF(E291>0,1,\" \")","v":" "},{"$f":"IF(G291>0,1,\" \")","v":" "},{"$f":"IF(I291>0,1,\" \")","v":" "},null,"Avançado",null,"Intensificação"]
[null,"5 - 10%",0.45,{"$nulls":3},{"$f":"IF(E289>0,1,\" \")","v":" "},{"$f":"IF(G289>0,1,\" \")","v":" "},{"$f":"IF(I289>0,1,\" \")","v":" "}]
[null,"> 10%",0.35,null,{"$f":"IF('2 Indicadores'!$F$270<0.05,'2 Indicadores'!$E$270,0)","v":0},null,{"$f":"IF('2 Indicadores'!$F$270>=0.05,'2 Indicadores'!$E$270,0)","v":0},null,{"$f":"IF('2 Indicadores'!$F$270>0.1,'2 Indicadores'!$E$270,0)","v":0}]
[null,"item 15.1","Ponderação",null,{"$f":"IF('2 Indicadores'!D270=Fórmulas!K284,Fórmulas!E288,0)","v":0},null,{"$f":"IF(I288>0.001,0,IF('2 Indicadores'!D270=Fórmulas!K284,Fórmulas!G288,0))","v":0},null,{"$f":"IF('2 Indicadores'!D270=Fórmulas!K284,Fórmulas!I288,0)","v":0}]
[null,"Avançado",{"v":0.5,"d":"0.50"},null,{"$f":"IF('2 Indicadores'!$F$270<0.05,'2 Indicadores'!$E$270,0)","v":0},null,{"$f":"IF('2 Indicadores'!$F$270>=0.05,'2 Indicadores'!$E$270,0)","v":0},null,{"$f":"IF('2 Indicadores'!$F$270>0.1,'2 Indicadores'!$E$270,0)","v":0}]
[null,"Intermediário",{"v":0.8,"d":"0.80"},null,{"$f":"IF('2 Indicadores'!D270=Fórmulas!K285,Fórmulas!E290,0)","v":0},null,{"$f":"IF(I290>0.001,0,IF('2 Indicadores'!D270=Fórmulas!K285,Fórmulas!G290,0))","v":0},null,{"$f":"IF('2 Indicadores'!D270=Fórmulas!K285,Fórmulas!I290,0)","v":0},null,{"$f":"+C286","v":0.55}]
[null,"Inicial",1,null,{"$f":"IF('2 Indicadores'!$F$270<0.05,'2 Indicadores'!$E$270,0)","v":0},null,{"$f":"IF('2 Indicadores'!$F$270>=0.05,'2 Indicadores'!$E$270,0)","v":0},null,{"$f":"IF('2 Indicadores'!$F$270>0.1,'2 Indicadores'!$E$270,0)","v":0},null,{"$f":"+C287","v":0.45}]
[null,"item 15.2","Ponderação",null,{"$f":"IF('2 Indicadores'!D270=Fórmulas!K286,Fórmulas!E292,0)","v":0},null,{"$f":"IF(I292>0.001,0,IF('2 Indicadores'!D270=Fórmulas!K286,Fórmulas!G292,0))","v":0},null,{"$f":"IF('2 Indicadores'!D270=Fórmulas!K286,Fórmulas!I292,0)","v":0},null,{"$f":"+C288","v":0.35}]
[null,"Redução",1.2,null,{"$f":"IF(E296>0,E296,0)+IF(F296>0,F296,0)+IF(G296>0,G296,0)","v":{"v":0,"d":"0.00"}}]
[null,"Inalterado",{"v":1,"d":"1.0"},null,{"$f":"IF('2 Indicadores'!D273=M284,1,0)","v":{"v":0,"d":"0.00"}},{"$f":"IF('2 Indicadores'!D273=M285,1,0)","v":{"v":0,"d":"0.00"}},{"$f":"IF('2 Indicadores'!D273=M286,1,0)","v":{"v":0,"d":"0.00"}}]
[null,"Intensificação",0.8,null,{"$f":"IF(E289>0,'2 Indicadores'!G270*Fórmulas!K291,0)+IF(E291>0,'2 Indicadores'!G271*Fórmulas!K291,0)+IF(E293>0,'2 Indicadores'!G272*Fórmulas!K291,0)","v":0},{"$f":"IF(G289>0,'2 Indicadores'!G270*Fórmulas!K292,0)+IF(G291>0,'2 Indicadores'!G271*Fórmulas!K292,0)+IF(G293>0,'2 Indicadores'!G272*Fórmulas!K292,0)","v":0},{"$f":"IF(I289>0,'2 Indicadores'!G270*Fórmulas!K293,0)+IF(I291>0,'2 Indicadores'!G271*Fórmulas!K293,0)+IF(I293>0,'2 Indicadores'!G272*Fórmulas!K293,0)","v":0}]
[{"$nulls":4},"Fórmula - verifica a proporção da área em processo de degradação em relação à área total e ao grau de intensidade do fenômeno. Após o cálculo, multiplica o valor final pelo fator 1,2, se verificada tendência de redução do estádio de degradação ou pelo fator 0,8, se a tendência é de intensificação do estádio de degradação."]
[]
[]
[]
[null,"Fator de Ponderação\t\t",null,null,"Fórmulas"]
[null,{"$f":"+'2 Indicadores'!C278","v":"Presença abaulamento das estradas\t"},{"v":1,"d":"1.0"},null,{"$f":"IF(F302>1,1,F302)","v":{"v":0,"d":"0.00"}},{"$f":"IF(G302>0,H302/G302,H302)","v":{"v":0,"d":"0.00"}},{"$f":"COUNTIF('2 Indicadores'!E278:E283,\">=0\")","v":0},{"$f":"('2 Indicadores'!E278*0.8+'2 Indicadores'!E279*0.8+'2 Indicadores'!E280*0.8+K302+K304)","v":{"v":0,"d":"0.00"}},{"$f":"IF(E302>0,I303,E303*1.1)","v":{"v":0,"d":"0.00"}},{"$f":"IF(I302>1,1,I302)","v":{"v":0,"d":"0.00"}},{"$f":"IF('2 Indicadores'!E282=\"\",0,1-'2 Indicadores'!E282)","v":{"v":0,"d":"0%"}},{"$f":"IF(ISBLANK('2 Indicadores'!H278),Fórmulas!$M$302,\"\")","v":"Não se aplica"},"Não se aplica"]
[null,{"$f":"+'2 Indicadores'!C279","v":"Presença de lombadas - desvio de enxurrada\t"},{"v":1,"d":"1.0"},null,{"$f":"IF(F303>1,1,F303)","v":{"v":0,"d":"0.00"}},{"$f":"IF(G303>0,H303/G303,H303)","v":{"v":0,"d":"0.00"}},{"$f":"COUNTIF('2 Indicadores'!F281:F283,\">=0\")","v":2},{"$f":"'2 Indicadores'!H278*0.8+'2 Indicadores'!H279*0.8+'2 Indicadores'!H280*0.8+K303+K305","v":{"v":0,"d":"0.00"}},{"$f":"IF(E303=0,E302,((2*E302+E303)/3))","v":{"v":0,"d":"0.00"}},{"$f":"IF(OR('2 Indicadores'!E285=\"Sim\",'2 Indicadores'!H285=\"x\"),Fórmulas!J302*0.7,Fórmulas!J302)","v":{"v":0,"d":"0.00"}},{"$f":"IF('2 Indicadores'!H282=\"\",0,1-'2 Indicadores'!H282)","v":{"v":0,"d":"0%"}},{"$f":"IF(ISBLANK('2 Indicadores'!H279),Fórmulas!$M$302,\"\")","v":"Não se aplica"}]
[null,{"$f":"+'2 Indicadores'!C280","v":"Presença de caixas de infiltração\t"},{"v":1,"d":"1.0"},{"$nulls":7},{"$f":"IF('2 Indicadores'!E283=\"\",0,1-'2 Indicadores'!E283)","v":{"v":0,"d":"0%"}},{"$f":"IF(ISBLANK('2 Indicadores'!H280),Fórmulas!$M$302,\"\")","v":"Não se aplica"}]
[null,{"$f":"+'2 Indicadores'!C282","v":"Presença de buracos nas estradas\t"},{"v":1,"d":"1.0"},{"$nulls":7},{"$f":"IF('2 Indicadores'!H283=\"\",0,1-'2 Indicadores'!H283)","v":{"v":0,"d":"0%"}},{"$f":"IF(ISBLANK('2 Indicadores'!H285),Fórmulas!$M$302,\"\")","v":"Não se aplica"}]
[null,{"$f":"+'2 Indicadores'!C283","v":"Presença de sulcos de erosão nas estradas\t\t"},{"v":1,"d":"1.0"}]
[]
[]
[12,"Fórmulas",{"$nulls":4},"pH - Padrões Estabelecidos",{"$nulls":4},"Vegetação nativa"]
[null,"Classificação","Ponderação","",null,null," Res. CONAMA 357/05",null,"Portaria 518/04 M.S.*",null,null,"Pastagem; agricultura; reflorestamento"]
[null,"6 - 9,0",0.7,{"$nulls":3},"Entre  6 e 9 para todas as classes\t\n\t\n\t",null,"Entre  6 e 9,5 na distribuição para consumo humano\t\n\t\n\t",null,null,"Residencial"]
[null,"pH < 6 and > 9,0",0.3,{"$nulls":8},"Ausente"]
[{"$nulls":11},"Alterações de origem doméstica (esgoto, lixo)"]
[null,{"$f":"IF(('2 Indicadores'!D313>=6)*OR('2 Indicadores'!D313<=9),0.7,0.3)","v":{"v":0.3,"d":"0.30"}},{"$f":"IF(('2 Indicadores'!D314>=6)*OR('2 Indicadores'!D314<=9),0.7,0.3)","v":{"v":0.3,"d":"0.30"}},{"$nulls":5},"* Ministério da Saúde",null,null,"Industrial; urbana"]
[{"$nulls":11},"Parcial"]
[{"$nulls":11},"Total"]
[{"$nulls":11},"Ausente"]
[null,"Fórmulas",{"$nulls":4},"Coliformes Termotoleranets - Padrões \t\t\t",{"$nulls":4},"Ausente"]
[null,"Classificação","Ponderação",{"$nulls":3}," CONAMA 357/05",null,"518/04 M.S.*",null,null,"Moderada"]
[null,"UFC < 1.000",0.7,{"$nulls":3},"Valor máximo - 1.000 coliformes fecais por  100 mililitros em 80% ou mais de pelo menos 06 amostras\t\n\t\n\t\n\t\n\t",null,"Para abastecimento humano deve haver ausência em amostra de 100 ml (VMP)\t\n\t\n\t\n\t\n\t",null,null,"Acentuada"]
[null,"UFC > 1.000",0.1,{"$nulls":8},"Transparente"]
[{"$nulls":11},"Turva, cor de chá forte"]
[null,{"$f":"IF(('2 Indicadores'!D315<=999),0.7,0.1)","v":{"v":0.7,"d":"0.70"}},{"$f":"IF(('2 Indicadores'!D316<=999),0.7,0.1)","v":{"v":0.7,"d":"0.70"}},{"$nulls":8},"Opaca ou colorida"]
[{"$nulls":11},"Nenhum"]
[{"$nulls":8},"* Ministério da Saúde",null,null,"Esgoto"]
[{"$nulls":11},"Óleo/Industrial"]
[null,"Fórmulas",{"$nulls":4},"Turbidez - Padrões Estabelecidos\t\t\t",{"$nulls":4},"Pedras/ cascalho"]
[null,"Classificação",null,"Fator de ponderação",null,null," CONAMA 357/05",null,"518/04 M.S.*",null,null,"Lama/areia"]
[null,"< 100 UNT",null,0.7,null,null,"Ambiente lêntico até 100 UNT para a classe 2\t\n\t\n\t\n\t",null,"Turbidez - 5 UNT na distribuição para consumo humano\t\n\t\n\t\n\t",null,null,"Cimento/ canalizado"]
[null,"> 100 UNT",null,0.1]
[]
[null,{"$f":"IF(('2 Indicadores'!D319<=100),0.7,0.1)","v":{"v":0.7,"d":"0.70"}},{"$f":"IF(('2 Indicadores'!D320<=100),0.7,0.1)","v":{"v":0.7,"d":"0.70"}}]
[{"$nulls":8},"* Ministério da Saúde"]
[]
[null,"Fórmulas",{"$nulls":4},"Nitrato Total - Padrões Estabelecidos\t\t\t"]
[null,"Classificação",null,"Fator de ponderação",null,null," CONAMA 357/05",null,"518/04 M.S.*"]
[null,"< 10 mg/L N",null,0.7,null,null,"Valor máximo 10 mg/L N\t\n\t\n\t",null,"Valor máximo de NO3- para classe2: 44,3 mg/L \t\n\t\n\t"]
[null,"> 10 mg/L N ",null,0.1]
[]
[null,{"$f":"IF(('2 Indicadores'!D317<=9.99),0.7,0.1)","v":{"v":0.7,"d":"0.70"}},{"$f":"IF(('2 Indicadores'!D318<=9.99),0.7,0.1)","v":{"v":0.7,"d":"0.70"}},{"$nulls":5},"* Ministério da Saúde"]
[]
[null,"Fórmulas"]
[null,"Indicadores do item 12.1: campos marcados a montante e a jusante, multiplicado pelo peso das colunas (esquerda peso 4, do meio peso 2 e da direita 0) e multiplicado pelos fatores de ponderação de cada item. Os valores totais foram transformados no intervalo de 0 a 100f each item. The total values were transformed in the range of 0 to 100"]
[{"$nulls":9},{"$f":"IF('2 Indicadores'!F313=\"\",0,'2 Indicadores'!F313*'2 Indicadores'!G323)+IF('2 Indicadores'!F319=\"\",0,'2 Indicadores'!F319*'2 Indicadores'!G319)+IF('2 Indicadores'!F315=\"\",0,'2 Indicadores'!F315*'2 Indicadores'!G315)+IF('2 Indicadores'!F317=\"\",0,'2 Indicadores'!F317*'2 Indicadores'!G317)+IF('2 Indicadores'!D322=\"\",0,'2 Indicadores'!D322*'2 Indicadores'!G322)","v":{"v":0,"d":"0.00"}},{"$f":"IF('2 Indicadores'!F313=\"\",0,'2 Indicadores'!G323)+IF('2 Indicadores'!F319=\"\",0,'2 Indicadores'!G319)+IF('2 Indicadores'!F315=\"\",0,'2 Indicadores'!G315)+IF('2 Indicadores'!F317=\"\",0,'2 Indicadores'!G317)+IF('2 Indicadores'!D322=\"\",0,'2 Indicadores'!G322)","v":4},{"$f":"+Fórmulas!J344/K344","v":{"v":0,"d":"0.00"}}]
[{"$nulls":9},{"$f":"IF('2 Indicadores'!F314=\"\",0,'2 Indicadores'!F314*'2 Indicadores'!G323)+IF('2 Indicadores'!F320=\"\",0,'2 Indicadores'!F320*'2 Indicadores'!G319)+IF('2 Indicadores'!F316=\"\",0,'2 Indicadores'!F316*'2 Indicadores'!G315)+IF('2 Indicadores'!F318=\"\",0,'2 Indicadores'!F318*'2 Indicadores'!G317)+IF('2 Indicadores'!D323=\"\",0,'2 Indicadores'!D323*'2 Indicadores'!G322)","v":{"v":0,"d":"0.00"}},{"$f":"IF('2 Indicadores'!F314=\"\",0,'2 Indicadores'!G323)+IF('2 Indicadores'!F320=\"\",0,'2 Indicadores'!G319)+IF('2 Indicadores'!F316=\"\",0,'2 Indicadores'!G315)+IF('2 Indicadores'!F318=\"\",0,'2 Indicadores'!G317)+IF('2 Indicadores'!D323=\"\",0,'2 Indicadores'!G322)","v":4},{"$f":"+Fórmulas!J345/K345","v":{"v":0,"d":"0.00"}}]
[]
[]
[null,"Fórmula resultado parcial\t\t"]
[null,"Média dos resultados dos parâmetros do item 12.1 considerando os fatores de ponderação em cada item"]
[{"$nulls":5},{"$f":"IF('2 Indicadores'!D325<'2 Indicadores'!D326,'2 Indicadores'!D325,'2 Indicadores'!D326)","v":{"v":0,"d":"0.00"}}]
[]
[null,"Fórmulas",null,null,"pH "]
[null,"Classificação","Ponderação",null," 518/04 M.S.*"]
[null,"6 - 9,5",0.7,null,"Entre  6 e 9,5 na distribuição para consumo humano"]
[null,"pH < 6 and > 9,5",0.3,null,"* Ministério da Saúde"]
[null,{"$f":"IF(('2 Indicadores'!D331>=6)*OR('2 Indicadores'!D331<=9.5),0.7,0.3)","v":{"v":0.3,"d":"0.30"}}]
[]
[]
[null,"Fórmulas",null,null,"Coliformes termotolerantes"]
[null,"Classificação","Ponderação",null,"CONAMA 396/08",null,"518/04 M.S.*"]
[null,"absent",0.7,null,"Para abastecimento humano - ausência em amostra de 100 mL (VMP); para dessedentação de animais 200/100 mL\t\n\t\n\t\n\t\n\t",null,"Para abastecimento humano deve haver ausência em amostra de 100 mL (VMP)"]
[null,">0",0.1]
[null,{"$f":"IF('2 Indicadores'!D332=0,0.701,0.1)","v":{"v":0.701,"d":"0.70"}}]
[]
[{"$nulls":4},"* Ministério da Saúde"]
[null,"Fórmulas",null,null,"Nitrato Total"]
[null,"Classificação","Ponderação",null,"CONAMA 396/08",null,"518/04 M.S.*"]
[null,"<= 10",0.7,null,"Segundo essa resolução o valor máximo permitido (VMP) para consumo humano é de 10 mg.  L-1 de N)",null,"Valor máximo permitido 10 mg L-1 de N"]
[null,"> 10",0.1]
[null,{"$f":"IF('2 Indicadores'!D333<=10,0.701,0.1)","v":{"v":0.701,"d":"0.70"}}]
[]
[]
[{"$nulls":4},"* Ministério da Saúde"]
[null,"Fórmula resultado parcial\t\t",{"$nulls":3},"Fórmula resultado final"]
[null,"Média dos resultados dos parâmetros do item 12.2 e média dos resultados dos parâmetros do item 12.3",{"$nulls":3},"Fórmula - resultado parcial da qualidade da água superficial x 2 + resultado superficial da qualidade da água subterrânea/3"]
[]
[]
[13,"Fator de Ponderação\t\t"]
[null,"Classificação","Ponderação"]
[null,"não utiliza",{"v":1,"d":"1.0"},null,"Vulnerabilidade do talhão: item 13.1  = 1 a 3 (1); 4 a 9 (2); 12 a 27 (3)\t\t\t\t\t\t\t\t"]
[null,"Rc: 1 a 2",{"v":0.6,"d":"0.60"}]
[null,"Rc: 2 e 4",{"v":0.3,"d":"0.30"}]
[null,"Rc: 6 e 9",{"v":0.1,"d":"0.10"}]
[]
[null,"Fórmulas"]
[null,null,{"$f":"'2 Indicadores'!D340","v":{"v":0,"d":"0.00"}},{"$f":"'2 Indicadores'!E340","v":{"v":0,"d":"0.00"}},{"$f":"'2 Indicadores'!F340","v":{"v":0,"d":"0.00"}},null,null,{"$f":"Fórmulas!D411","v":{"v":0,"d":"0.00"}},{"$f":"Fórmulas!E411","v":{"v":0,"d":"0.00"}},{"$f":"Fórmulas!F411","v":{"v":0,"d":"0.00"}},{"$f":"Fórmulas!G411","v":{"v":0,"d":"0.00"}},{"$f":"Fórmulas!H411","v":{"v":0,"d":"0.00"}},{"$f":"Fórmulas!I411","v":{"v":0,"d":"0.00"}},{"$f":"Fórmulas!J411","v":{"v":0,"d":"0.00"}}]
[null,"Pci",{"$f":"IF('2 Indicadores'!D350>0.001,((1/LOG10('2 Indicadores'!D350))*(LOG10('2 Indicadores'!D351))*'2 Indicadores'!D349),\" \")","v":{"$error":"#VALUE!"}},{"$f":"IF('2 Indicadores'!E350>0.001,((1/LOG10('2 Indicadores'!E350))*(LOG10('2 Indicadores'!E351))*'2 Indicadores'!E349),\" \")","v":{"$error":"#VALUE!"}},{"$f":"IF('2 Indicadores'!F350>0.001,((1/LOG10('2 Indicadores'!F350))*(LOG10('2 Indicadores'!F351))*'2 Indicadores'!F349),\" \")","v":{"$error":"#VALUE!"}},null,null,{"$f":"IF(Fórmulas!D422>0.001,((1/LOG10(Fórmulas!D422))*(LOG10(Fórmulas!D423))*Fórmulas!D421),\" \")","v":{"$error":"#VALUE!"}},{"$f":"IF(Fórmulas!E422>0.001,((1/LOG10(Fórmulas!E422))*(LOG10(Fórmulas!E423))*Fórmulas!E421),\" \")","v":{"$error":"#VALUE!"}},{"$f":"IF(Fórmulas!F422>0.001,((1/LOG10(Fórmulas!F422))*(LOG10(Fórmulas!F423))*Fórmulas!F421),\" \")","v":{"$error":"#VALUE!"}},{"$f":"IF(Fórmulas!G422>0.001,((1/LOG10(Fórmulas!G422))*(LOG10(Fórmulas!G423))*Fórmulas!G421),\" \")","v":{"$error":"#VALUE!"}},{"$f":"IF(Fórmulas!H422>0.001,((1/LOG10(Fórmulas!H422))*(LOG10(Fórmulas!H423))*Fórmulas!H421),\" \")","v":{"$error":"#VALUE!"}},{"$f":"IF(Fórmulas!I422>0.001,((1/LOG10(Fórmulas!I422))*(LOG10(Fórmulas!I423))*Fórmulas!I421),\" \")","v":{"$error":"#VALUE!"}},{"$f":"IF(Fórmulas!J422>0.001,((1/LOG10(Fórmulas!J422))*(LOG10(Fórmulas!J423))*Fórmulas!J421),\" \")","v":{"$error":"#VALUE!"}}]
[null,"Vulnerabilidade",{"$f":"IF('2 Indicadores'!D361>0.001,('2 Indicadores'!D361*'2 Indicadores'!D362*'2 Indicadores'!D363),0)","v":{"v":0,"d":"0.00"}},{"$f":"IF('2 Indicadores'!E361>0.001,('2 Indicadores'!E361*'2 Indicadores'!E362*'2 Indicadores'!E363),0)","v":{"v":0,"d":"0.00"}},{"$f":"IF('2 Indicadores'!F361>0.001,('2 Indicadores'!F361*'2 Indicadores'!F362*'2 Indicadores'!F363),0)","v":{"v":0,"d":"0.00"}},null,null,{"$f":"IF(Fórmulas!D432>0.001,(Fórmulas!D432*Fórmulas!D433*Fórmulas!D434),0)","v":{"v":0,"d":"0.00"}},{"$f":"IF(Fórmulas!E432>0.001,(Fórmulas!E432*Fórmulas!E433*Fórmulas!E434),0)","v":{"v":0,"d":"0.00"}},{"$f":"IF(Fórmulas!F432>0.001,(Fórmulas!F432*Fórmulas!F433*Fórmulas!F434),0)","v":{"v":0,"d":"0.00"}},{"$f":"IF(Fórmulas!G432>0.001,(Fórmulas!G432*Fórmulas!G433*Fórmulas!G434),0)","v":{"v":0,"d":"0.00"}},{"$f":"IF(Fórmulas!H432>0.001,(Fórmulas!H432*Fórmulas!H433*Fórmulas!H434),0)","v":{"v":0,"d":"0.00"}},{"$f":"IF(Fórmulas!I432>0.001,(Fórmulas!I432*Fórmulas!I433*Fórmulas!I434),0)","v":{"v":0,"d":"0.00"}},{"$f":"IF(Fórmulas!J432>0.001,(Fórmulas!J432*Fórmulas!J433*Fórmulas!J434),0)","v":{"v":0,"d":"0.00"}}]
[]
[null,"Risco",{"$f":"IF('2 Indicadores'!D364>0.01,('2 Indicadores'!D364*'2 Indicadores'!D353),\" \")","v":{"$error":"#VALUE!"}},{"$f":"IF('2 Indicadores'!E364>0.01,('2 Indicadores'!E364*'2 Indicadores'!E353),\" \")","v":{"$error":"#VALUE!"}},{"$f":"IF('2 Indicadores'!F364>0.01,('2 Indicadores'!F364*'2 Indicadores'!F353),\" \")","v":{"$error":"#VALUE!"}},null,null,{"$f":"IF(Fórmulas!D435>0.01,(Fórmulas!D435*Fórmulas!D425),\" \")","v":{"$error":"#VALUE!"}},{"$f":"IF(Fórmulas!E435>0.01,(Fórmulas!E435*Fórmulas!E425),\" \")","v":{"$error":"#VALUE!"}},{"$f":"IF(Fórmulas!F435>0.01,(Fórmulas!F435*Fórmulas!F425),\" \")","v":{"$error":"#VALUE!"}},{"$f":"IF(Fórmulas!G435>0.01,(Fórmulas!G435*Fórmulas!G425),\" \")","v":{"$error":"#VALUE!"}},{"$f":"IF(Fórmulas!H435>0.01,(Fórmulas!H435*Fórmulas!H425),\" \")","v":{"$error":"#VALUE!"}},{"$f":"IF(Fórmulas!I435>0.01,(Fórmulas!I435*Fórmulas!I425),\" \")","v":{"$error":"#VALUE!"}},{"$f":"IF(Fórmulas!J435>0.01,(Fórmulas!J435*Fórmulas!J425),\" \")","v":{"$error":"#VALUE!"}}]
[null,{"$f":"IF(C387=B394,C388,IF(D387=B394,D388,IF(E387=B394,E388,IF(F387=B394,F388,IF(G387=B394,G388,IF(H387=B394,H388,IF(I387=B394,I388,IF(J387=B394,J388,IF(K387=B394,K388,IF(L387=B394,L388,IF(M387=B394,M388,IF(N387=B394,N388,IF(Fórmulas!B399=B394,Fórmulas!B400,IF(Fórmulas!C399=B394,Fórmulas!C400,IF('2 Indicadores'!BT344=B394,'2 Indicadores'!BT345,IF(Fórmulas!D399=B394,Fórmulas!D400,IF(Fórmulas!E399=B394,Fórmulas!E400,IF(Fórmulas!F399=B394,Fórmulas!F400,IF(Fórmulas!G399=B394,Fórmulas!G400,IF(Fórmulas!H399=B394,Fórmulas!H400,IF(Fórmulas!I399=B394,Fórmulas!I400,IF(Fórmulas!J399=B394,Fórmulas!J400,IF(Fórmulas!K399=B394,Fórmulas!K400,IF(Fórmulas!L399=B394,Fórmulas!L400,IF(Fórmulas!M399=B394,Fórmulas!M400,IF(Fórmulas!N399=B394,Fórmulas!N400,IF(Fórmulas!B405=B394,Fórmulas!B406,IF(Fórmulas!C405=B394,Fórmulas!C406,IF(Fórmulas!D405=B394,Fórmulas!D406)))))))))))))))))))))))))))))","v":{"$error":"#VALUE!"}}]
[]
[null,"Cálculo do risco"]
[null,{"$f":"MAX(C387:N387)","v":{"$error":"#VALUE!"}}]
[null,{"$f":"IF(OR(B394=0.83,B394<0.83),1,IF(OR(AND(0.83<B394,B394<=1.66)),2,IF(B394>1.66,3,\"\")))","v":{"$error":"#VALUE!"}},{"$f":"B391","v":{"$error":"#VALUE!"}}]
[null,{"$f":"B395*C396","v":{"$error":"#VALUE!"}},{"$f":"IF(OR(AND(1<=C395,C395<=3)),1,IF(OR(AND(3<C395,C395<=9)),2,IF(C395>9,3)))","v":{"$error":"#VALUE!"}}]
[]
[null,{"$f":"Fórmulas!K411","v":{"v":0,"d":"0.00"}},{"$f":"Fórmulas!L411","v":{"v":0,"d":"0.00"}},{"$f":"Fórmulas!D440","v":{"v":0,"d":"0.00"}},{"$f":"Fórmulas!E440","v":{"v":0,"d":"0.00"}},{"$f":"Fórmulas!F440","v":{"v":0,"d":"0.00"}},{"$f":"Fórmulas!G440","v":{"v":0,"d":"0.00"}},{"$f":"Fórmulas!H440","v":{"v":0,"d":"0.00"}},{"$f":"Fórmulas!I440","v":{"v":0,"d":"0.00"}},{"$f":"Fórmulas!J440","v":{"v":0,"d":"0.00"}},{"$f":"Fórmulas!K440","v":{"v":0,"d":"0.00"}},{"$f":"Fórmulas!L440","v":{"v":0,"d":"0.00"}},{"$f":"Fórmulas!D468","v":{"v":0,"d":"0.00"}},{"$f":"Fórmulas!E468","v":{"v":0,"d":"0.00"}}]
[null,{"$f":"IF(Fórmulas!K422>0.001,((1/LOG10(Fórmulas!K422))*(LOG10(Fórmulas!K423))*Fórmulas!K421),\" \")","v":{"$error":"#VALUE!"}},{"$f":"IF(Fórmulas!L422>0.001,((1/LOG10(Fórmulas!L422))*(LOG10(Fórmulas!L423))*Fórmulas!L421),\" \")","v":{"$error":"#VALUE!"}},{"$f":"IF(Fórmulas!D451>0.001,((1/LOG10(Fórmulas!D451))*(LOG10(Fórmulas!D452))*Fórmulas!D450),\" \")","v":{"$error":"#VALUE!"}},{"$f":"IF(Fórmulas!E451>0.001,((1/LOG10(Fórmulas!E451))*(LOG10(Fórmulas!E452))*Fórmulas!E450),\" \")","v":{"$error":"#VALUE!"}},{"$f":"IF(Fórmulas!F451>0.001,((1/LOG10(Fórmulas!F451))*(LOG10(Fórmulas!F452))*Fórmulas!F450),\" \")","v":{"$error":"#VALUE!"}},{"$f":"IF(Fórmulas!G451>0.001,((1/LOG10(Fórmulas!G451))*(LOG10(Fórmulas!G452))*Fórmulas!G450),\" \")","v":{"$error":"#VALUE!"}},{"$f":"IF(Fórmulas!H451>0.001,((1/LOG10(Fórmulas!H451))*(LOG10(Fórmulas!H452))*Fórmulas!H450),\" \")","v":{"$error":"#VALUE!"}},{"$f":"IF(Fórmulas!I451>0.001,((1/LOG10(Fórmulas!I451))*(LOG10(Fórmulas!I452))*Fórmulas!I450),\" \")","v":{"$error":"#VALUE!"}},{"$f":"IF(Fórmulas!J451>0.001,((1/LOG10(Fórmulas!J451))*(LOG10(Fórmulas!J452))*Fórmulas!J450),\" \")","v":{"$error":"#VALUE!"}},{"$f":"IF(Fórmulas!K451>0.001,((1/LOG10(Fórmulas!K451))*(LOG10(Fórmulas!K452))*Fórmulas!K450),\" \")","v":{"$error":"#VALUE!"}},{"$f":"IF(Fórmulas!L451>0.001,((1/LOG10(Fórmulas!L451))*(LOG10(Fórmulas!L452))*Fórmulas!L450),\" \")","v":{"$error":"#VALUE!"}},{"$f":"IF(Fórmulas!D479>0.001,((1/LOG10(Fórmulas!D479))*(LOG10(Fórmulas!D480))*Fórmulas!D478),\" \")","v":{"$error":"#VALUE!"}},{"$f":"IF(Fórmulas!E479>0.001,((1/LOG10(Fórmulas!E479))*(LOG10(Fórmulas!E480))*Fórmulas!E478),\" \")","v":{"$error":"#VALUE!"}}]
[null,{"$f":"IF(Fórmulas!K432>0.001,(Fórmulas!K432*Fórmulas!K433*Fórmulas!K434),0)","v":{"v":0,"d":"0.00"}},{"$f":"IF(Fórmulas!L432>0.001,(Fórmulas!L432*Fórmulas!L433*Fórmulas!L434),0)","v":{"v":0,"d":"0.00"}},{"$f":"IF(Fórmulas!D461>0.001,(Fórmulas!D461*Fórmulas!D462*Fórmulas!D463),0)","v":{"v":0,"d":"0.00"}},{"$f":"IF(Fórmulas!E461>0.001,(Fórmulas!E461*Fórmulas!E462*Fórmulas!E463),0)","v":{"v":0,"d":"0.00"}},{"$f":"IF(Fórmulas!F461>0.001,(Fórmulas!F461*Fórmulas!F462*Fórmulas!F463),0)","v":{"v":0,"d":"0.00"}},{"$f":"IF(Fórmulas!G461>0.001,(Fórmulas!G461*Fórmulas!G462*Fórmulas!G463),0)","v":{"v":0,"d":"0.00"}},{"$f":"IF(Fórmulas!H461>0.001,(Fórmulas!H461*Fórmulas!H462*Fórmulas!H463),0)","v":{"v":0,"d":"0.00"}},{"$f":"IF(Fórmulas!I461>0.001,(Fórmulas!I461*Fórmulas!I462*Fórmulas!I463),0)","v":{"v":0,"d":"0.00"}},{"$f":"IF(Fórmulas!J461>0.001,(Fórmulas!J461*Fórmulas!J462*Fórmulas!J463),0)","v":{"v":0,"d":"0.00"}},{"$f":"IF(Fórmulas!K461>0.001,(Fórmulas!K461*Fórmulas!K462*Fórmulas!K463),0)","v":{"v":0,"d":"0.00"}},{"$f":"IF(Fórmulas!L461>0.001,(Fórmulas!L461*Fórmulas!L462*Fórmulas!L463),0)","v":{"v":0,"d":"0.00"}},{"$f":"IF(Fórmulas!D489>0.001,(Fórmulas!D489*Fórmulas!D490*Fórmulas!D491),0)","v":{"v":0,"d":"0.00"}},{"$f":"IF(Fórmulas!E489>0.001,(Fórmulas!E489*Fórmulas!E490*Fórmulas!E491),0)","v":{"v":0,"d":"0.00"}}]
[]
[null,{"$f":"IF(Fórmulas!K435>0.01,(Fórmulas!K435*Fórmulas!K425),\" \")","v":{"$error":"#VALUE!"}},{"$f":"IF(Fórmulas!L435>0.01,(Fórmulas!L435*Fórmulas!L425),\" \")","v":{"$error":"#VALUE!"}},{"$f":"IF(Fórmulas!D464>0.01,(Fórmulas!D464*Fórmulas!D454),\" \")","v":{"$error":"#VALUE!"}},{"$f":"IF(Fórmulas!E464>0.01,(Fórmulas!E464*Fórmulas!E454),\" \")","v":{"$error":"#VALUE!"}},{"$f":"IF(Fórmulas!F464>0.01,(Fórmulas!F464*Fórmulas!F454),\" \")","v":{"$error":"#VALUE!"}},{"$f":"IF(Fórmulas!G464>0.01,(Fórmulas!G464*Fórmulas!G454),\" \")","v":{"$error":"#VALUE!"}},{"$f":"IF(Fórmulas!H464>0.01,(Fórmulas!H464*Fórmulas!H454),\" \")","v":{"$error":"#VALUE!"}},{"$f":"IF(Fórmulas!I464>0.01,(Fórmulas!I464*Fórmulas!I454),\" \")","v":{"$error":"#VALUE!"}},{"$f":"IF(Fórmulas!J464>0.01,(Fórmulas!J464*Fórmulas!J454),\" \")","v":{"$error":"#VALUE!"}},{"$f":"IF(Fórmulas!K464>0.01,(Fórmulas!K464*Fórmulas!K454),\" \")","v":{"$error":"#VALUE!"}},{"$f":"IF(Fórmulas!L464>0.01,(Fórmulas!L464*Fórmulas!L454),\" \")","v":{"$error":"#VALUE!"}},{"$f":"IF(Fórmulas!D492>0.01,(Fórmulas!D492*Fórmulas!D482),\" \")","v":{"$error":"#VALUE!"}},{"$f":"IF(Fórmulas!E492>0.01,(Fórmulas!E492*Fórmulas!E482),\" \")","v":{"$error":"#VALUE!"}}]
[]
[null,{"$f":"Fórmulas!F468","v":{"v":0,"d":"0.00"}},{"$f":"Fórmulas!G468","v":{"v":0,"d":"0.00"}},{"$f":"Fórmulas!H468","v":{"v":0,"d":"0.00"}}]
[null,{"$f":"IF(Fórmulas!F479>0.001,((1/LOG10(Fórmulas!F479))*(LOG10(Fórmulas!F480))*Fórmulas!F478),\" \")","v":{"$error":"#VALUE!"}},{"$f":"IF(Fórmulas!G479>0.001,((1/LOG10(Fórmulas!G479))*(LOG10(Fórmulas!G480))*Fórmulas!G478),\" \")","v":{"$error":"#VALUE!"}},{"$f":"IF(Fórmulas!H479>0.001,((1/LOG10(Fórmulas!H479))*(LOG10(Fórmulas!H480))*Fórmulas!H478),\" \")","v":{"$error":"#VALUE!"}},{"$f":"IF(Fórmulas!I479>0.001,((1/LOG10(Fórmulas!I479))*(LOG10(Fórmulas!I480))*Fórmulas!I478),\" \")","v":{"$error":"#VALUE!"}}]
[null,{"$f":"IF(Fórmulas!F489>0.001,(Fórmulas!F489*Fórmulas!F490*Fórmulas!F491),0)","v":{"v":0,"d":"0.00"}},{"$f":"IF(Fórmulas!G489>0.001,(Fórmulas!G489*Fórmulas!G490*Fórmulas!G491),0)","v":{"v":0,"d":"0.00"}},{"$f":"IF(Fórmulas!H489>0.001,(Fórmulas!H489*Fórmulas!H490*Fórmulas!H491),0)","v":{"v":0,"d":"0.00"}},{"$f":"IF(Fórmulas!I489>0.001,(Fórmulas!I489*Fórmulas!I490*Fórmulas!I491),0)","v":{"v":0,"d":"0.00"}}]
[]
[null,{"$f":"IF(Fórmulas!F492>0.01,(Fórmulas!F492*Fórmulas!F482),\" \")","v":{"$error":"#VALUE!"}},{"$f":"IF(Fórmulas!G492>0.01,(Fórmulas!G492*Fórmulas!G482),\" \")","v":{"$error":"#VALUE!"}},{"$f":"IF(Fórmulas!H492>0.01,(Fórmulas!H492*Fórmulas!H482),\" \")","v":{"$error":"#VALUE!"}},{"$f":"IF(Fórmulas!I492>0.01,(Fórmulas!I492*Fórmulas!I482),\" \")","v":{"$error":"#VALUE!"}}]
[]
[]
[null,"Nome comercial do produto (selecione)\t",{"$nulls":10},1]
[null,"Ingrediente ativo (%)\t"]
[null,"Descrição da cultura\t",{"$nulls":10},2]
[null,"Área (ha)\t",{"$nulls":10},3]
[null,"Volume aplicado L/ha ou kg/ha \t"]
[null,"Volume total aplicado por produto\t",null,{"$f":"+D415*D414","v":{"v":0,"d":"0.0"}},{"v":0,"d":"0.0"},{"v":0,"d":"0.0"},{"v":0,"d":"0.0"},{"v":0,"d":"0.0"},{"v":0,"d":"0.0"},{"v":0,"d":"0.0"},{"v":0,"d":"0.0"},{"v":0,"d":"0.0"}]
[]
[null,"Ingrediente ativo do produto \t",null,{"$f":"IF(D$414>0,(HLOOKUP(D$411,'Base de dados'!$B$5:$AIN$11,$M418,0)),\"\")","v":""},{"$f":"IF(E$414>0,(HLOOKUP(E$411,'Base de dados'!$B$5:$AIN$11,$M418,0)),\"\")","v":""},{"$f":"IF(F$414>0,(HLOOKUP(F$411,'Base de dados'!$B$5:$AIN$11,$M418,0)),\"\")","v":""},{"$f":"IF(G$414>0,(HLOOKUP(G$411,'Base de dados'!$B$5:$AIN$11,$M418,0)),\"\")","v":""},{"$f":"IF(H$414>0,(HLOOKUP(H$411,'Base de dados'!$B$5:$AIN$11,$M418,0)),\"\")","v":""},{"$f":"IF(I$414>0,(HLOOKUP(I$411,'Base de dados'!$B$5:$AIN$11,$M418,0)),\"\")","v":""},{"$f":"IF(J$414>0,(HLOOKUP(J$411,'Base de dados'!$B$5:$AIN$11,$M418,0)),\"\")","v":""},{"$f":"IF(K$414>0,(HLOOKUP(K$411,'Base de dados'!$B$5:$AIN$11,$M418,0)),\"\")","v":""},{"$f":"IF(L$414>0,(HLOOKUP(L$411,'Base de dados'!$B$5:$AIN$11,$M418,0)),\"\")","v":""},2]
[null,"Toxicidade para peixes - 96h LC50 (mg L-1)\t",null,{"$f":"IF(D$414>0,(HLOOKUP(D$411,'Base de dados'!$B$5:$AIN$11,$M419,0)),\"\")","v":""},{"$f":"IF(E$414>0,(HLOOKUP(E$411,'Base de dados'!$B$5:$AIN$11,$M419,0)),\"\")","v":""},{"$f":"IF(F$414>0,(HLOOKUP(F$411,'Base de dados'!$B$5:$AIN$11,$M419,0)),\"\")","v":""},{"$f":"IF(G$414>0,(HLOOKUP(G$411,'Base de dados'!$B$5:$AIN$11,$M419,0)),\"\")","v":""},{"$f":"IF(H$414>0,(HLOOKUP(H$411,'Base de dados'!$B$5:$AIN$11,$M419,0)),\"\")","v":""},{"$f":"IF(I$414>0,(HLOOKUP(I$411,'Base de dados'!$B$5:$AIN$11,$M419,0)),\"\")","v":""},{"$f":"IF(J$414>0,(HLOOKUP(J$411,'Base de dados'!$B$5:$AIN$11,$M419,0)),\"\")","v":""},{"$f":"IF(K$414>0,(HLOOKUP(K$411,'Base de dados'!$B$5:$AIN$11,$M419,0)),\"\")","v":""},{"$f":"IF(L$414>0,(HLOOKUP(L$411,'Base de dados'!$B$5:$AIN$11,$M419,0)),\"\")","v":""},3]
[null,"Toxicidade (mg kg-1 day-1)",null,{"$f":"IF(D$414>0,(HLOOKUP(D$411,'Base de dados'!$B$5:$AIN$11,$M420,0)),\"\")","v":""},{"$f":"IF(E$414>0,(HLOOKUP(E$411,'Base de dados'!$B$5:$AIN$11,$M420,0)),\"\")","v":""},{"$f":"IF(F$414>0,(HLOOKUP(F$411,'Base de dados'!$B$5:$AIN$11,$M420,0)),\"\")","v":""},{"$f":"IF(G$414>0,(HLOOKUP(G$411,'Base de dados'!$B$5:$AIN$11,$M420,0)),\"\")","v":""},{"$f":"IF(H$414>0,(HLOOKUP(H$411,'Base de dados'!$B$5:$AIN$11,$M420,0)),\"\")","v":""},{"$f":"IF(I$414>0,(HLOOKUP(I$411,'Base de dados'!$B$5:$AIN$11,$M420,0)),\"\")","v":""},{"$f":"IF(J$414>0,(HLOOKUP(J$411,'Base de dados'!$B$5:$AIN$11,$M420,0)),\"\")","v":""},{"$f":"IF(K$414>0,(HLOOKUP(K$411,'Base de dados'!$B$5:$AIN$11,$M420,0)),\"\")","v":""},{"$f":"IF(L$414>0,(HLOOKUP(L$411,'Base de dados'!$B$5:$AIN$11,$M420,0)),\"\")","v":""},4]
[null,"Índice para toxicidade do produto\t",null,{"$f":"IF(D$414>0,(HLOOKUP(D$411,'Base de dados'!$B$5:$AIN$11,$M421,0)),\"\")","v":""},{"$f":"IF(E$414>0,(HLOOKUP(E$411,'Base de dados'!$B$5:$AIN$11,$M421,0)),\"\")","v":""},{"$f":"IF(F$414>0,(HLOOKUP(F$411,'Base de dados'!$B$5:$AIN$11,$M421,0)),\"\")","v":""},{"$f":"IF(G$414>0,(HLOOKUP(G$411,'Base de dados'!$B$5:$AIN$11,$M421,0)),\"\")","v":""},{"$f":"IF(H$414>0,(HLOOKUP(H$411,'Base de dados'!$B$5:$AIN$11,$M421,0)),\"\")","v":""},{"$f":"IF(I$414>0,(HLOOKUP(I$411,'Base de dados'!$B$5:$AIN$11,$M421,0)),\"\")","v":""},{"$f":"IF(J$414>0,(HLOOKUP(J$411,'Base de dados'!$B$5:$AIN$11,$M421,0)),\"\")","v":""},{"$f":"IF(K$414>0,(HLOOKUP(K$411,'Base de dados'!$B$5:$AIN$11,$M421,0)),\"\")","v":""},{"$f":"IF(L$414>0,(HLOOKUP(L$411,'Base de dados'!$B$5:$AIN$11,$M421,0)),\"\")","v":""},5]
[null,"Koc",null,{"$f":"IF(D$414>0,(HLOOKUP(D$411,'Base de dados'!$B$5:$AIN$11,$M422,0)),\"\")","v":""},{"$f":"IF(E$414>0,(HLOOKUP(E$411,'Base de dados'!$B$5:$AIN$11,$M422,0)),\"\")","v":""},{"$f":"IF(F$414>0,(HLOOKUP(F$411,'Base de dados'!$B$5:$AIN$11,$M422,0)),\"\")","v":""},{"$f":"IF(G$414>0,(HLOOKUP(G$411,'Base de dados'!$B$5:$AIN$11,$M422,0)),\"\")","v":""},{"$f":"IF(H$414>0,(HLOOKUP(H$411,'Base de dados'!$B$5:$AIN$11,$M422,0)),\"\")","v":""},{"$f":"IF(I$414>0,(HLOOKUP(I$411,'Base de dados'!$B$5:$AIN$11,$M422,0)),\"\")","v":""},{"$f":"IF(J$414>0,(HLOOKUP(J$411,'Base de dados'!$B$5:$AIN$11,$M422,0)),\"\")","v":""},{"$f":"IF(K$414>0,(HLOOKUP(K$411,'Base de dados'!$B$5:$AIN$11,$M422,0)),\"\")","v":""},{"$f":"IF(L$414>0,(HLOOKUP(L$411,'Base de dados'!$B$5:$AIN$11,$M422,0)),\"\")","v":""},6]
[null,"t1/2 (DT50)",null,{"$f":"IF(D$414>0,(HLOOKUP(D$411,'Base de dados'!$B$5:$AIN$11,$M423,0)),\"\")","v":""},{"$f":"IF(E$414>0,(HLOOKUP(E$411,'Base de dados'!$B$5:$AIN$11,$M423,0)),\"\")","v":""},{"$f":"IF(F$414>0,(HLOOKUP(F$411,'Base de dados'!$B$5:$AIN$11,$M423,0)),\"\")","v":""},{"$f":"IF(G$414>0,(HLOOKUP(G$411,'Base de dados'!$B$5:$AIN$11,$M423,0)),\"\")","v":""},{"$f":"IF(H$414>0,(HLOOKUP(H$411,'Base de dados'!$B$5:$AIN$11,$M423,0)),\"\")","v":""},{"$f":"IF(I$414>0,(HLOOKUP(I$411,'Base de dados'!$B$5:$AIN$11,$M423,0)),\"\")","v":""},{"$f":"IF(J$414>0,(HLOOKUP(J$411,'Base de dados'!$B$5:$AIN$11,$M423,0)),\"\")","v":""},{"$f":"IF(K$414>0,(HLOOKUP(K$411,'Base de dados'!$B$5:$AIN$11,$M423,0)),\"\")","v":""},{"$f":"IF(L$414>0,(HLOOKUP(L$411,'Base de dados'!$B$5:$AIN$11,$M423,0)),\"\")","v":""},7]
[null,"GUS\t",null,{"$f":"IF(D414=0,\"\",IF(LOG10(D423)*(4-LOG10(D422))<=0,0,IF(OR(LOG10(D423)*(4-LOG10(D422))>0,),(LOG10(D423)*(4-LOG10(D422))),IF((LOG10(D423)*(4-LOG10(D422))>0),(LOG10(D423)*(4-LOG10(D422)))))))","v":""},{"$f":"IF(E414=0,\"\",IF(LOG10(E423)*(4-LOG10(E422))<=0,0,IF(OR(LOG10(E423)*(4-LOG10(E422))>0,),(LOG10(E423)*(4-LOG10(E422))),IF((LOG10(E423)*(4-LOG10(E422))>0),(LOG10(E423)*(4-LOG10(E422)))))))","v":""},"","","","","","",""]
[null,"Potencial de contaminação (1, 2 or 3)",null,{"$f":"IF(D414>0,(IF(OR(Fórmulas!H387=0.83,Fórmulas!H387<0.83),1,IF(OR(AND(0.83<Fórmulas!H387,Fórmulas!H387<=1.66)),2,IF(Fórmulas!H387>1.66,3,\"\")))),\"\")","v":""},{"$f":"IF(E414>0,(IF(OR(Fórmulas!I387=0.83,Fórmulas!I387<0.83),1,IF(OR(AND(0.83<Fórmulas!I387,Fórmulas!I387<=1.66)),2,IF(Fórmulas!I387>1.66,3,\"\")))),\"\")","v":""},{"$f":"IF(F414>0,(IF(OR(Fórmulas!J387=0.83,Fórmulas!J387<0.83),1,IF(OR(AND(0.83<Fórmulas!J387,Fórmulas!J387<=1.66)),2,IF(Fórmulas!J387>1.66,3,\"\")))),\"\")","v":""},{"$f":"IF(G414>0,(IF(OR(Fórmulas!K387=0.83,Fórmulas!K387<0.83),1,IF(OR(AND(0.83<Fórmulas!K387,Fórmulas!K387<=1.66)),2,IF(Fórmulas!K387>1.66,3,\"\")))),\"\")","v":""},{"$f":"IF(H414>0,(IF(OR(Fórmulas!L387=0.83,Fórmulas!L387<0.83),1,IF(OR(AND(0.83<Fórmulas!L387,Fórmulas!L387<=1.66)),2,IF(Fórmulas!L387>1.66,3,\"\")))),\"\")","v":""},{"$f":"IF(I414>0,(IF(OR(Fórmulas!M387=0.83,Fórmulas!M387<0.83),1,IF(OR(AND(0.83<Fórmulas!M387,Fórmulas!M387<=1.66)),2,IF(Fórmulas!M387>1.66,3,\"\")))),\"\")","v":""},{"$f":"IF(J414>0,(IF(OR(Fórmulas!N387=0.83,Fórmulas!N387<0.83),1,IF(OR(AND(0.83<Fórmulas!N387,Fórmulas!N387<=1.66)),2,IF(Fórmulas!N387>1.66,3,\"\")))),\"\")","v":""},{"$f":"IF(K414>0,(IF(OR(B399=0.83,B399<0.83),1,IF(OR(AND(0.83<B399,B399<=1.66)),2,IF(B399>1.66,3,\"\")))),\"\")","v":""},{"$f":"IF(L414>0,(IF(OR(C399=0.83,C399<0.83),1,IF(OR(AND(0.83<C399,C399<=1.66)),2,IF(C399>1.66,3,\"\")))),\"\")","v":""}]
[null,"EIQ Impacto ao trabalhador rural",null,{"$f":"IF(D$414>0,(HLOOKUP(D$411,'Base de dados'!$B$5:$AIN$18,$M426,0)),\"\")","v":""},{"$f":"IF(E$414>0,(HLOOKUP(E$411,'Base de dados'!$B$5:$AIN$18,$M426,0)),\"\")","v":""},{"$f":"IF(F$414>0,(HLOOKUP(F$411,'Base de dados'!$B$5:$AIN$18,$M426,0)),\"\")","v":""},{"$f":"IF(G$414>0,(HLOOKUP(G$411,'Base de dados'!$B$5:$AIN$18,$M426,0)),\"\")","v":""},{"$f":"IF(H$414>0,(HLOOKUP(H$411,'Base de dados'!$B$5:$AIN$18,$M426,0)),\"\")","v":""},{"$f":"IF(I$414>0,(HLOOKUP(I$411,'Base de dados'!$B$5:$AIN$18,$M426,0)),\"\")","v":""},{"$f":"IF(J$414>0,(HLOOKUP(J$411,'Base de dados'!$B$5:$AIN$18,$M426,0)),\"\")","v":""},{"$f":"IF(K$414>0,(HLOOKUP(K$411,'Base de dados'!$B$5:$AIN$18,$M426,0)),\"\")","v":""},{"$f":"IF(L$414>0,(HLOOKUP(L$411,'Base de dados'!$B$5:$AIN$18,$M426,0)),\"\")","v":""},12]
[null,"EIQ Impacto ao consumidor",null,{"$f":"IF(D$414>0,(HLOOKUP(D$411,'Base de dados'!$B$5:$AIN$18,$M427,0)),\"\")","v":""},{"$f":"IF(E$414>0,(HLOOKUP(E$411,'Base de dados'!$B$5:$AIN$18,$M427,0)),\"\")","v":""},{"$f":"IF(F$414>0,(HLOOKUP(F$411,'Base de dados'!$B$5:$AIN$18,$M427,0)),\"\")","v":""},{"$f":"IF(G$414>0,(HLOOKUP(G$411,'Base de dados'!$B$5:$AIN$18,$M427,0)),\"\")","v":""},{"$f":"IF(H$414>0,(HLOOKUP(H$411,'Base de dados'!$B$5:$AIN$18,$M427,0)),\"\")","v":""},{"$f":"IF(I$414>0,(HLOOKUP(I$411,'Base de dados'!$B$5:$AIN$18,$M427,0)),\"\")","v":""},{"$f":"IF(J$414>0,(HLOOKUP(J$411,'Base de dados'!$B$5:$AIN$18,$M427,0)),\"\")","v":""},{"$f":"IF(K$414>0,(HLOOKUP(K$411,'Base de dados'!$B$5:$AIN$18,$M427,0)),\"\")","v":""},{"$f":"IF(L$414>0,(HLOOKUP(L$411,'Base de dados'!$B$5:$AIN$18,$M427,0)),\"\")","v":""},13]
[null,"EIQ Impacto ao meio ambiente",null,{"$f":"IF(D$414>0,(HLOOKUP(D$411,'Base de dados'!$B$5:$AIN$18,$M428,0)),\"\")","v":""},{"$f":"IF(E$414>0,(HLOOKUP(E$411,'Base de dados'!$B$5:$AIN$18,$M428,0)),\"\")","v":""},{"$f":"IF(F$414>0,(HLOOKUP(F$411,'Base de dados'!$B$5:$AIN$18,$M428,0)),\"\")","v":""},{"$f":"IF(G$414>0,(HLOOKUP(G$411,'Base de dados'!$B$5:$AIN$18,$M428,0)),\"\")","v":""},{"$f":"IF(H$414>0,(HLOOKUP(H$411,'Base de dados'!$B$5:$AIN$18,$M428,0)),\"\")","v":""},{"$f":"IF(I$414>0,(HLOOKUP(I$411,'Base de dados'!$B$5:$AIN$18,$M428,0)),\"\")","v":""},{"$f":"IF(J$414>0,(HLOOKUP(J$411,'Base de dados'!$B$5:$AIN$18,$M428,0)),\"\")","v":""},{"$f":"IF(K$414>0,(HLOOKUP(K$411,'Base de dados'!$B$5:$AIN$18,$M428,0)),\"\")","v":""},{"$f":"IF(L$414>0,(HLOOKUP(L$411,'Base de dados'!$B$5:$AIN$18,$M428,0)),\"\")","v":""},14]
[null,"Environmental Impact Quotient (EIQ)",null,{"$f":"IF(D$414>0,(HLOOKUP(D$411,'Base de dados'!$B$5:$AIN$18,$M429,0)),\"\")","v":""},{"$f":"IF(E$414>0,(HLOOKUP(E$411,'Base de dados'!$B$5:$AIN$18,$M429,0)),\"\")","v":""},{"$f":"IF(F$414>0,(HLOOKUP(F$411,'Base de dados'!$B$5:$AIN$18,$M429,0)),\"\")","v":""},{"$f":"IF(G$414>0,(HLOOKUP(G$411,'Base de dados'!$B$5:$AIN$18,$M429,0)),\"\")","v":""},{"$f":"IF(H$414>0,(HLOOKUP(H$411,'Base de dados'!$B$5:$AIN$18,$M429,0)),\"\")","v":""},{"$f":"IF(I$414>0,(HLOOKUP(I$411,'Base de dados'!$B$5:$AIN$18,$M429,0)),\"\")","v":""},{"$f":"IF(J$414>0,(HLOOKUP(J$411,'Base de dados'!$B$5:$AIN$18,$M429,0)),\"\")","v":""},{"$f":"IF(K$414>0,(HLOOKUP(K$411,'Base de dados'!$B$5:$AIN$18,$M429,0)),\"\")","v":""},{"$f":"IF(L$414>0,(HLOOKUP(L$411,'Base de dados'!$B$5:$AIN$18,$M429,0)),\"\")","v":""},11]
[null,"Pesticidas banidos na União Européia",null,{"$f":"IF(D$414>0,(HLOOKUP(D$411,'Base de dados'!$B$5:$AIN$19,$M430,0)),\"\")","v":""},{"$f":"IF(E$414>0,(HLOOKUP(E$411,'Base de dados'!$B$5:$AIN$19,$M430,0)),\"\")","v":""},{"$f":"IF(F$414>0,(HLOOKUP(F$411,'Base de dados'!$B$5:$AIN$19,$M430,0)),\"\")","v":""},{"$f":"IF(G$414>0,(HLOOKUP(G$411,'Base de dados'!$B$5:$AIN$19,$M430,0)),\"\")","v":""},{"$f":"IF(H$414>0,(HLOOKUP(H$411,'Base de dados'!$B$5:$AIN$19,$M430,0)),\"\")","v":""},{"$f":"IF(I$414>0,(HLOOKUP(I$411,'Base de dados'!$B$5:$AIN$19,$M430,0)),\"\")","v":""},{"$f":"IF(J$414>0,(HLOOKUP(J$411,'Base de dados'!$B$5:$AIN$19,$M430,0)),\"\")","v":""},{"$f":"IF(K$414>0,(HLOOKUP(K$411,'Base de dados'!$B$5:$AIN$19,$M430,0)),\"\")","v":""},{"$f":"IF(L$414>0,(HLOOKUP(L$411,'Base de dados'!$B$5:$AIN$19,$M430,0)),\"\")","v":""},15]
[]
[null,"Teor de argila no solo                                                             > 60% (1); 30% - 60% (2); <30% (3)\t"]
[null,"Distância do curso d' água (borda do talhão) >1.000m (1);  300 - 1.000m (2);  <300m (3)\t"]
[null,"Tipo de manejo do solo: Solo protegido (1); Solo sem revolvimento (2); Solo com revolvimento (3)\t"]
[null,"Vulnerabilidade do talhão  (1, 2 ou 3)\t",null,{"$f":"IF(D415>0,(IF(OR(AND(1<=Fórmulas!H388,Fórmulas!H388<=3)),1,IF(OR(AND(3<Fórmulas!H388,Fórmulas!H388<=9)),2,IF(Fórmulas!H388>9,3)))),\"\")","v":""},{"$f":"IF(E415>0,(IF(OR(AND(1<=Fórmulas!I388,Fórmulas!I388<=3)),1,IF(OR(AND(3<Fórmulas!I388,Fórmulas!I388<=9)),2,IF(Fórmulas!I388>9,3)))),\"\")","v":""},{"$f":"IF(F415>0,(IF(OR(AND(1<=Fórmulas!J388,Fórmulas!J388<=3)),1,IF(OR(AND(3<Fórmulas!J388,Fórmulas!J388<=9)),2,IF(Fórmulas!J388>9,3)))),\"\")","v":""},{"$f":"IF(G415>0,(IF(OR(AND(1<=Fórmulas!K388,Fórmulas!K388<=3)),1,IF(OR(AND(3<Fórmulas!K388,Fórmulas!K388<=9)),2,IF(Fórmulas!K388>9,3)))),\"\")","v":""},{"$f":"IF(H415>0,(IF(OR(AND(1<=Fórmulas!L388,Fórmulas!L388<=3)),1,IF(OR(AND(3<Fórmulas!L388,Fórmulas!L388<=9)),2,IF(Fórmulas!L388>9,3)))),\"\")","v":""},{"$f":"IF(I415>0,(IF(OR(AND(1<=Fórmulas!M388,Fórmulas!M388<=3)),1,IF(OR(AND(3<Fórmulas!M388,Fórmulas!M388<=9)),2,IF(Fórmulas!M388>9,3)))),\"\")","v":""},{"$f":"IF(J415>0,(IF(OR(AND(1<=Fórmulas!N388,Fórmulas!N388<=3)),1,IF(OR(AND(3<Fórmulas!N388,Fórmulas!N388<=9)),2,IF(Fórmulas!N388>9,3)))),\"\")","v":""},{"$f":"IF(K415>0,(IF(OR(AND(1<=Fórmulas!B400,Fórmulas!B400<=3)),1,IF(OR(AND(3<Fórmulas!B400,Fórmulas!B400<=9)),2,IF(Fórmulas!B400>9,3)))),\"\")","v":""},{"$f":"IF(L415>0,(IF(OR(AND(1<=Fórmulas!C400,Fórmulas!C400<=3)),1,IF(OR(AND(3<Fórmulas!C400,Fórmulas!C400<=9)),2,IF(Fórmulas!C400>9,3)))),\"\")","v":""}]
[]
[null,"Risco de contaminação (1, 2 ou 3)",null,{"$f":"IF(D415>0,(IF(OR(AND(1<=Fórmulas!H390,Fórmulas!H390<=2)),1,IF(OR(AND(2<Fórmulas!H390,Fórmulas!H390<=4)),2,IF(Fórmulas!H390>4,3)))),\"\")","v":""},{"$f":"IF(E415>0,(IF(OR(AND(1<=Fórmulas!I390,Fórmulas!I390<=2)),1,IF(OR(AND(2<Fórmulas!I390,Fórmulas!I390<=4)),2,IF(Fórmulas!I390>4,3)))),\"\")","v":""},{"$f":"IF(F415>0,(IF(OR(AND(1<=Fórmulas!J390,Fórmulas!J390<=2)),1,IF(OR(AND(2<Fórmulas!J390,Fórmulas!J390<=4)),2,IF(Fórmulas!J390>4,3)))),\"\")","v":""},{"$f":"IF(G415>0,(IF(OR(AND(1<=Fórmulas!K390,Fórmulas!K390<=2)),1,IF(OR(AND(2<Fórmulas!K390,Fórmulas!K390<=4)),2,IF(Fórmulas!K390>4,3)))),\"\")","v":""},{"$f":"IF(H415>0,(IF(OR(AND(1<=Fórmulas!L390,Fórmulas!L390<=2)),1,IF(OR(AND(2<Fórmulas!L390,Fórmulas!L390<=4)),2,IF(Fórmulas!L390>4,3)))),\"\")","v":""},{"$f":"IF(I415>0,(IF(OR(AND(1<=Fórmulas!M390,Fórmulas!M390<=2)),1,IF(OR(AND(2<Fórmulas!M390,Fórmulas!M390<=4)),2,IF(Fórmulas!M390>4,3)))),\"\")","v":""},{"$f":"IF(J415>0,(IF(OR(AND(1<=Fórmulas!N390,Fórmulas!N390<=2)),1,IF(OR(AND(2<Fórmulas!N390,Fórmulas!N390<=4)),2,IF(Fórmulas!N390>4,3)))),\"\")","v":""},{"$f":"IF(K415>0,(IF(OR(AND(1<=Fórmulas!B402,Fórmulas!B402<=2)),1,IF(OR(AND(2<Fórmulas!B402,Fórmulas!B402<=4)),2,IF(Fórmulas!B402>4,3)))),\"\")","v":""},{"$f":"IF(L415>0,(IF(OR(AND(1<=Fórmulas!C402,Fórmulas!C402<=2)),1,IF(OR(AND(2<Fórmulas!C402,Fórmulas!C402<=4)),2,IF(Fórmulas!C402>4,3)))),\"\")","v":""}]
[]
[]
[null,"Nome comercial do produto (selecione)\t"]
[null,"Ingrediente ativo (%)\t"]
[null,"Descrição da cultura\t"]
[null,"Área (ha)\t"]
[null,"Volume aplicado L/ha ou kg/ha \t"]
[null,"Volume total aplicado por produto\t",null,{"$f":"+D444*D443","v":{"v":0,"d":"0.0"}},{"v":0,"d":"0.0"},{"v":0,"d":"0.0"},{"v":0,"d":"0.0"},{"v":0,"d":"0.0"},{"v":0,"d":"0.0"},{"v":0,"d":"0.0"},{"v":0,"d":"0.0"},{"v":0,"d":"0.0"}]
[]
[null,"Ingrediente ativo do produto \t",null,{"$f":"IF(D$443>0,(HLOOKUP(D$440,'Base de dados'!$B$5:$AIN$11,$M447,0)),\"\")","v":""},{"$f":"IF(E$443>0,(HLOOKUP(E$440,'Base de dados'!$B$5:$AIN$11,$M447,0)),\"\")","v":""},{"$f":"IF(F$443>0,(HLOOKUP(F$440,'Base de dados'!$B$5:$AIN$11,$M447,0)),\"\")","v":""},{"$f":"IF(G$443>0,(HLOOKUP(G$440,'Base de dados'!$B$5:$AIN$11,$M447,0)),\"\")","v":""},{"$f":"IF(H$443>0,(HLOOKUP(H$440,'Base de dados'!$B$5:$AIN$11,$M447,0)),\"\")","v":""},{"$f":"IF(I$443>0,(HLOOKUP(I$440,'Base de dados'!$B$5:$AIN$11,$M447,0)),\"\")","v":""},{"$f":"IF(J$443>0,(HLOOKUP(J$440,'Base de dados'!$B$5:$AIN$11,$M447,0)),\"\")","v":""},{"$f":"IF(K$443>0,(HLOOKUP(K$440,'Base de dados'!$B$5:$AIN$11,$M447,0)),\"\")","v":""},{"$f":"IF(L$443>0,(HLOOKUP(L$440,'Base de dados'!$B$5:$AIN$11,$M447,0)),\"\")","v":""},2]
[null,"Toxicidade para peixes - 96h LC50 (mg L-1)\t",null,{"$f":"IF(D$443>0,(HLOOKUP(D$440,'Base de dados'!$B$5:$AIN$11,$M448,0)),\"\")","v":""},{"$f":"IF(E$443>0,(HLOOKUP(E$440,'Base de dados'!$B$5:$AIN$11,$M448,0)),\"\")","v":""},{"$f":"IF(F$443>0,(HLOOKUP(F$440,'Base de dados'!$B$5:$AIN$11,$M448,0)),\"\")","v":""},{"$f":"IF(G$443>0,(HLOOKUP(G$440,'Base de dados'!$B$5:$AIN$11,$M448,0)),\"\")","v":""},{"$f":"IF(H$443>0,(HLOOKUP(H$440,'Base de dados'!$B$5:$AIN$11,$M448,0)),\"\")","v":""},{"$f":"IF(I$443>0,(HLOOKUP(I$440,'Base de dados'!$B$5:$AIN$11,$M448,0)),\"\")","v":""},{"$f":"IF(J$443>0,(HLOOKUP(J$440,'Base de dados'!$B$5:$AIN$11,$M448,0)),\"\")","v":""},{"$f":"IF(K$443>0,(HLOOKUP(K$440,'Base de dados'!$B$5:$AIN$11,$M448,0)),\"\")","v":""},{"$f":"IF(L$443>0,(HLOOKUP(L$440,'Base de dados'!$B$5:$AIN$11,$M448,0)),\"\")","v":""},3]
[null,"Toxicidade (mg kg-1 day-1)",null,{"$f":"IF(D$443>0,(HLOOKUP(D$440,'Base de dados'!$B$5:$AIN$11,$M449,0)),\"\")","v":""},{"$f":"IF(E$443>0,(HLOOKUP(E$440,'Base de dados'!$B$5:$AIN$11,$M449,0)),\"\")","v":""},{"$f":"IF(F$443>0,(HLOOKUP(F$440,'Base de dados'!$B$5:$AIN$11,$M449,0)),\"\")","v":""},{"$f":"IF(G$443>0,(HLOOKUP(G$440,'Base de dados'!$B$5:$AIN$11,$M449,0)),\"\")","v":""},{"$f":"IF(H$443>0,(HLOOKUP(H$440,'Base de dados'!$B$5:$AIN$11,$M449,0)),\"\")","v":""},{"$f":"IF(I$443>0,(HLOOKUP(I$440,'Base de dados'!$B$5:$AIN$11,$M449,0)),\"\")","v":""},{"$f":"IF(J$443>0,(HLOOKUP(J$440,'Base de dados'!$B$5:$AIN$11,$M449,0)),\"\")","v":""},{"$f":"IF(K$443>0,(HLOOKUP(K$440,'Base de dados'!$B$5:$AIN$11,$M449,0)),\"\")","v":""},{"$f":"IF(L$443>0,(HLOOKUP(L$440,'Base de dados'!$B$5:$AIN$11,$M449,0)),\"\")","v":""},4]
[null,"Índice para toxicidade do produto\t",null,{"$f":"IF(D$443>0,(HLOOKUP(D$440,'Base de dados'!$B$5:$AIN$11,$M450,0)),\"\")","v":""},{"$f":"IF(E$443>0,(HLOOKUP(E$440,'Base de dados'!$B$5:$AIN$11,$M450,0)),\"\")","v":""},{"$f":"IF(F$443>0,(HLOOKUP(F$440,'Base de dados'!$B$5:$AIN$11,$M450,0)),\"\")","v":""},{"$f":"IF(G$443>0,(HLOOKUP(G$440,'Base de dados'!$B$5:$AIN$11,$M450,0)),\"\")","v":""},{"$f":"IF(H$443>0,(HLOOKUP(H$440,'Base de dados'!$B$5:$AIN$11,$M450,0)),\"\")","v":""},{"$f":"IF(I$443>0,(HLOOKUP(I$440,'Base de dados'!$B$5:$AIN$11,$M450,0)),\"\")","v":""},{"$f":"IF(J$443>0,(HLOOKUP(J$440,'Base de dados'!$B$5:$AIN$11,$M450,0)),\"\")","v":""},{"$f":"IF(K$443>0,(HLOOKUP(K$440,'Base de dados'!$B$5:$AIN$11,$M450,0)),\"\")","v":""},{"$f":"IF(L$443>0,(HLOOKUP(L$440,'Base de dados'!$B$5:$AIN$11,$M450,0)),\"\")","v":""},5]
[null,"Koc",null,{"$f":"IF(D$443>0,(HLOOKUP(D$440,'Base de dados'!$B$5:$AIN$11,$M451,0)),\"\")","v":""},{"$f":"IF(E$443>0,(HLOOKUP(E$440,'Base de dados'!$B$5:$AIN$11,$M451,0)),\"\")","v":""},{"$f":"IF(F$443>0,(HLOOKUP(F$440,'Base de dados'!$B$5:$AIN$11,$M451,0)),\"\")","v":""},{"$f":"IF(G$443>0,(HLOOKUP(G$440,'Base de dados'!$B$5:$AIN$11,$M451,0)),\"\")","v":""},{"$f":"IF(H$443>0,(HLOOKUP(H$440,'Base de dados'!$B$5:$AIN$11,$M451,0)),\"\")","v":""},{"$f":"IF(I$443>0,(HLOOKUP(I$440,'Base de dados'!$B$5:$AIN$11,$M451,0)),\"\")","v":""},{"$f":"IF(J$443>0,(HLOOKUP(J$440,'Base de dados'!$B$5:$AIN$11,$M451,0)),\"\")","v":""},{"$f":"IF(K$443>0,(HLOOKUP(K$440,'Base de dados'!$B$5:$AIN$11,$M451,0)),\"\")","v":""},{"$f":"IF(L$443>0,(HLOOKUP(L$440,'Base de dados'!$B$5:$AIN$11,$M451,0)),\"\")","v":""},6]
[null,"t1/2 (DT50)",null,{"$f":"IF(D$443>0,(HLOOKUP(D$440,'Base de dados'!$B$5:$AIN$11,$M452,0)),\"\")","v":""},{"$f":"IF(E$443>0,(HLOOKUP(E$440,'Base de dados'!$B$5:$AIN$11,$M452,0)),\"\")","v":""},{"$f":"IF(F$443>0,(HLOOKUP(F$440,'Base de dados'!$B$5:$AIN$11,$M452,0)),\"\")","v":""},{"$f":"IF(G$443>0,(HLOOKUP(G$440,'Base de dados'!$B$5:$AIN$11,$M452,0)),\"\")","v":""},{"$f":"IF(H$443>0,(HLOOKUP(H$440,'Base de dados'!$B$5:$AIN$11,$M452,0)),\"\")","v":""},{"$f":"IF(I$443>0,(HLOOKUP(I$440,'Base de dados'!$B$5:$AIN$11,$M452,0)),\"\")","v":""},{"$f":"IF(J$443>0,(HLOOKUP(J$440,'Base de dados'!$B$5:$AIN$11,$M452,0)),\"\")","v":""},{"$f":"IF(K$443>0,(HLOOKUP(K$440,'Base de dados'!$B$5:$AIN$11,$M452,0)),\"\")","v":""},{"$f":"IF(L$443>0,(HLOOKUP(L$440,'Base de dados'!$B$5:$AIN$11,$M452,0)),\"\")","v":""},7]
[null,"GUS\t",null,{"$f":"IF(D443=0,\"\",IF(LOG10(D452)*(4-LOG10(D451))<=0,0,IF(OR(LOG10(D452)*(4-LOG10(D451))>0,),(LOG10(D452)*(4-LOG10(D451))),IF((LOG10(D452)*(4-LOG10(D451))>0),(LOG10(D452)*(4-LOG10(D451)))))))","v":""},{"$f":"IF(E443=0,\"\",IF(LOG10(E452)*(4-LOG10(E451))<=0,0,IF(OR(LOG10(E452)*(4-LOG10(E451))>0,),(LOG10(E452)*(4-LOG10(E451))),IF((LOG10(E452)*(4-LOG10(E451))>0),(LOG10(E452)*(4-LOG10(E451)))))))","v":""},"","","","","","",""]
[null,"Potencial de contaminação (1, 2 or 3)",null,{"$f":"IF(D443>0,(IF(OR(D399=0.83,D399<0.83),1,IF(OR(AND(0.83<D399,D399<=1.66)),2,IF(D399>1.66,3,\"\")))),\"\")","v":""},{"$f":"IF(E443>0,(IF(OR(E399=0.83,E399<0.83),1,IF(OR(AND(0.83<E399,E399<=1.66)),2,IF(E399>1.66,3,\"\")))),\"\")","v":""},"","","","","","",""]
[null,"EIQ Impacto ao trabalhador rural",null,{"$f":"IF(D$443>0,(HLOOKUP(D$440,'Base de dados'!$B$5:$AIN$18,$M455,0)),\"\")","v":""},{"$f":"IF(E$443>0,(HLOOKUP(E$440,'Base de dados'!$B$5:$AIN$18,$M455,0)),\"\")","v":""},{"$f":"IF(F$443>0,(HLOOKUP(F$440,'Base de dados'!$B$5:$AIN$18,$M455,0)),\"\")","v":""},{"$f":"IF(G$443>0,(HLOOKUP(G$440,'Base de dados'!$B$5:$AIN$18,$M455,0)),\"\")","v":""},{"$f":"IF(H$443>0,(HLOOKUP(H$440,'Base de dados'!$B$5:$AIN$18,$M455,0)),\"\")","v":""},{"$f":"IF(I$443>0,(HLOOKUP(I$440,'Base de dados'!$B$5:$AIN$18,$M455,0)),\"\")","v":""},{"$f":"IF(J$443>0,(HLOOKUP(J$440,'Base de dados'!$B$5:$AIN$18,$M455,0)),\"\")","v":""},{"$f":"IF(K$443>0,(HLOOKUP(K$440,'Base de dados'!$B$5:$AIN$18,$M455,0)),\"\")","v":""},{"$f":"IF(L$443>0,(HLOOKUP(L$440,'Base de dados'!$B$5:$AIN$18,$M455,0)),\"\")","v":""},12]
[null,"EIQ Impacto ao consumidor",null,{"$f":"IF(D$443>0,(HLOOKUP(D$440,'Base de dados'!$B$5:$AIN$18,$M456,0)),\"\")","v":""},{"$f":"IF(E$443>0,(HLOOKUP(E$440,'Base de dados'!$B$5:$AIN$18,$M456,0)),\"\")","v":""},{"$f":"IF(F$443>0,(HLOOKUP(F$440,'Base de dados'!$B$5:$AIN$18,$M456,0)),\"\")","v":""},{"$f":"IF(G$443>0,(HLOOKUP(G$440,'Base de dados'!$B$5:$AIN$18,$M456,0)),\"\")","v":""},{"$f":"IF(H$443>0,(HLOOKUP(H$440,'Base de dados'!$B$5:$AIN$18,$M456,0)),\"\")","v":""},{"$f":"IF(I$443>0,(HLOOKUP(I$440,'Base de dados'!$B$5:$AIN$18,$M456,0)),\"\")","v":""},{"$f":"IF(J$443>0,(HLOOKUP(J$440,'Base de dados'!$B$5:$AIN$18,$M456,0)),\"\")","v":""},{"$f":"IF(K$443>0,(HLOOKUP(K$440,'Base de dados'!$B$5:$AIN$18,$M456,0)),\"\")","v":""},{"$f":"IF(L$443>0,(HLOOKUP(L$440,'Base de dados'!$B$5:$AIN$18,$M456,0)),\"\")","v":""},13]
[null,"EIQ Impacto ao meio ambiente",null,{"$f":"IF(D$443>0,(HLOOKUP(D$440,'Base de dados'!$B$5:$AIN$18,$M457,0)),\"\")","v":""},{"$f":"IF(E$443>0,(HLOOKUP(E$440,'Base de dados'!$B$5:$AIN$18,$M457,0)),\"\")","v":""},{"$f":"IF(F$443>0,(HLOOKUP(F$440,'Base de dados'!$B$5:$AIN$18,$M457,0)),\"\")","v":""},{"$f":"IF(G$443>0,(HLOOKUP(G$440,'Base de dados'!$B$5:$AIN$18,$M457,0)),\"\")","v":""},{"$f":"IF(H$443>0,(HLOOKUP(H$440,'Base de dados'!$B$5:$AIN$18,$M457,0)),\"\")","v":""},{"$f":"IF(I$443>0,(HLOOKUP(I$440,'Base de dados'!$B$5:$AIN$18,$M457,0)),\"\")","v":""},{"$f":"IF(J$443>0,(HLOOKUP(J$440,'Base de dados'!$B$5:$AIN$18,$M457,0)),\"\")","v":""},{"$f":"IF(K$443>0,(HLOOKUP(K$440,'Base de dados'!$B$5:$AIN$18,$M457,0)),\"\")","v":""},{"$f":"IF(L$443>0,(HLOOKUP(L$440,'Base de dados'!$B$5:$AIN$18,$M457,0)),\"\")","v":""},14]
[null,"Environmental Impact Quotient (EIQ)",null,{"$f":"IF(D$443>0,(HLOOKUP(D$440,'Base de dados'!$B$5:$AIN$18,$M458,0)),\"\")","v":""},{"$f":"IF(E$443>0,(HLOOKUP(E$440,'Base de dados'!$B$5:$AIN$18,$M458,0)),\"\")","v":""},{"$f":"IF(F$443>0,(HLOOKUP(F$440,'Base de dados'!$B$5:$AIN$18,$M458,0)),\"\")","v":""},{"$f":"IF(G$443>0,(HLOOKUP(G$440,'Base de dados'!$B$5:$AIN$18,$M458,0)),\"\")","v":""},{"$f":"IF(H$443>0,(HLOOKUP(H$440,'Base de dados'!$B$5:$AIN$18,$M458,0)),\"\")","v":""},{"$f":"IF(I$443>0,(HLOOKUP(I$440,'Base de dados'!$B$5:$AIN$18,$M458,0)),\"\")","v":""},{"$f":"IF(J$443>0,(HLOOKUP(J$440,'Base de dados'!$B$5:$AIN$18,$M458,0)),\"\")","v":""},{"$f":"IF(K$443>0,(HLOOKUP(K$440,'Base de dados'!$B$5:$AIN$18,$M458,0)),\"\")","v":""},{"$f":"IF(L$443>0,(HLOOKUP(L$440,'Base de dados'!$B$5:$AIN$18,$M458,0)),\"\")","v":""},11]
[null,"Pesticidas banidos na União Européia",null,{"$f":"IF(D$443>0,(HLOOKUP(D$440,'Base de dados'!$B$5:$AIN$19,$M459,0)),\"\")","v":""},{"$f":"IF(E$443>0,(HLOOKUP(E$440,'Base de dados'!$B$5:$AIN$19,$M459,0)),\"\")","v":""},{"$f":"IF(F$443>0,(HLOOKUP(F$440,'Base de dados'!$B$5:$AIN$19,$M459,0)),\"\")","v":""},{"$f":"IF(G$443>0,(HLOOKUP(G$440,'Base de dados'!$B$5:$AIN$19,$M459,0)),\"\")","v":""},{"$f":"IF(H$443>0,(HLOOKUP(H$440,'Base de dados'!$B$5:$AIN$19,$M459,0)),\"\")","v":""},{"$f":"IF(I$443>0,(HLOOKUP(I$440,'Base de dados'!$B$5:$AIN$19,$M459,0)),\"\")","v":""},{"$f":"IF(J$443>0,(HLOOKUP(J$440,'Base de dados'!$B$5:$AIN$19,$M459,0)),\"\")","v":""},{"$f":"IF(K$443>0,(HLOOKUP(K$440,'Base de dados'!$B$5:$AIN$19,$M459,0)),\"\")","v":""},{"$f":"IF(L$443>0,(HLOOKUP(L$440,'Base de dados'!$B$5:$AIN$19,$M459,0)),\"\")","v":""},15]
[]
[null,"Teor de argila no solo                                                             > 60% (1); 30% - 60% (2); <30% (3)\t"]
[null,"Distância do curso d' água (borda do talhão) >1.000m (1);  300 - 1.000m (2);  <300m (3)\t"]
[null,"Tipo de manejo do solo: Solo protegido (1); Solo sem revolvimento (2); Solo com revolvimento (3)\t"]
[null,"Vulnerabilidade do talhão  (1, 2 ou 3)\t",null,{"$f":"IF(D444>0,(IF(OR(AND(1<=Fórmulas!D400,Fórmulas!D400<=3)),1,IF(OR(AND(3<Fórmulas!D400,Fórmulas!D400<=9)),2,IF(Fórmulas!D400>9,3)))),\"\")","v":""},{"$f":"IF(E444>0,(IF(OR(AND(1<=Fórmulas!E400,Fórmulas!E400<=3)),1,IF(OR(AND(3<Fórmulas!E400,Fórmulas!E400<=9)),2,IF(Fórmulas!E400>9,3)))),\"\")","v":""},{"$f":"IF(F444>0,(IF(OR(AND(1<=Fórmulas!F400,Fórmulas!F400<=3)),1,IF(OR(AND(3<Fórmulas!F400,Fórmulas!F400<=9)),2,IF(Fórmulas!F400>9,3)))),\"\")","v":""},{"$f":"IF(G444>0,(IF(OR(AND(1<=Fórmulas!G400,Fórmulas!G400<=3)),1,IF(OR(AND(3<Fórmulas!G400,Fórmulas!G400<=9)),2,IF(Fórmulas!G400>9,3)))),\"\")","v":""},{"$f":"IF(H444>0,(IF(OR(AND(1<=Fórmulas!H400,Fórmulas!H400<=3)),1,IF(OR(AND(3<Fórmulas!H400,Fórmulas!H400<=9)),2,IF(Fórmulas!H400>9,3)))),\"\")","v":""},{"$f":"IF(I444>0,(IF(OR(AND(1<=Fórmulas!I400,Fórmulas!I400<=3)),1,IF(OR(AND(3<Fórmulas!I400,Fórmulas!I400<=9)),2,IF(Fórmulas!I400>9,3)))),\"\")","v":""},{"$f":"IF(J444>0,(IF(OR(AND(1<=Fórmulas!J400,Fórmulas!J400<=3)),1,IF(OR(AND(3<Fórmulas!J400,Fórmulas!J400<=9)),2,IF(Fórmulas!J400>9,3)))),\"\")","v":""},{"$f":"IF(K444>0,(IF(OR(AND(1<=Fórmulas!K400,Fórmulas!K400<=3)),1,IF(OR(AND(3<Fórmulas!K400,Fórmulas!K400<=9)),2,IF(Fórmulas!K400>9,3)))),\"\")","v":""},{"$f":"IF(L444>0,(IF(OR(AND(1<=Fórmulas!L400,Fórmulas!L400<=3)),1,IF(OR(AND(3<Fórmulas!L400,Fórmulas!L400<=9)),2,IF(Fórmulas!L400>9,3)))),\"\")","v":""}]
[]
[null,"Risco de contaminação (1, 2 ou 3)",null,{"$f":"IF(D444>0,(IF(OR(AND(1<=Fórmulas!D402,Fórmulas!D402<=2)),1,IF(OR(AND(2<Fórmulas!D402,Fórmulas!D402<=4)),2,IF(Fórmulas!D402>4,3)))),\"\")","v":""},{"$f":"IF(E444>0,(IF(OR(AND(1<=Fórmulas!E402,Fórmulas!E402<=2)),1,IF(OR(AND(2<Fórmulas!E402,Fórmulas!E402<=4)),2,IF(Fórmulas!E402>4,3)))),\"\")","v":""},{"$f":"IF(F444>0,(IF(OR(AND(1<=Fórmulas!F402,Fórmulas!F402<=2)),1,IF(OR(AND(2<Fórmulas!F402,Fórmulas!F402<=4)),2,IF(Fórmulas!F402>4,3)))),\"\")","v":""},{"$f":"IF(G444>0,(IF(OR(AND(1<=Fórmulas!G402,Fórmulas!G402<=2)),1,IF(OR(AND(2<Fórmulas!G402,Fórmulas!G402<=4)),2,IF(Fórmulas!G402>4,3)))),\"\")","v":""},{"$f":"IF(H444>0,(IF(OR(AND(1<=Fórmulas!H402,Fórmulas!H402<=2)),1,IF(OR(AND(2<Fórmulas!H402,Fórmulas!H402<=4)),2,IF(Fórmulas!H402>4,3)))),\"\")","v":""},{"$f":"IF(I444>0,(IF(OR(AND(1<=Fórmulas!I402,Fórmulas!I402<=2)),1,IF(OR(AND(2<Fórmulas!I402,Fórmulas!I402<=4)),2,IF(Fórmulas!I402>4,3)))),\"\")","v":""},{"$f":"IF(J444>0,(IF(OR(AND(1<=Fórmulas!J402,Fórmulas!J402<=2)),1,IF(OR(AND(2<Fórmulas!J402,Fórmulas!J402<=4)),2,IF(Fórmulas!J402>4,3)))),\"\")","v":""},{"$f":"IF(K444>0,(IF(OR(AND(1<=Fórmulas!K402,Fórmulas!K402<=2)),1,IF(OR(AND(2<Fórmulas!K402,Fórmulas!K402<=4)),2,IF(Fórmulas!K402>4,3)))),\"\")","v":""},{"$f":"IF(L444>0,(IF(OR(AND(1<=Fórmulas!L402,Fórmulas!L402<=2)),1,IF(OR(AND(2<Fórmulas!L402,Fórmulas!L402<=4)),2,IF(Fórmulas!L402>4,3)))),\"\")","v":""}]
[]
[null,"Nome comercial do produto (selecione)\t"]
[null,"Ingrediente ativo (%)\t"]
[null,"Descrição da cultura\t"]
[null,"Área (ha)\t"]
[null,"Volume aplicado L/ha ou kg/ha \t"]
[null,"Volume total aplicado por produto\t",null,{"$f":"+D472*D471","v":{"v":0,"d":"0.0"}},{"v":0,"d":"0.0"},{"v":0,"d":"0.0"},{"v":0,"d":"0.0"},{"v":0,"d":"0.0"},{"v":0,"d":"0.0"}]
[]
[null,"Ingrediente ativo do produto \t",null,{"$f":"IF(D$471>0,(HLOOKUP(D$468,'Base de dados'!$B$5:$AIN$11,$J475,0)),\"\")","v":""},{"$f":"IF(E$471>0,(HLOOKUP(E$468,'Base de dados'!$B$5:$AIN$11,$J475,0)),\"\")","v":""},{"$f":"IF(F$471>0,(HLOOKUP(F$468,'Base de dados'!$B$5:$AIN$11,$J475,0)),\"\")","v":""},{"$f":"IF(G$471>0,(HLOOKUP(G$468,'Base de dados'!$B$5:$AIN$11,$J475,0)),\"\")","v":""},{"$f":"IF(H$471>0,(HLOOKUP(H$468,'Base de dados'!$B$5:$AIN$11,$J475,0)),\"\")","v":""},{"$f":"IF(I$471>0,(HLOOKUP(I$468,'Base de dados'!$B$5:$AIN$11,$J475,0)),\"\")","v":""},2]
[null,"Toxicidade para peixes - 96h LC50 (mg L-1)\t",null,{"$f":"IF(D$471>0,(HLOOKUP(D$468,'Base de dados'!$B$5:$AIN$11,$J476,0)),\"\")","v":""},{"$f":"IF(E$471>0,(HLOOKUP(E$468,'Base de dados'!$B$5:$AIN$11,$J476,0)),\"\")","v":""},{"$f":"IF(F$471>0,(HLOOKUP(F$468,'Base de dados'!$B$5:$AIN$11,$J476,0)),\"\")","v":""},{"$f":"IF(G$471>0,(HLOOKUP(G$468,'Base de dados'!$B$5:$AIN$11,$J476,0)),\"\")","v":""},{"$f":"IF(H$471>0,(HLOOKUP(H$468,'Base de dados'!$B$5:$AIN$11,$J476,0)),\"\")","v":""},{"$f":"IF(I$471>0,(HLOOKUP(I$468,'Base de dados'!$B$5:$AIN$11,$J476,0)),\"\")","v":""},3]
[null,"Toxicidade (mg kg-1 day-1)",null,{"$f":"IF(D$471>0,(HLOOKUP(D$468,'Base de dados'!$B$5:$AIN$11,$J477,0)),\"\")","v":""},{"$f":"IF(E$471>0,(HLOOKUP(E$468,'Base de dados'!$B$5:$AIN$11,$J477,0)),\"\")","v":""},{"$f":"IF(F$471>0,(HLOOKUP(F$468,'Base de dados'!$B$5:$AIN$11,$J477,0)),\"\")","v":""},{"$f":"IF(G$471>0,(HLOOKUP(G$468,'Base de dados'!$B$5:$AIN$11,$J477,0)),\"\")","v":""},{"$f":"IF(H$471>0,(HLOOKUP(H$468,'Base de dados'!$B$5:$AIN$11,$J477,0)),\"\")","v":""},{"$f":"IF(I$471>0,(HLOOKUP(I$468,'Base de dados'!$B$5:$AIN$11,$J477,0)),\"\")","v":""},4]
[null,"Índice para toxicidade do produto\t",null,{"$f":"IF(D$471>0,(HLOOKUP(D$468,'Base de dados'!$B$5:$AIN$11,$J478,0)),\"\")","v":""},{"$f":"IF(E$471>0,(HLOOKUP(E$468,'Base de dados'!$B$5:$AIN$11,$J478,0)),\"\")","v":""},{"$f":"IF(F$471>0,(HLOOKUP(F$468,'Base de dados'!$B$5:$AIN$11,$J478,0)),\"\")","v":""},{"$f":"IF(G$471>0,(HLOOKUP(G$468,'Base de dados'!$B$5:$AIN$11,$J478,0)),\"\")","v":""},{"$f":"IF(H$471>0,(HLOOKUP(H$468,'Base de dados'!$B$5:$AIN$11,$J478,0)),\"\")","v":""},{"$f":"IF(I$471>0,(HLOOKUP(I$468,'Base de dados'!$B$5:$AIN$11,$J478,0)),\"\")","v":""},5]
[null,"Koc",null,{"$f":"IF(D$471>0,(HLOOKUP(D$468,'Base de dados'!$B$5:$AIN$11,$J479,0)),\"\")","v":""},{"$f":"IF(E$471>0,(HLOOKUP(E$468,'Base de dados'!$B$5:$AIN$11,$J479,0)),\"\")","v":""},{"$f":"IF(F$471>0,(HLOOKUP(F$468,'Base de dados'!$B$5:$AIN$11,$J479,0)),\"\")","v":""},{"$f":"IF(G$471>0,(HLOOKUP(G$468,'Base de dados'!$B$5:$AIN$11,$J479,0)),\"\")","v":""},{"$f":"IF(H$471>0,(HLOOKUP(H$468,'Base de dados'!$B$5:$AIN$11,$J479,0)),\"\")","v":""},{"$f":"IF(I$471>0,(HLOOKUP(I$468,'Base de dados'!$B$5:$AIN$11,$J479,0)),\"\")","v":""},6]
[null,"t1/2 (DT50)",null,{"$f":"IF(D$471>0,(HLOOKUP(D$468,'Base de dados'!$B$5:$AIN$11,$J480,0)),\"\")","v":""},{"$f":"IF(E$471>0,(HLOOKUP(E$468,'Base de dados'!$B$5:$AIN$11,$J480,0)),\"\")","v":""},{"$f":"IF(F$471>0,(HLOOKUP(F$468,'Base de dados'!$B$5:$AIN$11,$J480,0)),\"\")","v":""},{"$f":"IF(G$471>0,(HLOOKUP(G$468,'Base de dados'!$B$5:$AIN$11,$J480,0)),\"\")","v":""},{"$f":"IF(H$471>0,(HLOOKUP(H$468,'Base de dados'!$B$5:$AIN$11,$J480,0)),\"\")","v":""},{"$f":"IF(I$471>0,(HLOOKUP(I$468,'Base de dados'!$B$5:$AIN$11,$J480,0)),\"\")","v":""},7]
[null,"GUS\t",null,{"$f":"IF(D471=0,\"\",IF(LOG10(D480)*(4-LOG10(D479))<=0,0,IF(OR(LOG10(D480)*(4-LOG10(D479))>0,),(LOG10(D480)*(4-LOG10(D479))),IF((LOG10(D480)*(4-LOG10(D479))>0),(LOG10(D480)*(4-LOG10(D479)))))))","v":""},{"$f":"IF(E471=0,\"\",IF(LOG10(E480)*(4-LOG10(E479))<=0,0,IF(OR(LOG10(E480)*(4-LOG10(E479))>0,),(LOG10(E480)*(4-LOG10(E479))),IF((LOG10(E480)*(4-LOG10(E479))>0),(LOG10(E480)*(4-LOG10(E479)))))))","v":""},{"$f":"IF(F471=0,\"\",IF(LOG10(F480)*(4-LOG10(F479))<=0,0,IF(OR(LOG10(F480)*(4-LOG10(F479))>0,),(LOG10(F480)*(4-LOG10(F479))),IF((LOG10(F480)*(4-LOG10(F479))>0),(LOG10(F480)*(4-LOG10(F479)))))))","v":""},"","",""]
[null,"Potencial de contaminação (1, 2 or 3)",null,{"$f":"IF(D471>0,(IF(OR(M399=0.83,M399<0.83),1,IF(OR(AND(0.83<M399,M399<=1.66)),2,IF(M399>1.66,3,\"\")))),\"\")","v":""},{"$f":"IF(E471>0,(IF(OR(Fórmulas!I438=0.83,Fórmulas!I438<0.83),1,IF(OR(AND(0.83<Fórmulas!I438,Fórmulas!I438<=1.66)),2,IF(Fórmulas!I438>1.66,3,\"\")))),\"\")","v":""},{"$f":"IF(F471>0,(IF(OR(Fórmulas!J438=0.83,Fórmulas!J438<0.83),1,IF(OR(AND(0.83<Fórmulas!J438,Fórmulas!J438<=1.66)),2,IF(Fórmulas!J438>1.66,3,\"\")))),\"\")","v":""},{"$f":"IF(G471>0,(IF(OR(Fórmulas!K438=0.83,Fórmulas!K438<0.83),1,IF(OR(AND(0.83<Fórmulas!K438,Fórmulas!K438<=1.66)),2,IF(Fórmulas!K438>1.66,3,\"\")))),\"\")","v":""},{"$f":"IF(H471>0,(IF(OR(Fórmulas!L438=0.83,Fórmulas!L438<0.83),1,IF(OR(AND(0.83<Fórmulas!L438,Fórmulas!L438<=1.66)),2,IF(Fórmulas!L438>1.66,3,\"\")))),\"\")","v":""},{"$f":"IF(I471>0,(IF(OR(Fórmulas!M438=0.83,Fórmulas!M438<0.83),1,IF(OR(AND(0.83<Fórmulas!M438,Fórmulas!M438<=1.66)),2,IF(Fórmulas!M438>1.66,3,\"\")))),\"\")","v":""}]
[null,"EIQ Impacto ao trabalhador rural",null,{"$f":"IF(D$471>0,(HLOOKUP(D$468,'Base de dados'!$B$5:$AIN$18,$J483,0)),\"\")","v":""},{"$f":"IF(E$471>0,(HLOOKUP(E$468,'Base de dados'!$B$5:$AIN$18,$J483,0)),\"\")","v":""},{"$f":"IF(F$471>0,(HLOOKUP(F$468,'Base de dados'!$B$5:$AIN$18,$J483,0)),\"\")","v":""},{"$f":"IF(G$471>0,(HLOOKUP(G$468,'Base de dados'!$B$5:$AIN$18,$J483,0)),\"\")","v":""},{"$f":"IF(H$471>0,(HLOOKUP(H$468,'Base de dados'!$B$5:$AIN$18,$J483,0)),\"\")","v":""},{"$f":"IF(I$471>0,(HLOOKUP(I$468,'Base de dados'!$B$5:$AIN$18,$J483,0)),\"\")","v":""},12]
[null,"EIQ Impacto ao consumidor",null,{"$f":"IF(D$471>0,(HLOOKUP(D$468,'Base de dados'!$B$5:$AIN$18,$J484,0)),\"\")","v":""},{"$f":"IF(E$471>0,(HLOOKUP(E$468,'Base de dados'!$B$5:$AIN$18,$J484,0)),\"\")","v":""},{"$f":"IF(F$471>0,(HLOOKUP(F$468,'Base de dados'!$B$5:$AIN$18,$J484,0)),\"\")","v":""},{"$f":"IF(G$471>0,(HLOOKUP(G$468,'Base de dados'!$B$5:$AIN$18,$J484,0)),\"\")","v":""},{"$f":"IF(H$471>0,(HLOOKUP(H$468,'Base de dados'!$B$5:$AIN$18,$J484,0)),\"\")","v":""},{"$f":"IF(I$471>0,(HLOOKUP(I$468,'Base de dados'!$B$5:$AIN$18,$J484,0)),\"\")","v":""},13]
[null,"EIQ Impacto ao meio ambiente",null,{"$f":"IF(D$471>0,(HLOOKUP(D$468,'Base de dados'!$B$5:$AIN$18,$J485,0)),\"\")","v":""},{"$f":"IF(E$471>0,(HLOOKUP(E$468,'Base de dados'!$B$5:$AIN$18,$J485,0)),\"\")","v":""},{"$f":"IF(F$471>0,(HLOOKUP(F$468,'Base de dados'!$B$5:$AIN$18,$J485,0)),\"\")","v":""},{"$f":"IF(G$471>0,(HLOOKUP(G$468,'Base de dados'!$B$5:$AIN$18,$J485,0)),\"\")","v":""},{"$f":"IF(H$471>0,(HLOOKUP(H$468,'Base de dados'!$B$5:$AIN$18,$J485,0)),\"\")","v":""},{"$f":"IF(I$471>0,(HLOOKUP(I$468,'Base de dados'!$B$5:$AIN$18,$J485,0)),\"\")","v":""},14]
[null,"Environmental Impact Quotient (EIQ)",null,{"$f":"IF(D$471>0,(HLOOKUP(D$468,'Base de dados'!$B$5:$AIN$18,$J486,0)),\"\")","v":""},{"$f":"IF(E$471>0,(HLOOKUP(E$468,'Base de dados'!$B$5:$AIN$18,$J486,0)),\"\")","v":""},{"$f":"IF(F$471>0,(HLOOKUP(F$468,'Base de dados'!$B$5:$AIN$18,$J486,0)),\"\")","v":""},{"$f":"IF(G$471>0,(HLOOKUP(G$468,'Base de dados'!$B$5:$AIN$18,$J486,0)),\"\")","v":""},{"$f":"IF(H$471>0,(HLOOKUP(H$468,'Base de dados'!$B$5:$AIN$18,$J486,0)),\"\")","v":""},{"$f":"IF(I$471>0,(HLOOKUP(I$468,'Base de dados'!$B$5:$AIN$18,$J486,0)),\"\")","v":""},11]
[null,"Pesticidas banidos na União Européia",null,{"$f":"IF(D$471>0,(HLOOKUP(D$468,'Base de dados'!$B$5:$AIN$19,$J487,0)),\"\")","v":""},{"$f":"IF(E$471>0,(HLOOKUP(E$468,'Base de dados'!$B$5:$AIN$19,$J487,0)),\"\")","v":""},{"$f":"IF(F$471>0,(HLOOKUP(F$468,'Base de dados'!$B$5:$AIN$19,$J487,0)),\"\")","v":""},{"$f":"IF(G$471>0,(HLOOKUP(G$468,'Base de dados'!$B$5:$AIN$19,$J487,0)),\"\")","v":""},{"$f":"IF(H$471>0,(HLOOKUP(H$468,'Base de dados'!$B$5:$AIN$19,$J487,0)),\"\")","v":""},{"$f":"IF(I$471>0,(HLOOKUP(I$468,'Base de dados'!$B$5:$AIN$19,$J487,0)),\"\")","v":""},15,{"$f":"COUNTIF('2 Indicadores'!D358:F358,\"x\")","v":0},{"$f":"COUNTIF(D430:L430,\"x\")","v":0},{"$f":"COUNTIF(D459:L459,\"x\")","v":0},{"$f":"COUNTIF(D487:I487,\"x\")","v":0}]
[{"$nulls":13},{"$f":"SUM(K487:N487)","v":0}]
[null,"Teor de argila no solo                                                             > 60% (1); 30% - 60% (2); <30% (3)\t"]
[null,"Distância do curso d' água (borda do talhão) >1.000m (1);  300 - 1.000m (2);  <300m (3)\t"]
[null,"Tipo de manejo do solo: Solo protegido (1); Solo sem revolvimento (2); Solo com revolvimento (3)\t"]
[null,"Vulnerabilidade do talhão  (1, 2 ou 3)\t",null,{"$f":"IF(D472>0,(IF(OR(AND(1<=Fórmulas!M400,Fórmulas!M400<=3)),1,IF(OR(AND(3<Fórmulas!M400,Fórmulas!M400<=9)),2,IF(Fórmulas!M400>9,3)))),\"\")","v":""},{"$f":"IF(E472>0,(IF(OR(AND(1<=Fórmulas!N400,Fórmulas!N400<=3)),1,IF(OR(AND(3<Fórmulas!N400,Fórmulas!N400<=9)),2,IF(Fórmulas!N400>9,3)))),\"\")","v":""},{"$f":"IF(F472>0,(IF(OR(AND(1<=Fórmulas!B406,Fórmulas!B406<=3)),1,IF(OR(AND(3<Fórmulas!B406,Fórmulas!B406<=9)),2,IF(Fórmulas!B406>9,3)))),\"\")","v":""},{"$f":"IF(G472>0,(IF(OR(AND(1<=Fórmulas!C406,Fórmulas!C406<=3)),1,IF(OR(AND(3<Fórmulas!C406,Fórmulas!C406<=9)),2,IF(Fórmulas!C406>9,3)))),\"\")","v":""},{"$f":"IF(H472>0,(IF(OR(AND(1<=Fórmulas!D406,Fórmulas!D406<=3)),1,IF(OR(AND(3<Fórmulas!D406,Fórmulas!D406<=9)),2,IF(Fórmulas!D406>9,3)))),\"\")","v":""},{"$f":"IF(I472>0,(IF(OR(AND(1<=Fórmulas!E406,Fórmulas!E406<=3)),1,IF(OR(AND(3<Fórmulas!E406,Fórmulas!E406<=9)),2,IF(Fórmulas!E406>9,3)))),\"\")","v":""}]
[]
[null,"Risco de contaminação (1, 2 ou 3)",null,{"$f":"IF(D472>0,(IF(OR(AND(1<=Fórmulas!M402,Fórmulas!M402<=2)),1,IF(OR(AND(2<Fórmulas!M402,Fórmulas!M402<=4)),2,IF(Fórmulas!M402>4,3)))),\"\")","v":""},{"$f":"IF(E472>0,(IF(OR(AND(1<=Fórmulas!N402,Fórmulas!N402<=2)),1,IF(OR(AND(2<Fórmulas!N402,Fórmulas!N402<=4)),2,IF(Fórmulas!N402>4,3)))),\"\")","v":""},{"$f":"IF(F472>0,(IF(OR(AND(1<=Fórmulas!B408,Fórmulas!B408<=2)),1,IF(OR(AND(2<Fórmulas!B408,Fórmulas!B408<=4)),2,IF(Fórmulas!B408>4,3)))),\"\")","v":""},{"$f":"IF(G472>0,(IF(OR(AND(1<=Fórmulas!C408,Fórmulas!C408<=2)),1,IF(OR(AND(2<Fórmulas!C408,Fórmulas!C408<=4)),2,IF(Fórmulas!C408>4,3)))),\"\")","v":""},{"$f":"IF(H472>0,(IF(OR(AND(1<=Fórmulas!D408,Fórmulas!D408<=2)),1,IF(OR(AND(2<Fórmulas!D408,Fórmulas!D408<=4)),2,IF(Fórmulas!D408>4,3)))),\"\")","v":""},{"$f":"IF(I472>0,(IF(OR(AND(1<=Fórmulas!E408,Fórmulas!E408<=2)),1,IF(OR(AND(2<Fórmulas!E408,Fórmulas!E408<=4)),2,IF(Fórmulas!E408>4,3)))),\"\")","v":""}]
[]
[null,"Identificação da cultura\t\t",null,{"$f":"+'2 Indicadores'!D368","v":0},{"$f":"+'2 Indicadores'!E368","v":0},{"$f":"+'2 Indicadores'!F368","v":0},{"$f":"'2 Indicadores'!H368","v":0},{"$f":"+'2 Indicadores'!H368","v":0}]
[null,"Área (ha)\t",null,{"$f":"+'2 Indicadores'!D369","v":0},{"$f":"+'2 Indicadores'!E369","v":0},{"$f":"+'2 Indicadores'!F369","v":0},{"$f":"'2 Indicadores'!H369","v":0},{"$f":"+'2 Indicadores'!H369","v":0}]
[null,"Risco máximo identificado (1 - baixo), (2 - médio) ou (3 - alto)\t",null,{"$f":"+'2 Indicadores'!D370","v":0},{"$f":"+'2 Indicadores'!E370","v":0},{"$f":"+'2 Indicadores'!F370","v":0},{"$f":"'2 Indicadores'!H370","v":0},{"$f":"+'2 Indicadores'!H370","v":0}]
[null,"Média do risco de contaminação\t",null,{"$f":"IF('2 Indicadores'!D344>0,((Fórmulas!E502*'2 Indicadores'!D369+Fórmulas!F502*'2 Indicadores'!E369+Fórmulas!G502*'2 Indicadores'!F369+Fórmulas!H502*'2 Indicadores'!G369+Fórmulas!H503*'2 Indicadores'!H369)/D501),\"\")","v":""},{"$f":"IF(AND('2 Indicadores'!D343>0,D498=1),0.6,\"\")","v":""},{"$f":"IF(AND('2 Indicadores'!D343>0,E498=1),0.6,\"\")","v":""},{"$f":"IF(AND('2 Indicadores'!D343>0,F498=1),0.6,\"\")","v":""},{"$f":"IF(AND('2 Indicadores'!D343>0,G498=1),0.6,\"\")","v":""}]
[null,"Volume total de agrotóxicos utilizados em 1 ano\t",null,{"$f":"IF('2 Indicadores'!D344>0,'2 Indicadores'!D345+'2 Indicadores'!E345+'2 Indicadores'!F345+'2 Indicadores'!G345+'2 Indicadores'!H345+Fórmulas!D416+Fórmulas!E416+Fórmulas!F416+Fórmulas!G416+Fórmulas!H416+Fórmulas!I416+Fórmulas!J416+Fórmulas!K416+Fórmulas!L416+Fórmulas!D445+Fórmulas!E445+Fórmulas!F445+Fórmulas!G445+Fórmulas!H445+Fórmulas!I445+Fórmulas!J445+Fórmulas!K445+Fórmulas!L445+Fórmulas!D473+Fórmulas!E473+Fórmulas!F473+Fórmulas!G473+Fórmulas!H473+Fórmulas!I473,\"\")","v":""},{"$f":"IF(AND('2 Indicadores'!D343>0,D498=2),0.3,\"\")","v":""},{"$f":"IF(AND('2 Indicadores'!D343>0,E498=2),0.3,\"\")","v":""},{"$f":"IF(AND('2 Indicadores'!D343>0,F498=2),0.3,\"\")","v":""},{"$f":"IF(AND('2 Indicadores'!D343>0,G498=2),0.3,\"\")","v":""}]
[null,"Área total de lavoura (incluindo rotações)\t",null,{"$f":"IF('2 Indicadores'!D369>0,(SUM('2 Indicadores'!D369:H369)),\"\")","v":""},{"$f":"IF(AND('2 Indicadores'!D343>0,D498=3),0.1,\"\")","v":""},{"$f":"IF(AND('2 Indicadores'!D343>0,E498=3),0.1,\"\")","v":""},{"$f":"IF(AND('2 Indicadores'!D343>0,F498=3),0.1,\"\")","v":""},{"$f":"IF(AND('2 Indicadores'!D343>0,G498=3),0.1,\"\")","v":""}]
[null,"Volume total / área identificada nos talhões\t",null,{"$f":"IF('2 Indicadores'!D344>0,(D500/D501),\"\")","v":""},{"$f":"SUM(E499:E501)","v":0},{"$f":"SUM(F499:F501)","v":0},{"$f":"SUM(G499:G501)","v":0},{"$f":"SUM(H499:H501)","v":0}]
[null,"Volume total / área com uso agropecuário\t",null,{"$f":"IF('2 Indicadores'!D344>0,D500/('1 Questionário'!D86+'1 Questionário'!D87+'1 Questionário'!D88+'1 Questionário'!D89),\"\")","v":""},{"$f":"IF(AND('2 Indicadores'!D343>0,H498=1),0.6,\"\")","v":""},{"$f":"IF(AND('2 Indicadores'!D343>0,H498=2),0.3,\"\")","v":""},{"$f":"IF(AND('2 Indicadores'!D343>0,H498=2),0.3,\"\")","v":""},{"$f":"SUM(E503:G503)","v":0}]
[null,{"$f":"IF(AND('2 Indicadores'!D343>0,'2 Indicadores'!D370=1),0.6,\"\")","v":""},{"$f":"IF(AND('2 Indicadores'!D343>0,'2 Indicadores'!E370=1),0.6,\"\")","v":""},{"$f":"IF(AND('2 Indicadores'!D343>0,'2 Indicadores'!F370=1),0.6,\"\")","v":""},{"$f":"IF(AND('2 Indicadores'!D343>0,'2 Indicadores'!G370=1),0.6,\"\")","v":""}]
[null,{"$f":"IF(AND('2 Indicadores'!D343>0,'2 Indicadores'!D370=3),0.1,\"\")","v":""},{"$f":"IF(AND('2 Indicadores'!D343>0,'2 Indicadores'!E370=3),0.1,\"\")","v":""},{"$f":"IF(AND('2 Indicadores'!D343>0,'2 Indicadores'!F370=3),0.1,\"\")","v":""},{"$f":"IF(AND('2 Indicadores'!D343>0,'2 Indicadores'!G370=3),0.1,\"\")","v":""}]
[]
[]
[null,"Fator de Ponderação\t\t",{"$nulls":3},"Fórmulas"]
[null,{"$f":"+'2 Indicadores'!B374:D374","v":"Número de pessoas que aplicam ou manuseiam agrotóxicos\t\t"},{"v":1,"d":"1.0"},null,null,"Fórmula: 0,7, se atende todas as regras, conforme legislação ambiental vigente (EPI; armazenamento e devolução de embalagens)\t\t\n\t\t"]
[null,{"$f":"+'2 Indicadores'!B375:D375","v":"Número de pessoas que utilizam EPI conforme as normas de segurança\t\t\t\t"},{"v":1,"d":"1.0"}]
[null,{"$f":"+'2 Indicadores'!B377:D377","v":"Armazenamento adequado das embalagens\t\t"},{"v":1,"d":"1.0"},null,null,{"$f":"IF('2 Indicadores'!E374>0,('2 Indicadores'!E375/'2 Indicadores'!E374),0.7)","v":{"v":0.7,"d":"0.70"}},{"$f":"IF('2 Indicadores'!E374>0,(H511+H512+F511)/3*0.7,0.7)","v":{"v":0.7,"d":"0.70"}},{"$f":"IF('2 Indicadores'!E377=\"Sim\",1,0)","v":0}]
[null,{"$f":"+'2 Indicadores'!B378:D378","v":"Devolução das embalagens de agrotóxicos\t\t"},{"v":1,"d":"1.0"},{"$nulls":4},{"$f":"IF('2 Indicadores'!E378=\"Sim\",1,0)","v":0}]
[]
[]
[14,"Fator de Ponderação\t\t",null,null,"Fórmulas",{"$nulls":6},"UNIDADES X"]
[null,"Alto",{"v":1,"d":"1.0"},null,{"$f":"'2 Indicadores'!D388/Fórmulas!J520","v":{"$error":"#DIV/0!"}},{"$f":"'2 Indicadores'!E388/Fórmulas!J520","v":{"$error":"#DIV/0!"}},{"$f":"'2 Indicadores'!F388/Fórmulas!J520","v":{"$error":"#DIV/0!"}},{"$f":"'2 Indicadores'!G388/Fórmulas!J520","v":{"$error":"#DIV/0!"}},null,{"$f":"Fórmulas!E516+Fórmulas!F516+Fórmulas!G516+Fórmulas!H516","v":{"$error":"#DIV/0!"}},null,"Suficiente"]
[null,"Moderado",0.6,null,{"$f":"'2 Indicadores'!D389/Fórmulas!J520","v":{"$error":"#DIV/0!"}},{"$f":"'2 Indicadores'!E389/Fórmulas!J520","v":{"$error":"#DIV/0!"}},{"$f":"'2 Indicadores'!F389/Fórmulas!J520","v":{"$error":"#DIV/0!"}},{"$f":"'2 Indicadores'!G389/Fórmulas!J520","v":{"$error":"#DIV/0!"}},null,{"$f":"Fórmulas!E517+Fórmulas!F517+Fórmulas!G517+Fórmulas!H517","v":{"$error":"#DIV/0!"}},null,"Insuficiente"]
[null,"Incipiente",0.3,null,{"$f":"'2 Indicadores'!D390/Fórmulas!J520","v":{"$error":"#DIV/0!"}},{"$f":"'2 Indicadores'!E390/Fórmulas!J520","v":{"$error":"#DIV/0!"}},{"$f":"'2 Indicadores'!F390/Fórmulas!J520","v":{"$error":"#DIV/0!"}},{"$f":"'2 Indicadores'!G390/Fórmulas!J520","v":{"$error":"#DIV/0!"}},null,{"$f":"Fórmulas!E518+Fórmulas!F518+Fórmulas!G518+Fórmulas!H518","v":{"$error":"#DIV/0!"}},null,"Situação crítica"]
[null,"Situação crítica",0.1,null,{"$f":"'2 Indicadores'!D391/Fórmulas!J520","v":{"$error":"#DIV/0!"}},{"$f":"'2 Indicadores'!E391/Fórmulas!J520","v":{"$error":"#DIV/0!"}},{"$f":"'2 Indicadores'!F391/Fórmulas!J520","v":{"$error":"#DIV/0!"}},{"$f":"'2 Indicadores'!G391/Fórmulas!J520","v":{"$error":"#DIV/0!"}},null,{"$f":"Fórmulas!E519+Fórmulas!F519+Fórmulas!G519+Fórmulas!H519","v":{"$error":"#DIV/0!"}}]
[{"$nulls":4},"Área Total do imóvel rural (ha)=>\t\t\t",{"$nulls":3},{"$f":"+'1 Questionário'!I95","v":0},{"$f":"'2 Indicadores'!D388+'2 Indicadores'!D389+'2 Indicadores'!D390+'2 Indicadores'!D391+'2 Indicadores'!E388+'2 Indicadores'!E389+'2 Indicadores'!E390+'2 Indicadores'!E391+'2 Indicadores'!F388+'2 Indicadores'!F389+'2 Indicadores'!F390+'2 Indicadores'!F391+'2 Indicadores'!G388+'2 Indicadores'!G389+'2 Indicadores'!G390+'2 Indicadores'!G391","v":{"v":0,"d":"0.0"}}]
[]
[null,"Ponderação",{"$nulls":5},{"$f":"IF('2 Indicadores'!D395=\"Suficiente\",Fórmulas!B523,0)","v":0}]
[null,{"$f":"+'2 Indicadores'!E395","v":{"v":1,"d":"1.0"}},null,null,{"$f":"(Fórmulas!J516*Fórmulas!C516)+(J517*C517)+(Fórmulas!J518*Fórmulas!C518)+(Fórmulas!J519*Fórmulas!C519)","v":{"$error":"#DIV/0!"}},{"$f":"SUM(H522:H524)","v":{"v":0,"d":"0.00"}},null,{"$f":"IF('2 Indicadores'!D395=\"Insuficiente\",Fórmulas!B524,0)","v":0}]
[null,{"$f":"+'2 Indicadores'!E396","v":0.4},{"$nulls":5},{"$f":"IF('2 Indicadores'!D395=\"Situação crítica\",Fórmulas!B525,0)","v":0}]
[null,{"$f":"+'2 Indicadores'!E397","v":0.1}]
[]
[]
[15,"Fator de Ponderação\t\t",null,null,15.1,"Fórmulas"]
[null,"Alto",{"v":1,"d":"1.0"},null,{"$f":"'2 Indicadores'!D404/Fórmulas!M533","v":{"$error":"#DIV/0!"}},{"$f":"'2 Indicadores'!E404/Fórmulas!M533","v":{"$error":"#DIV/0!"}},{"$f":"'2 Indicadores'!F404/Fórmulas!M533","v":{"$error":"#DIV/0!"}},{"$f":"'2 Indicadores'!G404/Fórmulas!M533","v":{"$error":"#DIV/0!"}},{"$nulls":4},{"$f":"Fórmulas!E529+Fórmulas!F529+Fórmulas!G529+Fórmulas!H529","v":{"$error":"#DIV/0!"}}]
[null,"Moderado",0.6,null,{"$f":"'2 Indicadores'!D405/Fórmulas!M533","v":{"$error":"#DIV/0!"}},{"$f":"'2 Indicadores'!E405/Fórmulas!M533","v":{"$error":"#DIV/0!"}},{"$f":"'2 Indicadores'!F405/Fórmulas!M533","v":{"$error":"#DIV/0!"}},{"$f":"'2 Indicadores'!G405/Fórmulas!M533","v":{"$error":"#DIV/0!"}},{"$nulls":4},{"$f":"Fórmulas!E530+Fórmulas!F530+Fórmulas!G530+Fórmulas!H530","v":{"$error":"#DIV/0!"}}]
[null,"Incipiente",0.3,null,{"$f":"'2 Indicadores'!D406/Fórmulas!M533","v":{"$error":"#DIV/0!"}},{"$f":"'2 Indicadores'!E406/Fórmulas!M533","v":{"$error":"#DIV/0!"}},{"$f":"'2 Indicadores'!F406/Fórmulas!M533","v":{"$error":"#DIV/0!"}},{"$f":"'2 Indicadores'!G406/Fórmulas!M533","v":{"$error":"#DIV/0!"}},{"$nulls":4},{"$f":"Fórmulas!E531+Fórmulas!F531+Fórmulas!G531+Fórmulas!H531","v":{"$error":"#DIV/0!"}}]
[null,"Situação crítica",0.1,null,{"$f":"'2 Indicadores'!D407/Fórmulas!M533","v":{"$error":"#DIV/0!"}},{"$f":"'2 Indicadores'!E407/Fórmulas!M533","v":{"$error":"#DIV/0!"}},{"$f":"'2 Indicadores'!F407/Fórmulas!M533","v":{"$error":"#DIV/0!"}},{"$f":"'2 Indicadores'!G407/Fórmulas!M533","v":{"$error":"#DIV/0!"}},{"$nulls":4},{"$f":"Fórmulas!E532+Fórmulas!F532+Fórmulas!G532+Fórmulas!H532","v":{"$error":"#DIV/0!"}}]
[{"$nulls":12},{"$f":"'2 Indicadores'!D404+'2 Indicadores'!D405+'2 Indicadores'!D406+'2 Indicadores'!D407+'2 Indicadores'!E404+'2 Indicadores'!E405+'2 Indicadores'!E406+'2 Indicadores'!E407+'2 Indicadores'!F404+'2 Indicadores'!F405+'2 Indicadores'!F406+'2 Indicadores'!F407+'2 Indicadores'!G404+'2 Indicadores'!G405+'2 Indicadores'!G406+'2 Indicadores'!G407","v":{"v":0,"d":"0.0"}}]
[null,"Fator de Ponderação\t\t"]
[null,0,{"v":0,"d":"0.0"}]
[null,5,0.1]
[null,10,0.2]
[null,20,0.4,{"$nulls":4},"Uso da terra\t",null,"Área","% relativa","pi*Loge"]
[null,40,0.6,{"$nulls":4},"Índice Shanon-Wiener - áreas produtivas e habitats naturais\t\t\t\t"]
[null,60,0.7,{"$nulls":4},"Lavoura Permanente\t",null,{"$f":"+'1 Questionário'!D86","v":{"v":0,"d":"0.00"}},{"$f":"J540/$J$549","v":{"$error":"#DIV/0!"}},{"$f":"IF(K540>0,K540*LOG10(K540),0)","v":{"$error":"#DIV/0!"}}]
[null,70,0.8,null,15.2,"Fórmulas",null,"Lavoura temporária\t",null,{"$f":"+'1 Questionário'!D87","v":{"v":0,"d":"0.00"}},{"$error":"#DIV/0!"},{"$error":"#DIV/0!"}]
[null,80,0.9,null,"Fórmula =  y=a(1-exp(-bx))",null,null,"Pastagens\t",null,{"$f":"+'1 Questionário'!D88","v":{"v":0,"d":"0.00"}},{"$error":"#DIV/0!"},{"$error":"#DIV/0!"}]
[null,100,{"v":1,"d":"1.0"},null,"r2",0.9914,null,"Silvicultura\t",null,{"$f":"+'1 Questionário'!D89","v":{"v":0,"d":"0.00"}},{"$error":"#DIV/0!"},{"$error":"#DIV/0!"}]
[{"$nulls":4},"a",{"v":1.168,"d":"1.1680"},null,"Pousio\t",null,{"$f":"+'1 Questionário'!D91","v":{"v":0,"d":"0.00"}},{"$error":"#DIV/0!"},{"$error":"#DIV/0!"}]
[{"$nulls":4},"b",{"v":0.017645063,"d":"0.0176"},null,"Vegetação nativa 1\t",null,{"$f":"SUM('2 Indicadores'!D423:D425)","v":{"v":0,"d":"0.00"}},{"$error":"#DIV/0!"},{"$error":"#DIV/0!"}]
[{"$nulls":4},"x"," - Σpi loge pi",null,"Vegetação nativa 2",null,{"$f":"SUM('2 Indicadores'!E423:E425)","v":{"v":0,"d":"0.00"}},{"$error":"#DIV/0!"},{"$error":"#DIV/0!"}]
[{"$nulls":7},"Vegetação nativa 3\t",null,{"$f":"SUM('2 Indicadores'!F423:F425)","v":{"v":0,"d":"0.00"}},{"$error":"#DIV/0!"},{"$error":"#DIV/0!"}]
[{"$nulls":7},"Vegetação nativa 4\t",null,{"$f":"SUM('2 Indicadores'!G423:G425)","v":{"v":0,"d":"0.00"}},{"$error":"#DIV/0!"},{"$error":"#DIV/0!"}]
[{"$nulls":7},"Soma",null,{"$f":"SUM(J540:J548)","v":{"v":0,"d":"0.00"}},{"$f":"SUM(K540:K548)","v":{"$error":"#DIV/0!"}},{"$f":"-(SUM(L540:L548))","v":{"$error":"#DIV/0!"}}]
[]
[]
[16,"Fórmulas",{"$nulls":6},"Campo rupestre/altitude",null,"Fator de ponderação\t\t\t"]
[null,"16.1 - Fórmulas: Se a área total com vegetação nativa for superior a 20% da área total do estabelecimento, acréscimo de 10% no resultado final.",{"$nulls":6},"Campo higrófilo de várzea",null,"Estádio avançado\t\t",null,null,{"v":1,"d":"1.0"}]
[{"$nulls":8},"Cerrado ralo",null,"Estádio intermediário",null,null,0.9]
[null,{"$f":"'2 Indicadores'!D423/Fórmulas!E576","v":{"$error":"#DIV/0!"}},{"$f":"'2 Indicadores'!E423/Fórmulas!E576","v":{"$error":"#DIV/0!"}},{"$f":"'2 Indicadores'!F423/Fórmulas!E576","v":{"$error":"#DIV/0!"}},{"$f":"'2 Indicadores'!G423/Fórmulas!E576","v":{"$error":"#DIV/0!"}},{"$f":"IF('1 Questionário'!$I$93=0,\"\",Fórmulas!B555+Fórmulas!C555+Fórmulas!D555+Fórmulas!E555)","v":""},null,null,"Cerrado típico",null,"Estádio inicial\t\t",null,null,0.7]
[null,{"$f":"'2 Indicadores'!D424/Fórmulas!E576","v":{"$error":"#DIV/0!"}},{"$f":"'2 Indicadores'!E424/Fórmulas!E576","v":{"$error":"#DIV/0!"}},{"$f":"'2 Indicadores'!F424/Fórmulas!E576","v":{"$error":"#DIV/0!"}},{"$f":"'2 Indicadores'!G424/Fórmulas!E576","v":{"$error":"#DIV/0!"}},{"$f":"IF('1 Questionário'!$I$93=0,\"\",Fórmulas!B556+Fórmulas!C556+Fórmulas!D556+Fórmulas!E556)","v":""},null,null,"Cerradão"]
[null,{"$f":"'2 Indicadores'!D425/Fórmulas!E576","v":{"$error":"#DIV/0!"}},{"$f":"'2 Indicadores'!E425/Fórmulas!E576","v":{"$error":"#DIV/0!"}},{"$f":"'2 Indicadores'!F425/Fórmulas!E576","v":{"$error":"#DIV/0!"}},{"$f":"'2 Indicadores'!G425/Fórmulas!E576","v":{"$error":"#DIV/0!"}},{"$f":"IF('1 Questionário'!$I$93=0,\"\",Fórmulas!B557+Fórmulas!C557+Fórmulas!D557+Fórmulas!E557)","v":""},null,null,"Mata de galeria"]
[null,{"$f":"IF(Fórmulas!E577>20%,(((Fórmulas!F555*Fórmulas!N553)+(Fórmulas!F556*Fórmulas!N554)+(Fórmulas!F557*Fórmulas!N555))*1.1),(Fórmulas!F555*Fórmulas!N553)+(Fórmulas!F556*Fórmulas!N554)+(Fórmulas!F557*Fórmulas!N555))","v":{"$error":"#DIV/0!"}},{"$f":"IF(B558>1,1,B558)","v":{"$error":"#DIV/0!"}},{"$nulls":5},"Veredas",null,"Fator de ponderação\t\t\t"]
[null,{"$f":"'1 Questionário'!I93","v":{"v":0,"d":"0.00"}},{"$nulls":6},"Mata Atlântica/Mata Seca",null,"Nº de fragmentos\t\t"]
[null,{"$f":"IF('2 Indicadores'!F432=\"Sim\",(('2 Indicadores'!C426+'2 Indicadores'!C430)/2*1.1),(('2 Indicadores'!C430+'2 Indicadores'!C426)/2))","v":{"$error":"#VALUE!"}},{"$f":"IF(B560>1,1,B560)","v":{"$error":"#VALUE!"}},{"$nulls":5},"Vegetação de caatinga",null,1,null,null,{"v":1,"d":"1.0"}]
[null,{"$f":"IF('2 Indicadores'!F434=\"Sim\",Fórmulas!C560,Fórmulas!C560*0.75)","v":{"$error":"#VALUE!"}},{"$nulls":8},2,null,null,0.9]
[{"$nulls":10},3,null,null,0.8]
[null,"Área total vegetação nativa (%)",{"$f":"B559/Fórmulas!I520","v":{"$error":"#DIV/0!"}},"18.2 - Se a área com vegetação nativa < 5% da área total, rebate de 35% no resultado final ",{"$nulls":6},4,null,null,0.7]
[{"$nulls":10},5,null,null,0.6]
[{"$nulls":10},6,null,null,0.5]
[null,{"$f":"1.1-0.1*'2 Indicadores'!F429","v":1.1},{"$f":"IF(C563<5%,B566*0.65,B566)","v":{"$error":"#DIV/0!"}},{"$f":"IF('1 Questionário'!I93=0,0.1,Fórmulas!C566)","v":0.1}]
[null,"16.2 - Formula= 1,1 - 0,1x"]
[]
[null,"Estádio inicial - ausência de estratificação definida/predominância de indivíduos jovens com até 5 m, diâmetro altura do peito de 10 cm; serapilheira fina camada/Embaúba, Esporão de Galo, Assa Peixe, Camará, etc. "]
[]
[null,"Estádio médio - estratificação incipiente - 2 estratos - dossel e sub-bosque; árvores de 5 a 12 m de altura, redução gradativa de arbustos e arboredos; presença marcante de cipós; maior riqueza e abundância de epífitas; serapilheira presente; DAP entre 10 e 20 cm; predomínio de arbóreas."]
[]
[null,"Estádio avançado - três estratos - dossel, subdossel e sub-bosque; dossel superior 1 m de altura com ocorrência frequente de árvores emergentes; sub-bosque menos expressivo em relação ao estádio médio; menor densidade de cipós e arbustos, riqueza de epífitas; trepadeiras lenhosas; DAP superior a 18 cm."]
[]
[]
[null,"Área com vegetação nativa - (ha)\t\t",null,null,{"$f":"'1 Questionário'!I93","v":{"v":0,"d":"0.00"}}]
[null,"Área com vegetação nativa/área total do imóvel rural",null,null,{"$f":"E576/'1 Questionário'!I95","v":{"$error":"#DIV/0!"}}]
[]
[]
[17,"Fator de ponderação\t\t",{"$nulls":3},"Fórmulas"]
[null,"Uso adequado + vegetação nativa  \t",null,0.7,null,null,{"$f":"(((J582*Fórmulas!D581)+(J583*Fórmulas!D582))/100)","v":{"$error":"#DIV/0!"}},{"$f":"G581*('2 Indicadores'!G445)","v":{"$error":"#DIV/0!"}},{"$f":"IF('2 Indicadores'!G445=\"\",Fórmulas!G581,Fórmulas!H581)","v":{"$error":"#DIV/0!"}},"%"]
[null,"Uso inadequado\t",null,0.1,null,{"$f":"IF('1 Questionário'!D99>0,Fórmulas!I582,0.7)","v":{"v":0.7,"d":"0.70"}},null,null,{"$f":"IF(Fórmulas!I581>1,1,Fórmulas!I581)","v":{"$error":"#DIV/0!"}},{"$f":"+'2 Indicadores'!G441/'2 Indicadores'!$G$443*100","v":{"$error":"#DIV/0!"}}]
[{"$nulls":9},{"$f":"+'2 Indicadores'!G442/'2 Indicadores'!$G$443*100","v":{"$error":"#DIV/0!"}}]
[]
[null,"Proporção das APPs em relação a área total (%)  =>\t\t\t\t",{"$nulls":4},{"$f":"('2 Indicadores'!G441+'2 Indicadores'!G442)/Fórmulas!I520","v":{"$error":"#DIV/0!"}}]
[]
[]
[null,"Fator de ponderação\t\t",{"$nulls":3},"Fórmulas"]
[null,"Vegetação nativa excedente à RL\t",null,{"v":1,"d":"1.0"},null,null,{"$f":"IF('2 Indicadores'!F453>0,L593,0)","v":{"v":0,"d":"0.00"}},{"$f":"IF('2 Indicadores'!F454>0,+'2 Indicadores'!F454/'2 Indicadores'!D450*100,0)","v":{"v":0,"d":"0.00"}},{"$f":"IF('2 Indicadores'!F455>0,+'2 Indicadores'!F455/'2 Indicadores'!D450*100,0)","v":{"v":0,"d":"0.00"}},null,{"$f":"'2 Indicadores'!F453/'1 Questionário'!D72","v":{"$error":"#DIV/0!"}},{"$f":"IF(K589>0.2,1,0)","v":{"$error":"#DIV/0!"}}]
[null,"RL fora do imóvel rural\t",null,0.7,null,null,{"$f":"IF('2 Indicadores'!F456>0,+'2 Indicadores'!F456/'2 Indicadores'!D450*100,0)","v":{"v":0,"d":"0.00"}},{"$f":"SUM(F592:F593)","v":{"v":0.7,"d":"0.70"}},{"$nulls":3},{"$f":"IF(AND(K589>=0.1,K589<=0.2),0.67,0)","v":{"$error":"#DIV/0!"}}]
[null,"Áreas de/para RL não passíveis de recomposição\t",null,0.7,null,{"$f":"IF(AND('2 Indicadores'!D452=0,G592=0),0.7,G592)","v":{"v":0.7,"d":"0.70"}},{"$f":"IF('2 Indicadores'!F454>0,I592,F591)","v":{"v":0.7,"d":"0.70"}},{"$f":"Fórmulas!C598","v":0},{"$f":"IF(Fórmulas!G603>20%,0,Fórmulas!C598)","v":{"$error":"#DIV/0!"}},null,null,{"$f":"IF(AND(K589<0.1,K589>0),0.34,0)","v":{"$error":"#DIV/0!"}}]
[null,"Áreas de/para RL que necessitam de recomposição\t",null,0.1,null,{"$f":"IF(G591>1,1,G591)","v":{"v":0.7,"d":"0.70"}},{"$f":"IF('2 Indicadores'!F456=0,((((H589*Fórmulas!D590)+(I589*Fórmulas!D591)+(G590*Fórmulas!D592))/100)+G589*0.3),(((H589*Fórmulas!D590)+(I589*Fórmulas!D591)+(G590*Fórmulas!D592))/100))","v":{"v":0,"d":"0.00"}},null,{"$f":"IF(AND('2 Indicadores'!F455=\"\",'2 Indicadores'!F456=0),0.7,Fórmulas!F591)","v":0.7},null,null,{"$f":"IF(K589=0,0,0)","v":{"$error":"#DIV/0!"}}]
[{"$nulls":11},{"$f":"SUM(L589:L592)","v":{"$error":"#DIV/0!"}}]
[null,"Área correspondente à Reserva Legal (ha)*\t\t\t\t",{"$nulls":3},{"$f":"+Fórmulas!M598","v":{"v":0,"d":"0.00"}}]
[null,"*Para estabelecimentos acima de 4MF (considerando a área total do estabelecimento descrita no CAR, menos a área de Servidão Administrativa)"]
[null,"RL"]
[{"$nulls":12},{"$f":"'3 Relatório'!H5","v":{"v":0,"d":"0.00"}}]
[null,"RL",{"$f":"IF('1 Questionário'!E105>0,'1 Questionário'!D72*'1 Questionário'!E105,0)","v":{"v":0,"d":"0.00"}},{"$nulls":9},{"$f":"+M597*'1 Questionário'!E105","v":0}]
[]
[{"$nulls":5},"Area (ha) ","% (farm area)"]
[null,"Área total cultivada (culturas, silvicultura) + pastagens\t\t\t",{"$nulls":3},{"$f":"+'1 Questionário'!I90","v":{"v":0,"d":"0.00"}},{"$f":"F601/'1 Questionário'!$I$95","v":{"$error":"#DIV/0!"}},null,"Área de Reserva Legal (ha)  =>",null,null,{"$f":"'2 Indicadores'!D450","v":{"v":0,"d":"0.00"}}]
[null,"Área total com Vegetação Nativa\t\t\t",{"$nulls":3},{"$f":"+'1 Questionário'!I93","v":{"v":0,"d":"0.00"}},{"$f":"F602/'1 Questionário'!$I$95","v":{"$error":"#DIV/0!"}},null,"Área necessária de recomposição para RL no imóvel =>",null,null,{"$f":"IF('1 Questionário'!D76=\"Yes\",0,IF('1 Questionário'!E106=0,L601-'1 Questionário'!I93,0))","v":{"v":0,"d":"0.00"}}]
[null,"Área total classificada como APP\t\t\t",{"$nulls":3},{"$f":"'1 Questionário'!D99","v":{"v":0,"d":"0.00"}},{"$f":"F603/'1 Questionário'!$I$95","v":{"$error":"#DIV/0!"}}]
[null,"Total de áreas a serem recuperadas nas APPs\t\t\t",{"$nulls":3},{"$f":"+'1 Questionário'!D100","v":{"v":0,"d":"0.00"}},{"$f":"F604/'1 Questionário'!$I$95","v":{"$error":"#DIV/0!"}}]
[null,"Área de vegetação nativa fora das APPs e RL \t\t\t",{"$nulls":3},{"$f":"F602-L601","v":{"v":0,"d":"0.00"}},{"$f":"F605/'1 Questionário'!$I$95","v":{"$error":"#DIV/0!"}}]

{"sheet":"Base de dados","index":12,"n_rows":47,"n_cols":1065,"rows_kept":47,"merged":[[25,146,26,146],[25,147,26,147],[25,148,26,148],[25,149,26,149]]}
["ISA",null,"BASE DE DADOS"]
["AGROTÓXICOS",null,{"$f":"COUNTA(C3:ZC3)","v":677},{"$nulls":887}," "]
["Ação",null,"Herbicida","Fungicida","Inseticida","Herbicida","Herbicida","Inseticida","Inseticida","Inseticida","Inseticida","Herbicida","Fungicida","Herbicida","Inseticida","Fungicida","Inseticida","Herbicida","Herbicida","Herbicida","Inseticida","Fungicida","Fungicida","Herbicida","Herbicida","Herbicida","Fungicida","Inseticida","Fungicida","Herbicida","Herbicida","Inseticida","Fungicida","Inseticida","Inseticida","Fungicida","Herbicida","Herbicida","Herbicida","Herbicida","Herbicida","Fungicida","Inseticida","Inseticida","Herbicida","Fungicida","Fungicida","Inseticida","Inseticida","Fungicida","Fungicida","Herbicida","Herbicida","Herbicida","Fungicida","Herbicida","Herbicida","Inseticida","Fungicida","Herbicida","Herbicida","Herbicida","Herbicida","Fungicida","Herbicida","Herbicida","Herbicida","Inseticida","Inseticida","Inseticida","Inseticida","Herbicida","Fungicida","Fungicida","Herbicida","Fungicida","Fungicida","Inseticida","Inseticida","Fungicida","Fungicida","Fungicida","Inseticida","Inseticida","Inseticida","Herbicida","Fungicida","Inseticida","Fungicida","Inseticida","Fungicida","Inseticida","Inseticida","Fungicida","Fungicida","Herbicida","Inseticida","Inseticida","Inseticida","Herbicida","Inseticida","Herbicida","Fungicida","Fungicida","Inseticida","Herbicida","Fungicida","Fungicida","Inseticida","Herbicida","Inseticida","Herbicida","Inseticida","Herbicida","Inseticida","Herbicida","Fungicida","Fungicida","Fungicida","Inseticida","Inseticida","Inseticida","Fungicida","Fungicida","Inseticida","Fungicida","Inseticida","Fungicida","Herbicida","Inseticida","Inseticida","Inseticida","Fungicida","Inseticida","Inseticida","Fungicida","Fungicida","Herbicida","Fungicida","Fungicida","Inseticida","Fungicida","Inseticida","Inseticida","Inseticida","Fungicida","Inseticida","Herbicida","Inseticida","Inseticida","Fungicida","Inseticida","Fungicida","Fungicida","Inseticida","Herbicida","Herbicida","Herbicida","Herbicida","Herbicida","Inseticida","Inseticida","Inseticida","Fungicida","Herbicida","Herbicida","Herbicida","Fungicida","Inseticida","Inseticida","Fungicida","Inseticida","Fungicida","Fungicida","Inseticida","Fungicida","Herbicida","Inseticida","Inseticida","Herbicida","Fungicida","Inseticida","Inseticida","Fungicida","Inseticida","Inseticida","Fungicida","Fungicida","Fungicida","Inseticida","Fungicida","Inseticida","Fungicida","Inseticida","Inseticida","Fungicida","Fungicida","Inseticida","Herbicida","Herbicida","Herbicida","Herbicida","Fungicida","Inseticida","Inseticida","Inseticida","Fungicida","Inseticida","Inseticida","Herbicida","Inseticida","Herbicida","Herbicida","Fungicida","Fungicida","Herbicida","Herbicida","Herbicida","Fungicida","Fungicida","Herbicida","Herbicida","Fungicida","Fungicida","Inseticida","Fungicida","Inseticida","Inseticida","Herbicida","Fungicida","Fungicida","Fungicida","Fungicida","Herbicida","Fungicida","Inseticida","Inseticida","Inseticida","Inseticida","Inseticida","Inseticida","Inseticida","Herbicida","Fungicida","Inseticida","Inseticida","Inseticida","Herbicida","Herbicida","Herbicida","Fungicida","Herbicida","Inseticida","Fungicida","Inseticida","Herbicida","Fungicida","Inseticida","Inseticida","Fungicida","Inseticida","Inseticida","Herbicida","Inseticida","Fungicida","Herbicida","Herbicida","Fungicida","Inseticida","Herbicida","Herbicida","Fungicida","Inseticida","Fungicida","Inseticida","Herbicida","Herbicida","Herbicida","Herbicida","Fungicida","Fungicida","Inseticida","Fungicida","Herbicida","Fungicida","Fungicida","Fungicida","Fungicida","Fungicida","Fungicida","Herbicida","Herbicida","Inseticida","Fungicida","Fungicida","Inseticida","Inseticida","Inseticida","Fungicida","Fungicida","Fungicida","Fungicida","Inseticida","Fungicida","Herbicida","Herbicida","Inseticida","Fungicida","Inseticida","Inseticida","Inseticida","Herbicida","Inseticida","Herbicida","Herbicida","Herbicida","Herbicida","Fungicida","Herbicida","Herbicida","Herbicida","Herbicida","Herbicida","Inseticida","Herbicida","Herbicida","Herbicida","Herbicida","Fungicida","Inseticida","Inseticida","Herbicida","Herbicida","Herbicida","Inseticida","Herbicida","Herbicida","Inseticida","Fungicida","Fungicida","Herbicida","Fungicida","Fungicida","Fungicida","Herbicida","Herbicida","Herbicida","Herbicida","Herbicida","Fungicida","Inseticida","Inseticida","Fungicida","Fungicida","Inseticida","Herbicida","Inseticida","Fungicida","Inseticida","Inseticida","Herbicida","Herbicida","Fungicida","Fungicida","Fungicida","Fungicida","Herbicida","Fungicida","Inseticida","Inseticida","Herbicida","Fungicida","Inseticida","Herbicida","Fungicida","Herbicida","Herbicida","Fungicida","Herbicida","Inseticida","Herbicida","Fungicida","Herbicida","Herbicida","Inseticida","Inseticida","Inseticida","Herbicida","Herbicida","Herbicida","Inseticida","Inseticida","Fungicida","Herbicida","Inseticida","Fungicida","Fungicida","Fungicida","Fungicida","Fungicida","Inseticida","Inseticida","Fungicida","Fungicida","Inseticida","Herbicida","Fungicida","Inseticida","Fungicida","Fungicida","Herbicida","Inseticida","Inseticida","Fungicida","Herbicida","Fungicida","Inseticida","Fungicida","Herbicida","Inseticida","Inseticida","Herbicida","Herbicida","Herbicida","Fungicida","Inseticida","Fungicida","Inseticida","Fungicida","Fungicida","Herbicida","Herbicida","Fungicida","Inseticida","Herbicida","Inseticida","Inseticida","Inseticida","Inseticida","Herbicida","Inseticida","Inseticida","Inseticida","Herbicida","Herbicida","Fungicida","Fungicida","Fungicida","Inseticida","Fungicida","Herbicida","Inseticida","Herbicida","Fungicida","Fungicida","Herbicida","Herbicida","Herbicida","Herbicida","Herbicida","Herbicida","Fungicida","Herbicida","Herbicida","Inseticida","Fungicida","Herbicida","Fungicida","Fungicida","Herbicida","Inseticida","Fungicida","Inseticida","Inseticida","Inseticida","Fungicida","Inseticida","Inseticida","Herbicida","Herbicida","Herbicida","Herbicida","Inseticida","Fungicida","Inseticida","Herbicida","Herbicida","Inseticida","Herbicida","Inseticida","Fungicida","Herbicida","Herbicida","Herbicida","Herbicida","Herbicida","Herbicida","Fungicida","Fungicida","Fungicida","Inseticida","Fungicida","Inseticida","Inseticida","Herbicida","Fungicida","Herbicida","Herbicida","Inseticida","Fungicida","Fungicida","Fungicida","Fungicida","Herbicida","Herbicida","Herbicida","Herbicida","Herbicida","Herbicida","Herbicida","Herbicida","Fungicida","Inseticida","Herbicida","Herbicida","Herbicida","Herbicida","Inseticida","Inseticida","Herbicida","Herbicida","Fungicida","Fungicida","Fungicida","Inseticida","Herbicida","Herbicida","Fungicida","Herbicida","Fungicida","Inseticida","Inseticida","Inseticida","Herbicida","Inseticida","Herbicida","Herbicida","Fungicida","Herbicida","Herbicida","Herbicida","Inseticida","Herbicida","Herbicida","Herbicida","Herbicida","Inseticida","Herbicida","Inseticida","Fungicida","Inseticida","Herbicida","Herbicida","Inseticida","Inseticida","Fungicida","Herbicida","Herbicida","Fungicida","Herbicida","Inseticida","Herbicida","Inseticida","Herbicida","Inseticida","Herbicida","Fungicida","Fungicida","Fungicida","Herbicida","Inseticida","Herbicida","Inseticida","Inseticida","Inseticida","Inseticida","Fungicida","Fungicida","Inseticida","Herbicida","Fungicida","Inseticida","Herbicida","Fungicida","Inseticida","Inseticida","Inseticida","Herbicida","Fungicida","Fungicida","Fungicida","Inseticida","Herbicida","Fungicida","Inseticida","Herbicida","Herbicida","Herbicida","Inseticida","Herbicida","Herbicida","Fungicida","Fungicida","Herbicida","Inseticida","Fungicida","Inseticida","Inseticida","Herbicida","Inseticida","Fungicida","Inseticida","Fungicida","Fungicida","Herbicida","Herbicida","Inseticida","Herbicida","Fungicida","Herbicida","Fungicida","Fungicida","Fungicida","Inseticida","Fungicida","Fungicida","Herbicida","Fungicida","Fungicida","Fungicida","Herbicida","Fungicida","Inseticida","Herbicida","Inseticida","Herbicida","Fungicida","Herbicida","Herbicida","Fungicida","Inseticida","Herbicida","Herbicida","Fungicida","Fungicida","Fungicida","Herbicida","Inseticida","Inseticida","Fungicida","Inseticida","Inseticida","Fungicida","Fungicida","Herbicida","Herbicida","Inseticida","Fungicida","Herbicida","Fungicida","Fungicida","Herbicida","Herbicida","Fungicida","Fungicida","Herbicida","Fungicida","Fungicida","Fungicida",{"$nulls":385},{"$f":"COUNTA(AIP3:ANW3)","v":0}]
["Grupo Químico",null,"Ácido Ariloxialcanóico","Triazol","Avermectina","Sulfonylurea herbicide; Pyrimidinylsulfonylurea herbicide","Sulfoniluréia","Organofosforado","Organofosforado","Organofosforado","Neonicotinóide","Cloracetanilida","Benzotiadiazol","éter difenílico","piretróide","Estrobilurina","Neonicotinoide","Triazolona","Uréia","   Triazolona","ácido tetramico ","Estrobilurina","Dicarboximida","ácido ariloxialcanóico","Cloracetanilida","Cloracetanilida","pirazol carboxamida","Piretroide ","fosfonato","Alquilazina","Sulfoniluréia","Antranilamida","Triazol","Semicarbazona","Piretróide","Pirimidilamina","Triazina","Triazina","triazolinona","Ácido Ariloxialcanóico","ácido piridiniloxialcanóico","Estrobilurina","arilformamidina","Avermectina","Imidazolinonas","Dimetilditiocarbamato","alquilenobis","Benzoiluréia","tiadiazinona","Triazol","estrobilurina","oxima ciclohexanodiona","ácido piridiniloxialcanóico","ácido piridiniloxialcanóico","Triazol","  sulfanililcarbamato","  sulfanililcarbamato","benzoiluréia","Triazol","Triazina","Triazina","Triazina","Triazina","Dicarboximida","oxima ciclohexanodiona","   Triazolona","Uréia","Organofosforado","Oxadiazina","Tetranortriterpenóide","Tetranortriterpenóide","sulfoniluréia","Estrobilurina","Estrobilurina","Benzotiadiazinona","Isotiocianato de metila ","Triazol","metilcarbamato de oxima","Diamida do ácido fitálico","triazol","acilalaninato","Benzimidazóis","Antranilamida","Metilcarbamato de benzofuranila ","Metilcarbamato de benzofuranila ","Benzotiadiazinona","Valinamida carbamato","avermectina","pirazol carboxamida","Piretróide","Composto inorgânico","Piretróide","Piretróide","benzotiazol","Benzotiadiazol","ácido pirimidiniloxibenzóico","Piretróide","benzoiluréia","Éter piridiloxipropílico","éter difenílico","Piretróide","Triazolona","Anilida","Anilida","metilcarbamato de oxima","Uracila","alifático halogenado","triazol","Piretróide","isotiocianato de metila ","tiadiazinona","Uréia","organofosforado","Tricetona","neonicotinóide","ácido piridinocarboxílico","Anilida","Dicarboximida","Dicarboximida","Carbamato","Piretróide","Metilcarbamato de naftila","Benzimidazóis","Benzimidazóis","nicotinóide","Benzimidazóis","metilcarbamato de benzofuranila","carboxanilida","   Triazolona","tiocarbamato","tiocarbamato","Benzoiluréia","antibioótico","Organofosforado","Organofosforado","Triazol","Fenamidona","Oxima ciclohexanodiona","Benzimidazóis","Carbonitrilas","Benzoiluréia","Dicarboximida","Pirazol","piridina azometina","Antranilamida","imidazol","antranilamida","sulfoniluréia","organofosforado","Benzoilacetonitrila","acetamida","Piretróide","Triazol","anilinopirimidina","Triazinamina","     Sulfoniluréia","Oxima ciclohexanodiona","ácido ariloxifenoxipropiônico","isoxazolidinona","sulfonanilida triazolopirimidina","Antranilamida","análogo de pirazol","benzoiluréia","Carbamate fungicide","     Sulfoniluréia","     Sulfoniluréia","     Sulfoniluréia","Carbonitrilas","Organofosforado","Neocotinoide","Estrobilurina","Piretróide","Fenilpiridinilamina","triazol","Neonicotinóide","Composto inorgânico","Imidazolinonas","Éter piridiloxipropílico","organofosforado","Triazina","Triazol","Neonicotinóide","Neonicotinoide","Carbonitrilas","Benzoiluréia","Organofosforado","Carbonitrilas","Carbonitrilas","Carbonitrilas","Piretróide","Isotiocianato de metila ","Piretróide","quinona","Piretróide","Antranilamida","Benzimidazóis","Benzimidazóis","feniltiouréia","Quarternary ammonium herbicide","Ácido Benzóico","Bipiridílio","Sulfonanilida triazolopirimidina","Triazol","Benzoiluréia","Benzoiluréia","organofosforado","morfolina","organofosforado","Benzoiluréia","triazolinona","Neonicotinóide","Amônia Quaternária","Uréia","Alquilenobis (ditiocarbamato)","quinona","Uréia","Ácido Ariloxialcanóico","Benzotiadiazinona","guanidina","guanidina","Éter difenílico","Cloroacetanilida","Triazol","Estrobilurina","Piretróide","Triazol","Neonicotinoide","cetoenol","sulfoniluréia","Composto inorgânico","Triazol","acetamida","oxazolidinadiona ","Sulfoniluréia","anilinopirimidina","Piretróide","espinosinas","espinosinas","cetoenol","cetoenol","Piretróide","difenil oxazoline","sulfoniluréia","éter tiadiazólico","Organofosforado","espinosinas","sulfoxaminas","Triazina","Triazina","ácido quinolinocarboxílico","oxazolidinadiona ","Homoalanina substituída","Piretroide ","Fenamidona","Organophosphate","Aryloxyphenoxypropionat herbicide","Pirazol","pirazol","Piretróide","Morfolina","Piretróide","Piretróide","Homoalanina substituída","Fenilpirazol","Triazol","Sulfoniluréia","Éter difenílico","Estrobilurina","nicotinóide","Arilpicolinato","Ácido ariloxifenoxipropiônico","Fenilpiridinilamina","Diamida do ácido fitálico","fenilpirrol","Benzoiluréia","Sulfonanilida triazolopirimidina","Ciclohexenodicarboximida","Flumioxazin herbicide","Flumioxazin herbicide","Ciclohexenodicarboximida","Benzamida","Butenolida","Triazol","ácido piridiniloxialcanóico","carboxamida","Triazol","Carboxamida","Triazol","Dicarboximida","Dicarboximida","Éter difenílico","Sulfoniluréia","Antranilamida","morfolina","fosfonato","Composto inorgânico","organofosforado","organofosforado","Triazolintiona","Fenilpiridinilamina","Benzimidazóis","Carbonitrilas","Piretróide","Triazol","Éter difenílico","Ácido ariloxifenoxipropiônico","Carbamato","acilalaninato","Éter difenílico","Piretróide","Benzoiluréia","Arilpicolinato","Composto inorgânico","triazina","Triazina","Triazina","sulfoniluréia","Carbonitrilas","Glicina Substituída","Homoalanina substituída","Glicina Substituída","Éter difenílico","Bipiridílio","Organofosforado","sulfoniluréia","ácido piridinocarboxílico","sulfoniluréia","ácido ariloxifenoxipropiônico","imidazol","benzoiluréia","antranilamida","pirimidinadiona","Dinitroanilina","Triazina","Piretróide","Triazinona","Triazinona","iazolidinacarboxamida","Composto inorgânico","Organoestânico","Hussar","Carbonitrilas","Imidazol","Imidazol","Imidazolinonas","Imidazolinonas","Imidazolinonas","Imidazolinonas","imidazolinona","Triazol","Neonicotinóide","organofosforado","Triazol","carboxamida","Benzoiluréia","Alquilazina","Oxadiazina","Carbamate fungicide","Piretróide","Diacilhidrazina","sulfoniluréia","Hussar","Triazol","Dicarboximida","Carbonitrilas","phenyloxoethyl thiophene amida,","Isoxazol herbicide","Triazol","Piretróide","Piretróide","Cloracetanilida","Composto inorgânico","Piretróide","Uréia","antibioótico","Sulfoniluréia","sulfoniluréia","phenyloxoethyl thiophene amida,","Triazolona","Organofosforado","Uracila","Composto inorgânico","Cloracetanilida","Éter difenílico","Piretróide","metilcarbamato de oxima","Carbamato","Uréia","Homoalanina substituída","Uréia","Organofosforado","Benzoiluréia","Imidazol","Triazinona","Organofosforado","Triazol","Alquilenobis (ditiocarbamato)","Alquilenobis (ditiocarbamato)","éter mandelamida","Alquilenobis (ditiocarbamato)","metilcarbamato de benzofuranila","Benzoiluréia","Acilalaninato","fenilpirrol","Neonicotinóide","ácido ariloxialcanóico","triazol","Piretróide","Dicarboximida","Organoestânico","Tricetona","Semicarbazona","Semicarbazona","Acilalaninato","isotiocianato de metila ","triazol","organofosforado","alquilenobis","Cloroacetanilida","metilcarbamato de oxima","Diacilhidrazina","Triazinona","Alquilazina","Sulfoniluréia","Triazol","diacilhidrazina","carboxamida","sulfonamida fluoroalifática","feniluréia","carboxamida","organoarsênico","Éter difenílico","Triazol","espinosinas","Sulfonylurea herbicide; Pyrimidinylsulfonylurea herbicide","Benzoiluréia","Organofosforado","Éter difenílico","Organofosforado","Sulfoniluréia","cetoenol","Benzoilacetonitrila","sulfito de alquila","Imidazolinonas","Imidazolinonas","Triazol","triazol","Carboxamida","Organofosforado","Dicarboximida","sulfoniluréia","pirazol","oxadiazolona","Piperidinil Tiazol Izoxazolina","Composto inorgânico","Éter difenílico","sulfonanilida triazolopirimidina","ácido ariloxifenoxipropiônico","     Sulfoniluréia","Bipiridílio","Homoalanina substituída","feniluréia","Dinitroanilina","sulfonanilida triazolopirimidina","Piretróide","Triazol","ácido piridinocarboxílico","estrobilurina","carboxamida","Ácido ariloxifenoxipropiônico","piridina azometina","Estrobilurina","análogo de pirazol","Piretróide","piridazinona","anilinopirimidina","Organofosforado","Éter piridiloxipropílico","análogo de ácido pirimidiniloxibenzóico","Pirazol","oxima ciclohexanodiona","Aryloxyphenoxypropionat herbicide","feniltiouréia","alquilenobis","Neocotinoide","Triazolona","Oxima ciclohexanodiona","Metilcarbamato de benzofuranila ","Dinitroanilina","Antranilamida","triazol","Sulfonanilida triazolopirimidina","Triazina","Triazina","Triazina","Triazina","Triazina","Estrobilurina","Estrobilurina","Triazol","Éter piridiloxipropílico","Dicarboximida","avermectina","Organofosforado","oxima ciclohexanodiona","Pirazol","triazina","Anilida","sulfito de alquila","Triazol","alquilenobis","Triazol","Triazolintiona","Isoxazol herbicide","Alquilazina","ácido quinolinocarboxílico","Ácido ariloxifenoxipropiônico","ácido ariloxifenoxipropiônico","Ciclohexenodicarboximida","   Triazolona","Ácido Benzóico","Triazol","Organofosforado","Aryloxyphenoxypropionat herbicide","Imidazolinonas","sulfonanilida triazolopirimidina","isoxazolidinona","Organofosforado","Fenilpirazol","Amônia Quaternária","Ciclohexenodicarboximida","éter mandelamida","Dimetilditiocarbamato","Alquilenobis (ditiocarbamato)","Éter difenílico","ácido pirimidiniloxibenzóico","oxadiazolona","Dicarboximida","Glicina Substituída","Dicarboximida","piretróide","organofosforado","Piretróide","pirimidinadiona","piridazinona","Sulfonylurea herbicide; Pyrimidinylsulfonylurea herbicide","   Triazolona","Triazol","Sulfonanilida triazolopirimidina","Oxima ciclohexanodiona","Aryloxyphenoxypropionat herbicide","Carbamato","sulfoniluréia","Triazinona","Cloroacetanilida","oxima ciclohexanodiona","Metilcarbamato de naftila","Triazina","Butenolida","Triazol","difenil oxazoline","Benzoilciclohexanodiona","Triazolona","Neonicotinóide","Piretróide","Triazol","Sulfonanilida triazolopirimidina","Uréia","Anilida","   Triazolona","Piretróide","Anilida","Fenilpirazol","análogo de ácido pirimidiniloxibenzóico","Piretróide","Sulfonylurea herbicide; Pyrimidinylsulfonylurea herbicide","Triazol","carboxamida","Composto inorgânico","Triazolona","sulfonamida fluoroalifática","Sulfoniluréia","sulfoxaminas","Piretróide","Organophosphate","Organophosphate","Dicarboximida","Dicarboximida","Organophosphate","Flumioxazin herbicide","Benzimidazóis","organofosforado","Cloracetanilida","Triazol","iazolidinacarboxamida","Piretróide","Piretróide","Ácido ariloxifenoxipropiônico","Triazol","Triazol","Triazol","diacilhidrazina","Uréia","Benzimidazóis","Benzoiluréia","Benzoilciclohexanodiona","Triazinona","oxima ciclohexanodiona","organofosforado","Triazina","Triazina","éter tiadiazólico","Triazol","ácido piridinocarboxílico","Benzoiluréia","benzimidazol","neonicotinóide","Neonicotinoide","Triazolona","Éter piridiloxipropílico","Triazol","Carbamato","Benzimidazóis","Dimetilditiocarbamato","Bipiridílio","Triazinona","Pirazol","ácido ariloxifenoxipropiônico","Benzimidazóis","ácido piridiniloxialcanóico","Triazol","Valinamida carbamato","Carbonitrilas","Piretróide","Triazol","benzotiazol","ácido piridiniloxialcanóico","Estrobilurina","imidazol","Estrobilurina","sulfoniluréia","imidazol","Benzoiluréia","Dinitroanilina","Triazinamina","Ácido dioxociclohexanocarboxílico","triazol","Ácido dioxociclohexanocarboxílico","Glicina Substituída","anilinopirimidina","Piretróide","     Sulfoniluréia","Triazinona","Estrobilurina","Benzamida","Triazol","ácido ariloxifenoxipropiônico","Antranilamida","Semicarbazona","Morfolina","Avermectina","Organofosforado","Dimetilditiocarbamato","carboxanilida","organoarsênico","Benzotiadiazinona","Benzoiluréia","Ciclohexenodicarboximida","Pirazol","Estrobilurina","Pirimidilamina","imidazolinona","Sulfoniluréia","Carbonitrilas","Carbonitrilas","Flumioxazin herbicide","Triazol","Piperidinil Tiazol Izoxazolina","benzamida"]
["Produto (nome comercial)",null,"2,4 D ","Abacus","Abamectina","Accent","Accurate","Ace ","Acefato ","Acero","Acetamiprido ","Acetocloro","Acibenzolar-S-metílico","Acifluorfem-sódico ","Acrinatrina","Acronis","Actara","Adengo","Afalon","Affinity","Afidopiropeno ","Agria","Agricur  ","Agritone","Alaclor","Alacloro","Alade","Alfa-Cipermetrina ","Aliette","Alion","Ally","Altaco","Alto 100","Alverde","Ametista","Ametoctradina","Ametrex ","Ametrina","Amicarbazona","Aminol 806","Aminopiralide","Amistar","Amitraz","Ampligo","Amplo","Anchor","Antracol","Antrimo","Applaud","Aproach","Aproach Power","Aramo","Arbust","Arreio","Artea","Asulam ","Asulox","Atabron","Atento","Atranex","Atrasimex","Atrasimex","Atrazina","Attic","Aura","Aurora","Aval","Avant ","Avatar","Azadiractina ","Azamax","Azimsulfurom ","Azimut","Azoxistrobina ","Basagran","Basamid","Baytan","Bazuka","Belt","Belyan","Benalaxil ","Bendazol","Benevia","Benforce","Benfuracarb","Bentazona","Bentiavalicarbe isopropílico ","Benzoato de emamectina","Benzovindiflupir","Beta-ciflutrina ","Bicarbonato de potássio","Bifentrina","Biflex","Bim","Bion","Bispirabaque","Bistar","Bistrifluron","Blade","Blazer","Bold","Boral","Boscalid","Boscalida","Brilhamte","Bromacila","Brometo de metila","Bromuconazol","Bulldock ","Bunema","Buprofezina","Butiron","Cadusafós ","Calisto","Calypso","Campestre","Cantus","Captan","Captana","Captor","Capture","Carbaril ","Carben ","Carbendazim","Carbine","Carbomax ","Carbossulfano ","Carboxina ","Carfentrazona-etílica","Cartape","Cartarys","Cascade","Casugamicina","Catcher ","Cefanol","Celeiro","Censor","Centurion","Cercobin","Cerconil","Certero","Certus","Chaser","Chess","Ciantraniliprole","Ciazofamida ","Ciclaniliprole","Ciclossulfamurom","Cierto","Ciflumetofen ","Cimoxanil","Cipermetrina","Ciproconazol","Ciprodinil","Ciromazina  ","Classic","Cletodim","Clodinafope-Propargil ","Clomazona","Cloransulam-metílico","Clorantraniliprole","Clorfenapir","Clorfuazurom","Cloridrato de propamocarbe","Clorim","Clorimurom-etílico","Clorimuron","Clorotalonil","Clorpirifós","Clotianidina","Comet","Commanche","Completo","Condor","Connect","Contact","Contain","Cordial","Counter","Coyote","Cronnos","Cropstar;","Cruiser;","Cuprodil ","Curyom","Curyom ","Dacobre ","Daconil","Dacostar","Danimen","Dazomete ","Decis","Delan","Deltametrina","Demarcor","Derosal","Derox","Diafenturiom","Dibrometo de Diquate","Dicamba","Dicloreto de Paraquate","Diclosulam ","Difenoconazol","Diflubenzurom ","Diflumax","Dimetoato ","Dimetomorfe","Dimexion","Dimilim","Dinamic","Dinofeturam","Diquate","Direx","Dithane","Ditianona","Diurom ","DMA ","Doble","Dodex","Dodina ","Drible","Dual Gold","Egan","Elatus","Eleitto","Eminent ","Engeo","Envidor","Envoke","Enxofre","Epoxiconazol ","Equation","Equation","Equip Plus","Erune","Esfenvalerato","Espinetoram ","Espinosade ","Espirodiclofeno","Espiromesifeno","Etofenproxi","Etoxazol","Etoxissulfurom","Etridiazol","Evolution","Exalt","Expedition","Extrazin ","Facero ","Facet","Famoxadona","Fascinate","Fastac","Fenamidona","Fenitrotiona","Fenoxaprop-P-ethyl ","Fenpirazamina","Fenpiroximato ","Fenpropatrina","Fenpropimorfe","Fentrol","Fersol","Finale","Fipronil ","Flair","Flazassulfurom","Flex","Flint ","Flonicamida","Florpirauxifen-benzil","Fluazifope-p-butil ","Fluazinam","Flubendiamida","Fludioxonil","Flufenoxurom","Flumetsulam","Flumicloraque-pentílico ","Flumioxazina","Flumyzin","Fluopicolide","Fluopiram","Flupiradifurona ","Fluquinconazol","Fluroxipir","Flutolanil","Flutriafol","Fluxapiroxade  ","Folicur;","Folpan","Folpete","Fomesafem","Foransulfurom","Fortenza","Forum","Fosetil","Fosfeto de alúminio","Fosmete","Fostiazato","Fox","Frowncide","Fungicarb ","Funginil","Fury","Fusão","Fusiflex","Fusilade","Futur","Galben","Gallaxy","Gama-Cialotrina ","Game","Gapper","Gastoxin","Gesagard","Gesapax ","Gesaprim","Gladium","Glider ","Glifosato","Glufosinato de amônio","Glyphotal","Goal","Gramoxone","Graolin","Gulliver","Halauxifen-metíl","Halossulfurom-metílico ","Haloxifope-P-metílico","Hanami","Hanaro","Hayate","Heat","Herbadox","Herbipak ","Hero","Hexanil","Hexazinona","Hexitiazox","Hidróxido de cobre","Hidróxido de Fentina","Hussar","Ichiban","Imazacure","Imazalil ","Imazamoxi ","Imazapique  ","Imazapir","Imazaquim","Imazetapir","Imibenconazol ","Imidacloprido ","Imidam","Impact","Impirfluxam","Imunit","Indaziflam","Indoxacarb","Infinito","Insemat","Intrepid","Invest","Iodossulfurom-metílico-sódico","Ipconazol","Iprodiona","Isatalonil","Isofetamida","Isoxaflutol ","Juno","K-Obiol","K-Othrine ","Kadett","Kaligreen","Karate zeon","Karmex","Kasumin","Katana","Kelion","Kenja","Kicker","Klorpan ","Krovar","Kumulus","Laço ","Lactofem","Lambda-Cialotrina ","Lannate","Larvim","Lava","Liberty","Linurom ","Lorsban","Lufenuron","Magnate","Magnus","Malation","Manage","Mancozeb","Mancozebe","Mandipropamida","Manzate","Marshal","Match","Maxim","Maxim XL","Maxsan","MCPA ","Mefentrifluconazol","Meothrin ","Merpan","Mertin ","Mesotriona","Metaflimizona","Metaflumizone","Metalaxil-M ","Metam-sódico ","Metconazol ","Metidationa ","Metiram","Metolacloro","Metomil","Metoxifenozida ","Metribuzim ","Metribuzin","Metsulfurom-metílico ","Miclobutanil ","Mimic","Miravis","Mirex S","Moceren","Moncut","MSMA ","Naja","Nativo","Natular","Nicossulfurom ","Nomolt","Nordick","Novalurom ","Nufos ","Nufuron;","Oberon","Okay","Omite","Oneshot ","Only","Ópera","Ópera Ultra","Orkestra","Orthene","Orthocide ","Orthosulfamuron","Ortus","Oxadiazona ","Oxatiapiprolina","Oxicloreto de cobre","Oxyfluorfem ","Pacto","Panther","Panzer ","Paraquat","Patrol","Pencicurom ","Pendimetalina","Penoxsulam","Permetrina","Photon ","Picloram","Picoxistrobina","Pidiflumetofen","Pilot ","Pimetrozina","Piraclostrobina","Pirate","Pirephos","Piridabem ","Pirimetanil","Pirimifós-metílico","Piriproxifem ","Piritiobaque-sódico","Piroxassulfona","Poast","Podium","Polo","Polyram","Poncho","Ponteiro","Poquer","Pottente","Premelin","Premio","Premis","Prevaiil","Primagram Gold","Primaiz Gold","Primatop ","Primestra Gold","Primóleo","Priori","Priori Xtra","Prisma","Privilege","Procimidona","Proclaim","Profenofós","Profoxidim ","Prolectus","Prometrina ","Propanil","Propargito ","Propiconazol ","Propinebe ","Prospect","Protioconazol ","Provence","Provence Total","Quincloraque ","Quizalofop-P-ethyl ","Quizalofope-P-tefurílico","Radiant","Rage","Rainvel ","Rancona","Rapel","Rapsode","Raptor","Raster","Reator","Record","Regente","Reglone","Resource","Revus","Rhodiauram","Ridomil","Rimon","Riper","Ronstar","Rotaxil","Roundup","Rovral ","Rufast","Rugby","Safety","Saflufenacil","Sanmite","Sanson","Savana","Score","Scorpion","Select ","Selefen ","Semevim","Sempra","Sencor;","Sequence","Setoxidim ","Sevin","Simazina","Sivanto","Skip","Smile","Soberan","Solara","Sombrero","Sperto","Sphere max","Spider","Spike","Spot","Spotlight","Stalion","Stam","Standak","Staple","Starion","Stoy","Stratego","Sugoy","Sulfato de cobre","Sulfentrazona  ","Sulfluramida ","Sulfometuron metílico","Sulfoxaflor","Sumidan","Sumifog","Sumigran","Sumiguard","Sumilex ","Sumithion","Sumyzin","Support","Suprathion","Surpass","Systhane","Talento","Talisman","Talstar","Targa ","Tasker","Tebuco","Tebuconazol ","Tebufenozida","Tebutiurom","Tebuzim ","Teflubenzurom ","Tembotriona","Tenace","Tepraloxidim ","Terbufós ","Terbumax","Terbutilazina","Terrazole","Tetraconazol","Texaro","Thorn","Tiabendazol","Tiacloprido","Tiametoxam","Tiencarbazona","Tiger","Tilt","Tiodicarbe","Tiofanato-metílico","Tiram ","Tocha","Token","Tolfenpirade","Topic","Topsin","Tordon Ultra","Tornado","Totalit","Totalit","Trebon","Triadimenol  ","Triciclazol","Tricopir-butolítico","Tridium","Trifimine","Trifloxistrobina","Trifloxisulfuron","Triflumizol","Triflumurom","Trifluralina","Trigard ","Trinexapaque-etílico","Triticonazol ","Trix","Trop","Truzon","Turbo","Twister","Unimark","Unizeb ","Verango Prime","Verdadeiro","Verdict-max","Verimark ","Verismo","Versatilis","Vertimec","Vexter","Vitavax ","Vitavax Thiram","Volcane","Volt","Wasp","Xavante","Yamato","Yoda","Zampo","Zaphir","Zartan","Zetanil","Zetaram ","Zethamaxx","Zoom","Zorvec","Zoxamida"]
["14.5 - Ingrediente Ativo do produto",null," 2,4 D","Epoxiconazol ","Abamectina","Nicossulfurom ","Metsulfurom-metílico ","Acefato","Acefato","Acefato","Acetamiprido ","Acetocloro","Acibenzolar-S-metílico","Acifluorfem-sódico ","Acrinatrina","Piraclostrobina","Tiametoxam","Tiencarbazona","Linurom ","Carfentrazona-etílica","Afidopiropeno ","Azoxistrobina ","Folpete","MCPA ","Alacloro","Alacloro","Benzovindiflupir","Alfa-Cipermetrina ","Fosetil","Indaziflam","Sulfometuron metílico","Clorantraniliprole","Ciproconazol","Metaflimizona","Cipermetrina","Ametoctradina","Ametrina","Ametrina","Amicarbazona"," 2,4 D","Aminopiralide","Azoxistrobina ","Amitraz","Abamectina","Imazamoxi ","Tiram ","Propinebe ","Teflubenzurom ","Buprofezina","Ciproconazol","Picoxistrobina","Tepraloxidim ","Tricopir-butolítico","Fluroxipir","Ciproconazol","Asulam ","Asulam ","Clorfuazurom","Fluquinconazol","Atrazina","Atrazina","Simazina","Atrazina","Iprodiona","Profoxidim ","Carfentrazona-etílica","Tebutiurom","Acefato","Indoxacarb","Azadiractina ","Azadiractina ","Azimsulfurom ","Azoxistrobina ","Azoxistrobina ","Bentazona","Dazomete ","Triadimenol  ","Metomil","Flubendiamida","Mefentrifluconazol","Benalaxil ","Carbendazim","Ciantraniliprole","Benfuracarbe","Benfuracarbe","Bentazona","Bentiavalicarbe isopropílico ","Benzoato de emamectina","Benzovindiflupir","Beta-ciflutrina ","Bicarbonato de potássio","Bifentrina","Bifentrina","Triciclazol","Acibenzolar-S-metílico","Bispirabaque","Bifentrina","Bistrifluron","Piriproxifem ","Acifluorfem-sódico ","Fenpropatrina","Sulfentrazona  ","Boscalida","Boscalida","Metomil","Bromacila","Brometo de metila","Bromuconazol","Beta-ciflutrina ","Metam-sódico ","Buprofezina","Tebutiurom","Cadusafós ","Mesotriona","Tiacloprido","Picloram","Boscalida","Captana","Captana","Tiodicarbe","Bifentrina","Carbaril ","Carbendazim","Carbendazim","Flonicamida","Carbendazim","Carbossulfano ","Carboxina ","Carfentrazona-etílica","Cartape","Cartape","Flufenoxurom","Casugamicina","Clorpirifós","Acefato","Flutriafol","Fenamidona","Cletodim","Tiofanato-metílico","Clorotalonil","Triflumurom","Iprodiona","Tolfenpirade","Pimetrozina","Ciantraniliprole","Ciazofamida ","Ciclaniliprole","Ciclossulfamurom","Fostiazato","Ciflumetofen ","Cimoxanil","Cipermetrina","Ciproconazol","Ciprodinil","Ciromazina  ","Clorimurom-etílico","Cletodim","Clodinafope-Propargil ","Clomazona","Cloransulam-metílico","Clorantraniliprole","Clorfenapir","Clorfuazurom","Cloridrato de propamocarbe","Clorimurom-etílico","Clorimurom-etílico","Clorimurom-etílico","Clorotalonil","Clorpirifós","Clotianidina","Piraclostrobina","Cipermetrina","Fluazinam","Bromuconazol","Imidacloprido ","Hidróxido de cobre","Imazapir","Piriproxifem ","Terbufós ","Atrazina","Tebuconazol ","Imidacloprido ","Tiametoxam","Clorotalonil","Lufenuron","Profenofós","Clorotalonil","Clorotalonil","Clorotalonil","Fenpropatrina","Dazomete ","Deltametrina","Ditianona","Deltametrina","Clorantraniliprole","Carbendazim","Carbendazim","Diafenturiom","Dibrometo de Diquate","Dicamba","Dicloreto de Paraquate","Diclosulam ","Difenoconazol","Diflubenzurom ","Diflubenzurom ","Dimetoato ","Dimetomorfe","Dimetoato ","Diflubenzurom ","Amicarbazona","Dinofeturam","Diquate","Diurom ","Mancozebe","Ditianona","Diurom "," 2,4 D","Bentazona","Dodina ","Dodina ","Lactofem","Metolacloro","Tebuconazol ","Azoxistrobina ","Etofenproxi","Tetraconazol","Tiametoxam","Espirodiclofeno","Trifloxisulfuron","Enxofre","Epoxiconazol ","Cimoxanil","Famoxadona","Foransulfurom","Pirimetanil","Esfenvalerato","Espinetoram ","Espinosade ","Espirodiclofeno","Espiromesifeno","Etofenproxi","Etoxazol","Etoxissulfurom","Etridiazol","Acefato","Espinetoram ","Sulfoxaflor","Atrazina","Atrazina","Quincloraque ","Famoxadona","Glufosinato de amônio","Alfa-Cipermetrina ","Fenamidona","Fenitrotiona","Fenoxaprop-P-ethyl ","Fenpirazamina","Fenpiroximato ","Fenpropatrina","Fenpropimorfe","Gama-Cialotrina ","Permetrina","Glufosinato de amônio","Fipronil ","Difenoconazol","Flazassulfurom","Fomesafem","Trifloxistrobina","Flonicamida","Florpirauxifen-benzil","Fluazifope-p-butil ","Fluazinam","Flubendiamida","Fludioxonil","Flufenoxurom","Flumetsulam","Flumicloraque-pentílico ","Flumioxazina","Flumioxazina","Fluopicolide","Fluopiram","Flupiradifurona ","Fluquinconazol","Fluroxipir","Flutolanil","Flutriafol","Fluxapiroxade  ","Tebuconazol ","Folpete","Folpete","Fomesafem","Foransulfurom","Ciantraniliprole","Dimetomorfe","Fosetil","Fosfeto de alúminio","Fosmete","Fostiazato","Protioconazol ","Fluazinam","Carbendazim","Clorotalonil","Cipermetrina","Tebuconazol ","Fomesafem","Fluazifope-p-butil ","Tiodicarbe","Benalaxil ","Novalurom ","Gama-Cialotrina ","Lufenuron","Florpirauxifen-benzil","Fosfeto de alúminio","Prometrina ","Ametrina","Atrazina","Etoxissulfurom","Clorotalonil","Glifosato","Glufosinato de amônio","Glifosato","Oxyfluorfem ","Dicloreto de Paraquate","Pirimifós-metílico","Azimsulfurom ","Halauxifen-metíl","Halossulfurom-metílico ","Haloxifope-P-metílico","Ciazofamida ","Bistrifluron","Ciclaniliprole","Saflufenacil","Pendimetalina","Ametrina","Cipermetrina","Hexazinona","Hexazinona","Hexitiazox","Hidróxido de cobre","Hidróxido de Fentina","Iodossulfurom-metílico-sódico","Clorotalonil","Imazalil ","Imazalil ","Imazamoxi ","Imazapique  ","Imazapir","Imazaquim","Imazetapir","Imibenconazol ","Imidacloprido ","Fosmete","Flutriafol","Impirfluxam","Teflubenzurom ","Indaziflam","Indoxacarb","Cloridrato de propamocarbe","Bifentrina","Metoxifenozida ","Ciclossulfamurom","Iodossulfurom-metílico-sódico","Ipconazol","Iprodiona","Clorotalonil","Isofetamida","Isoxaflutol ","Propiconazol ","Deltametrina","Deltametrina","Acetocloro","Bicarbonato de potássio","Lambda-Cialotrina ","Diurom ","Casugamicina","Flazassulfurom","Orthosulfamuron","Isofetamida","Sulfentrazona  ","Clorpirifós","Bromacila","Enxofre","Alacloro","Lactofem","Lambda-Cialotrina ","Metomil","Tiodicarbe","Tebutiurom","Glufosinato de amônio","Linurom ","Clorpirifós","Lufenuron","Imazalil ","Hexazinona","Malation","Imibenconazol ","Mancozebe","Mancozebe","Mandipropamida","Mancozebe","Carbossulfano ","Lufenuron","Metalaxil-M ","Fludioxonil","Dinofeturam","MCPA ","Mefentrifluconazol","Fenpropatrina","Captana","Hidróxido de Fentina","Mesotriona","Metaflimizona","Metaflimizona","Metalaxil-M ","Metam-sódico ","Metconazol ","Metidationa ","Metiram","Metolacloro","Metomil","Metoxifenozida ","Metribuzim ","Indaziflam","Metsulfurom-metílico ","Miclobutanil ","Tebufenozida","Pidiflumetofen","Sulfluramida ","Pencicurom ","Flutolanil","MSMA ","Lactofem","Tebuconazol ","Espinosade ","Nicossulfurom ","Teflubenzurom ","Malation","Novalurom ","Clorpirifós","Metsulfurom-metílico ","Espiromesifeno","Ciflumetofen ","Propargito ","Imazaquim","Imazapique  ","Epoxiconazol ","Metconazol ","Fluxapiroxade  ","Acefato","Captana","Orthosulfamuron","Fenpiroximato ","Oxadiazona ","Oxatiapiprolina","Oxicloreto de cobre","Oxyfluorfem ","Cloransulam-metílico","Quizalofope-P-tefurílico","Clorimurom-etílico","Dicloreto de Paraquate","Glufosinato de amônio","Pencicurom ","Pendimetalina","Penoxsulam","Permetrina","Triadimenol  ","Picloram","Picoxistrobina","Pidiflumetofen","Fluazifope-p-butil ","Pimetrozina","Piraclostrobina","Clorfenapir","Esfenvalerato","Piridabem ","Pirimetanil","Pirimifós-metílico","Piriproxifem ","Piritiobaque-sódico","Piroxassulfona","Setoxidim ","Fenoxaprop-P-ethyl ","Diafenturiom","Metiram","Clotianidina","Sulfentrazona  ","Cletodim","Benfuracarbe","Trifluralina","Clorantraniliprole","Triticonazol ","Flumetsulam","Atrazina","Atrazina","Atrazina","Atrazina","Atrazina","Azoxistrobina ","Azoxistrobina ","Difenoconazol","Piriproxifem ","Procimidona","Benzoato de emamectina","Profenofós","Profoxidim ","Fenpirazamina","Prometrina ","Propanil","Propargito ","Propiconazol ","Propinebe ","Epoxiconazol ","Protioconazol ","Isoxaflutol ","Indaziflam","Quincloraque ","Quizalofop-P-ethyl ","Quizalofope-P-tefurílico","Flumicloraque-pentílico ","Carfentrazona-etílica","Dicamba","Ipconazol","Acefato","Fenoxaprop-P-ethyl ","Imazamoxi ","Penoxsulam","Clomazona","Clorpirifós","Fipronil ","Diquate","Flumicloraque-pentílico ","Mandipropamida","Tiram ","Mancozebe","Novalurom ","Bispirabaque","Oxadiazona ","Procimidona","Glifosato","Iprodiona","Acrinatrina","Cadusafós ","Etofenproxi","Saflufenacil","Piridabem ","Nicossulfurom ","Carfentrazona-etílica","Difenoconazol","Flumetsulam","Cletodim","Fenoxaprop-P-ethyl ","Tiodicarbe","Halossulfurom-metílico ","Metribuzim ","Metolacloro","Setoxidim ","Carbaril ","Simazina","Flupiradifurona ","Flutriafol","Etoxazol","Tembotriona","Sulfentrazona  ","Imidacloprido ","Bifentrina","Ciproconazol","Diclosulam ","Tebutiurom","Boscalida","Carfentrazona-etílica","Gama-Cialotrina ","Propanil","Fipronil ","Piritiobaque-sódico","Bifentrina","Nicossulfurom ","Propiconazol ","Impirfluxam","Sulfato de cobre","Sulfentrazona  ","Sulfluramida ","Sulfometuron metílico","Sulfoxaflor","Esfenvalerato","Fenitrotiona","Fenitrotiona","Procimidona","Procimidona","Fenitrotiona","Flumioxazina","Tiofanato-metílico","Metidationa ","Acetocloro","Miclobutanil ","Hexitiazox","Bifentrina","Bifentrina","Quizalofop-P-ethyl ","Flutriafol","Tebuconazol ","Tebuconazol ","Tebufenozida","Tebutiurom","Carbendazim","Teflubenzurom ","Tembotriona","Metribuzim ","Tepraloxidim ","Terbufós ","Terbutilazina","Terbutilazina","Etridiazol","Tetraconazol","Halauxifen-metíl","Triflumurom","Tiabendazol","Tiacloprido","Tiametoxam","Tiencarbazona","Piriproxifem ","Propiconazol ","Tiodicarbe","Tiofanato-metílico","Tiram ","Dicloreto de Paraquate","Hexazinona","Tolfenpirade","Clodinafope-Propargil ","Tiofanato-metílico","Aminopiralide","Flutriafol","Bentiavalicarbe isopropílico ","Clorotalonil","Etofenproxi","Triadimenol  ","Triciclazol","Tricopir-butolítico","Azoxistrobina ","Triflumizol","Trifloxistrobina","Trifloxisulfuron","Triflumizol","Triflumurom","Trifluralina","Ciromazina  ","Trinexapaque-etílico","Triticonazol ","Trinexapaque-etílico","Glifosato","Ciprodinil","Beta-ciflutrina ","Clorimurom-etílico","Metribuzim ","Azoxistrobina ","Fluopiram","Ciproconazol","Haloxifope-P-metílico","Ciantraniliprole","Metaflimizona","Fenpropimorfe","Abamectina","Clorpirifós","Tiram ","Carboxina ","MSMA ","Bentazona","Triflumurom","Fluopicolide","Piroxassulfona","Azoxistrobina ","Ametoctradina","Imazetapir","Metsulfurom-metílico ","Clorotalonil","Clorotalonil","Flumioxazina","Flutriafol","Oxatiapiprolina","Zoxamida"]
["14.6 - Toxicidade para peixes - 96h LC50 (mg l-1)",null,63.4,3.14,0.0036,65.7,150,0.63,0.63,0.63,100,0.36,null,17,0.0061,0.006,125,104,3.15,1.6,18.3,0.47,0.233,100,1.8,1.8,0.0035,1.8000000000000002E-3,122,0.42,12.5,12,19,0.228,2.8E-3,0.065,5,5,120,63.4,100,0.47,0.74,0.0036,122,0.171,0.33,0.0065,0.33,19,0.075,82.5,1.3,14.3,19,91.3,91.3,300,1.9,4.5,4.5,90,4.5,36.2,15,1.6,87,0.63,0.17,null,null,154,0.47,0.47,100,0.3,21.3,0.63,0.06,0.532,3.75,0.19,12.6,0.038,0.038,100,10,null,0.0035,6.8e-05,1200,0.00026,0.00026,7.3,null,95,0.00026,0.5,0.27,17,2.3E-3,93.8,2.7,2.7,0.63,36,null,1.7,6.8e-05,0.175,0.33,87,0.13,120,90.1,8.8,2.7,0.186,0.186,1.4,0.00026,2.6,0.19,0.19,100,0.19,0.015,2.3,1.6,1.6,1.6,0.0049,null,0.0013,0.63,33,0.74,25,11,0.038,0.021,36.2,0.049,100,12.6,0.56,0.195,7.7,114,0.63,29,2.8E-3,19,2.41,100,8.4,25,0.21,14.4,86,12,0.007,300,99,8.4,8.4,8.4,0.038,0.0013,104.2,0.006,2.8E-3,0.055,1.7,211,0.017,100,0.27,0.004,4.5,4.4,211,125,0.038,29,0.08,0.038,0.038,0.038,2.3E-3,0.3,0.00026,0.07,0.00026,12,0.19,0.19,0.007,67,98.85,19,110,1.1,0.13,0.13,30.2,6.1,30.2,0.13,120,100,21,6.7,0.074,0.07,6.7,63.4,100,0.57,0.57,0.1,1.23,4.4,0.47,0.0027,4.3,125,0.035,730,0.063,3.14,29,0.011,100,10.56,1E-4,2.69,null,0.035,0.016,0.0027,null,80,2.4,0.63,2.69,101,4.5,4.5,100,0.011,710,1.8000000000000002E-3,0.74,1.3,0.19,5.2,0.00105,2.3E-3,2.3,3.5E-4,0.0125,710,0.248,1.1,22,170,0.022,100,100,1.41,0.055,0.06,0.23,0.0049,300,1.1,2.3,2.3,0.36,0.98,70.5,1.9,14.3,5.4,33,546,4.4,0.233,0.233,170,100,12.6,6.1,122,0.0097,0.24,114,1.83,0.055,0.19,0.038,2.8E-3,4.4,170,1.41,1.4,3.75,1,3.5E-4,29,100,0.0097,5.5,5,4.5,80,0.038,38,710,38,0.25,19,0.404,154,1.33,118,0.088,0.56,0.5,0.195,98,"0,196",5,2.8E-3,320,320,3.2,0.017,0.05,100,0.038,1.48,1.48,122,100,100,100,340,0.0085,211,0.24,33,null,0.0065,0.42,0.17,99,0.00026,4.2,7.7,100,1.5,36.2,0.038,2.27,1.7,2.6,0.00026,0.00026,0.36,1200,0.00021,6.7,null,22,100,2.27,93.8,0.0013,36,0.063,1.8,0.1,0.00021,0.63,1.4,87,710,3.15,0.0013,29,1.48,320,0.018,0.0085,0.074,0.074,2.9,0.074,0.015,29,100,0.23,100,100,0.532,2.3E-3,0.186,0.05,120,0.228,0.228,100,0.175,2.1,0.01,0.336,1.23,0.63,4.2,74.6,0.42,150,2,3,0.18,8,0.3,5.4,null,0.1,4.4,null,65.7,0.0065,0.018,1,0.0013,150,0.016,0.63,0.043,100,100,3.14,2.1,546,0.63,0.186,100,0.00105,1.2,0.69,43.8,0.25,86,0.23,8.4,19,710,0.3,"0,196",100,0.0125,21.3,8.8,0.075,0.18,1.41,100,0.006,0.007,1E-4,0.0007,10.56,0.404,0.27,930,2.2,170,0.19,0.007,0.336,104.2,93.8,25,0.038,0.088,12,3.6,300,4.5,4.5,4.5,4.5,4.5,0.47,0.47,1.1,0.27,7.22,null,0.08,15,5.2,5.5,5.4,0.043,2.6,0.33,3.14,1.83,1.7,0.42,100,0.21,0.23,1.1,1.6,98.85,1.5,0.63,0.19,122,100,14.4,0.0013,0.248,21,1.1,2.9,0.171,0.074,1,95,1.2,7.22,38,36.2,0.0061,0.13,0.0027,98,0.0007,65.7,1.6,1.1,300,25,0.19,1.4,118,74.6,1.23,170,2.6,90,70.5,33,null,100,93.8,211,0.00026,19,110,87,2.7,1.6,3.5E-4,5.4,0.248,930,0.00026,65.7,2.6,null,13.2,93.8,8,12.5,101,1E-4,1.3,1.3,7.22,7.22,1.3,2.3,11,0.01,0.36,2,3.2,0.00026,0.00026,0.21,33,4.4,4.4,3,87,0.19,0.0065,100,74.6,82.5,0.004,2.2,2.2,2.4,4.3,1.33,0.021,0.55,90.1,125,104,0.27,2.6,1.4,11,0.171,19,320,0.049,0.21,11,100,33,10,0.038,0.0027,21.3,7.3,1.3,0.47,0.57,0.022,730,0.57,0.021,0.088,100,null,3.6,null,38,2.41,6.8e-05,8.4,74.6,0.47,0.98,19,0.088,12.6,0.228,2.3,0.0036,0.0013,0.171,2.3,null,100,0.021,0.36,2.2,0.47,0.065,340,150,0.038,0.038,2.3,33,0.69,0.16]
["14.7 - Toxicidade - DAH (mg kg-1 dia-1)\t",null,{"v":0.05,"d":"0.050"},0.008,{"v":0.0025,"d":"0.003"},{"v":2,"d":"2.000"},{"v":0.22,"d":"0.220"},{"v":0.0025,"d":"0.003"},{"v":0.0025,"d":"0.003"},{"v":0.0025,"d":"0.003"},0.025,{"v":0.0036,"d":"0.004"},null,null,{"v":0.01,"d":"0.010"},{"v":0.03,"d":"0.030"},0.026,{"v":0.23,"d":"0.230"},0.003,{"v":0.03,"d":"0.030"},null,{"v":0.2,"d":"0.200"},{"v":0.1,"d":"0.100"},{"v":0.05,"d":"0.050"},{"v":0.01,"d":"0.010"},{"v":0.01,"d":"0.010"},{"v":0.05,"d":"0.050"},0.015,{"v":1,"d":"1.000"},null,null,{"v":1.58,"d":"1.580"},{"v":0.02,"d":"0.020"},{"v":0.03,"d":"0.030"},{"v":0.05,"d":"0.050"},{"v":10,"d":"10.000"},0.015,0.015,null,{"v":0.05,"d":"0.050"},{"v":0.26,"d":"0.260"},{"v":0.2,"d":"0.200"},0.003,{"v":0.0025,"d":"0.003"},{"v":9,"d":"9.000"},{"v":0.01,"d":"0.010"},0.025,{"v":0.01,"d":"0.010"},{"v":0.01,"d":"0.010"},{"v":0.02,"d":"0.020"},null,0.025,{"v":0.03,"d":"0.030"},{"v":0.8,"d":"0.800"},{"v":0.02,"d":"0.020"},{"v":0.36,"d":"0.360"},{"v":0.36,"d":"0.360"},null,{"v":2E-3,"d":"0.002"},{"v":0.02,"d":"0.020"},{"v":0.02,"d":"0.020"},null,{"v":0.02,"d":"0.020"},{"v":0.06,"d":"0.060"},0.005,{"v":0.03,"d":"0.030"},{"v":0.07,"d":"0.070"},{"v":0.0025,"d":"0.003"},0.005,null,null,{"v":0.1,"d":"0.100"},{"v":0.2,"d":"0.200"},{"v":0.2,"d":"0.200"},{"v":0.1,"d":"0.100"},{"v":0.01,"d":"0.010"},{"v":0.05,"d":"0.050"},{"v":0.0025,"d":"0.003"},0.017,0.035,{"v":0.04,"d":"0.040"},{"v":0.02,"d":"0.020"},{"v":0.01,"d":"0.010"},{"v":0.01,"d":"0.010"},{"v":0.01,"d":"0.010"},{"v":0.1,"d":"0.100"},{"v":0.1,"d":"0.100"},null,{"v":0.05,"d":"0.050"},0.003,null,0.015,0.015,null,null,{"v":0.01,"d":"0.010"},0.015,null,{"v":0.1,"d":"0.100"},null,{"v":0.03,"d":"0.030"},{"v":1E-4,"d":"0.000"},{"v":0.04,"d":"0.040"},{"v":0.04,"d":"0.040"},{"v":0.0025,"d":"0.003"},null,null,{"v":0.01,"d":"0.010"},0.003,{"v":1E-3,"d":"0.001"},{"v":0.01,"d":"0.010"},{"v":0.07,"d":"0.070"},{"v":0.0004,"d":"0.000"},{"v":0.01,"d":"0.010"},{"v":0.01,"d":"0.010"},{"v":0.3,"d":"0.300"},{"v":0.04,"d":"0.040"},{"v":0.1,"d":"0.100"},{"v":0.1,"d":"0.100"},"0,01",0.015,{"v":0.007500000000000001,"d":"0.008"},{"v":0.02,"d":"0.020"},{"v":0.02,"d":"0.020"},0.025,{"v":0.02,"d":"0.020"},0.005,0.008,{"v":0.03,"d":"0.030"},null,null,{"v":0.01,"d":"0.010"},null,{"v":0.01,"d":"0.010"},{"v":0.0025,"d":"0.003"},{"v":0.01,"d":"0.010"},{"v":0.03,"d":"0.030"},{"v":0.16,"d":"0.160"},{"v":0.08,"d":"0.080"},0.015,0.014,{"v":0.06,"d":"0.060"},null,{"v":0.03,"d":"0.030"},{"v":0.01,"d":"0.010"},{"v":0.17,"d":"0.170"},null,null,0.004,{"v":0.17,"d":"0.170"},0.013,{"v":0.05,"d":"0.050"},{"v":0.02,"d":"0.020"},{"v":0.03,"d":"0.030"},{"v":0.06,"d":"0.060"},{"v":0.02,"d":"0.020"},{"v":0.16,"d":"0.160"},0.003,0.133,null,{"v":1.58,"d":"1.580"},0.015,null,{"v":0.29,"d":"0.290"},{"v":0.02,"d":"0.020"},{"v":0.02,"d":"0.020"},{"v":0.02,"d":"0.020"},0.015,{"v":0.01,"d":"0.010"},0.097,{"v":0.03,"d":"0.030"},{"v":0.05,"d":"0.050"},{"v":0.01,"d":"0.010"},{"v":0.01,"d":"0.010"},{"v":0.06,"d":"0.060"},{"v":0.15,"d":"0.150"},{"v":1E-4,"d":"0.000"},{"v":0.1,"d":"0.100"},{"v":0.0006,"d":"0.001"},{"v":0.02,"d":"0.020"},{"v":0.03,"d":"0.030"},{"v":0.06,"d":"0.060"},0.026,0.015,{"v":0.0155,"d":"0.016"},{"v":0.03,"d":"0.030"},0.015,0.015,0.015,{"v":0.03,"d":"0.030"},{"v":0.01,"d":"0.010"},{"v":0.01,"d":"0.010"},{"v":0.01,"d":"0.010"},{"v":0.01,"d":"0.010"},{"v":1.58,"d":"1.580"},{"v":0.02,"d":"0.020"},{"v":0.02,"d":"0.020"},null,"0,0024",{"v":0.3,"d":"0.300"},0.004,{"v":0.05,"d":"0.050"},{"v":0.01,"d":"0.010"},{"v":0.1,"d":"0.100"},{"v":0.1,"d":"0.100"},null,{"v":0.05,"d":"0.050"},null,{"v":0.1,"d":"0.100"},null,null,{"v":2E-3,"d":"0.002"},0.007,{"v":0.05,"d":"0.050"},{"v":0.01,"d":"0.010"},0.007,{"v":0.05,"d":"0.050"},{"v":0.1,"d":"0.100"},{"v":0.1,"d":"0.100"},{"v":0.1,"d":"0.100"},{"v":1.5E-3,"d":"0.002"},{"v":0.1,"d":"0.100"},{"v":0.03,"d":"0.030"},{"v":0.2,"d":"0.200"},{"v":0.03,"d":"0.030"},0.004,0.026,0.015,{"v":0.04,"d":"0.040"},null,0.008,0.013,0.006,{"v":0.25,"d":"0.250"},{"v":0.17,"d":"0.170"},{"v":0.0175,"d":"0.018"},0.025,null,0.015,{"v":0.03,"d":"0.030"},{"v":0.03,"d":"0.030"},null,{"v":0.04,"d":"0.040"},0.015,{"v":0.0025,"d":"0.003"},0.025,{"v":0.04,"d":"0.040"},{"v":0.02,"d":"0.020"},{"v":0.02,"d":"0.020"},null,0.006,0.021,0.015,{"v":0.03,"d":"0.030"},0.005,{"v":0.01,"d":"0.010"},{"v":0.13,"d":"0.130"},{"v":0.01,"d":"0.010"},{"v":0.03,"d":"0.030"},0.003,{"v":0.0012,"d":"0.001"},null,0.021,{"v":0.0002,"d":"0.000"},{"v":0.01,"d":"0.010"},0.013,0.003,{"v":0.1,"d":"0.100"},0.025,{"v":0.5,"d":"0.500"},{"v":0.01,"d":"0.010"},{"v":0.01,"d":"0.010"},0.017,{"v":0.37,"d":"0.370"},{"v":0.01,"d":"0.010"},{"v":1E-4,"d":"0.000"},{"v":1E-4,"d":"0.000"},0.009,0.009,{"v":0.08,"d":"0.080"},0.012,{"v":64,"d":"64.000"},{"v":2E-3,"d":"0.002"},{"v":0.8,"d":"0.800"},{"v":0.09,"d":"0.090"},{"v":0.01,"d":"0.010"},{"v":0.02,"d":"0.020"},{"v":0.03,"d":"0.030"},{"v":0.1,"d":"0.100"},{"v":0.1,"d":"0.100"},0.003,{"v":0.25,"d":"0.250"},{"v":0.01,"d":"0.010"},{"v":0.05,"d":"0.050"},{"v":1,"d":"1.000"},0.019,{"v":1E-3,"d":"0.001"},0.004,{"v":0.05,"d":"0.050"},{"v":0.01,"d":"0.010"},{"v":0.02,"d":"0.020"},0.015,{"v":0.05,"d":"0.050"},{"v":0.03,"d":"0.030"},0.003,{"v":0.01,"d":"0.010"},"0,01",{"v":0.04,"d":"0.040"},{"v":0.01,"d":"0.010"},{"v":0.0012,"d":"0.001"},{"v":0.0155,"d":"0.016"},{"v":0.5,"d":"0.500"},0.019,null,0.015,{"v":0.02,"d":"0.020"},{"v":0.04,"d":"0.040"},0.015,{"v":0.3,"d":"0.300"},0.021,{"v":0.3,"d":"0.300"},{"v":3,"d":"3.000"},0.004,0.004,{"v":0.1,"d":"0.100"},0.058,0.063,{"v":0.00065,"d":"0.001"},{"v":0.17,"d":"0.170"},{"$nulls":3},"0,125",0.015,{"v":0.05,"d":"0.050"},{"v":0.05,"d":"0.050"},{"v":0.05,"d":"0.050"},{"v":0.03,"d":"0.030"},{"v":0.15,"d":"0.150"},{"v":0.0005,"d":"0.001"},{"v":0.03,"d":"0.030"},0.015,0.025,0.025,{"v":9,"d":"9.000"},{"v":0.5,"d":"0.500"},{"v":1E-4,"d":"0.000"},{"v":0.25,"d":"0.250"},null,{"v":0.67,"d":"0.670"},{"v":0.06,"d":"0.060"},{"v":1E-3,"d":"0.001"},{"v":0.01,"d":"0.010"},null,{"v":0.01,"d":"0.010"},null,0.005,{"v":0.29,"d":"0.290"},0.015,{"v":0.1,"d":"0.100"},null,{"v":0.03,"d":"0.030"},0.015,{"v":0.06,"d":"0.060"},0.015,{"v":0.02,"d":"0.020"},{"v":0.02,"d":"0.020"},{"v":0.04,"d":"0.040"},{"v":0.01,"d":"0.010"},{"v":0.01,"d":"0.010"},{"v":0.0036,"d":"0.004"},null,0.005,0.007,null,0.013,null,{"v":0.02,"d":"0.020"},{"v":1E-4,"d":"0.000"},{"v":0.01,"d":"0.010"},null,null,{"v":0.01,"d":"0.010"},{"v":1.5E-3,"d":"0.002"},0.005,{"v":0.0025,"d":"0.003"},"0,01",{"v":0.07,"d":"0.070"},0.021,0.003,{"v":0.01,"d":"0.010"},{"v":0.0155,"d":"0.016"},0.025,{"v":0.05,"d":"0.050"},{"v":0.03,"d":"0.030"},{"v":0.67,"d":"0.670"},{"v":0.05,"d":"0.050"},{"v":0.05,"d":"0.050"},{"v":0.15,"d":"0.150"},{"v":0.05,"d":"0.050"},0.005,{"v":0.0155,"d":"0.016"},{"v":0.08,"d":"0.080"},{"v":0.37,"d":"0.370"},null,{"v":0.05,"d":"0.050"},0.035,{"v":0.03,"d":"0.030"},{"v":0.1,"d":"0.100"},{"v":0.0005,"d":"0.001"},{"v":0.01,"d":"0.010"},{"v":0.03,"d":"0.030"},{"v":0.03,"d":"0.030"},{"v":0.08,"d":"0.080"},{"v":1E-3,"d":"0.001"},{"v":0.01,"d":"0.010"},{"v":1E-3,"d":"0.001"},{"v":0.03,"d":"0.030"},{"v":0.1,"d":"0.100"},{"v":0.0025,"d":"0.003"},{"v":0.1,"d":"0.100"},0.013,null,{"v":0.22,"d":"0.220"},0.025,{"v":0.02,"d":"0.020"},0.092,null,{"v":0.2,"d":"0.200"},{"v":0.09,"d":"0.090"},null,{"v":1.5E-3,"d":"0.002"},{"v":0.03,"d":"0.030"},null,{"v":2,"d":"2.000"},{"v":0.01,"d":"0.010"},{"v":0.03,"d":"0.030"},{"v":0.01,"d":"0.010"},{"v":0.01,"d":"0.010"},{"v":0.22,"d":"0.220"},{"v":0.03,"d":"0.030"},{"v":0.17,"d":"0.170"},{"v":0.03,"d":"0.030"},{"v":0.25,"d":"0.250"},{"v":0.5,"d":"0.500"},0.008,{"v":0.01,"d":"0.010"},{"v":0.02,"d":"0.020"},{"v":0.0025,"d":"0.003"},{"v":0.1,"d":"0.100"},null,{"v":0.01,"d":"0.010"},{"v":0.0036,"d":"0.004"},{"v":1.04,"d":"1.040"},{"v":0.15,"d":"0.150"},{"v":3,"d":"3.000"},null,0.013,{"v":0.02,"d":"0.020"},0.004,0.021,{"v":0.2,"d":"0.200"},"0,125",{"v":0.05,"d":"0.050"},null,{"v":0.05,"d":"0.050"},{"v":0.3,"d":"0.300"},null,0.092,{"v":0.01,"d":"0.010"},{"v":0.03,"d":"0.030"},{"v":0.03,"d":"0.030"},0.015,{"v":0.0175,"d":"0.018"},{"v":0.01,"d":"0.010"},{"v":0.17,"d":"0.170"},0.004,{"v":0.1,"d":"0.100"},{"$nulls":3},{"v":0.01,"d":"0.010"},null,{"v":0.03,"d":"0.030"},0.097,{"v":1E-4,"d":"0.000"},{"v":0.16,"d":"0.160"},{"v":0.01,"d":"0.010"},{"v":15,"d":"15.000"},{"v":1.58,"d":"1.580"},0.025,{"v":1E-4,"d":"0.000"},{"v":0.02,"d":"0.020"},{"v":0.02,"d":"0.020"},{"v":0.02,"d":"0.020"},{"v":0.02,"d":"0.020"},{"v":0.02,"d":"0.020"},{"v":0.2,"d":"0.200"},{"v":0.2,"d":"0.200"},{"v":0.01,"d":"0.010"},{"v":0.1,"d":"0.100"},{"v":2.8E-3,"d":"0.003"},null,{"v":0.03,"d":"0.030"},0.005,{"v":0.13,"d":"0.130"},null,{"v":0.02,"d":"0.020"},{"v":0.03,"d":"0.030"},{"v":0.04,"d":"0.040"},0.025,0.008,{"v":0.05,"d":"0.050"},{"v":0.02,"d":"0.020"},null,null,{"v":0.0013,"d":"0.001"},0.013,{"v":1E-4,"d":"0.000"},{"v":0.03,"d":"0.030"},{"v":0.3,"d":"0.300"},0.015,{"v":0.0025,"d":"0.003"},{"v":0.01,"d":"0.010"},{"v":9,"d":"9.000"},{"v":0.05,"d":"0.050"},0.133,{"v":0.01,"d":"0.010"},{"v":0.0002,"d":"0.000"},{"v":2E-3,"d":"0.002"},{"v":1E-4,"d":"0.000"},{"v":0.15,"d":"0.150"},{"v":0.01,"d":"0.010"},{"v":0.05,"d":"0.050"},{"v":0.01,"d":"0.010"},{"v":0.01,"d":"0.010"},{"v":0.0036,"d":"0.004"},{"v":2.8E-3,"d":"0.003"},{"v":0.3,"d":"0.300"},{"v":0.06,"d":"0.060"},{"v":0.01,"d":"0.010"},{"v":0.0004,"d":"0.000"},{"v":0.03,"d":"0.030"},null,{"v":0.01,"d":"0.010"},{"v":2,"d":"2.000"},{"v":0.03,"d":"0.030"},{"v":0.01,"d":"0.010"},{"v":1E-4,"d":"0.000"},{"v":0.16,"d":"0.160"},{"v":0.01,"d":"0.010"},"0,01",0.063,0.013,{"v":0.1,"d":"0.100"},null,{"v":0.007500000000000001,"d":"0.008"},null,{"v":64,"d":"64.000"},{"v":0.01,"d":"0.010"},null,{"v":0.01,"d":"0.010"},{"v":1E-4,"d":"0.000"},{"v":0.06,"d":"0.060"},0.015,{"v":0.02,"d":"0.020"},{"v":0.05,"d":"0.050"},{"v":0.07,"d":"0.070"},{"v":0.04,"d":"0.040"},{"v":0.03,"d":"0.030"},{"v":0.0012,"d":"0.001"},{"v":0.02,"d":"0.020"},{"v":0.0002,"d":"0.000"},null,0.015,{"v":2,"d":"2.000"},{"v":0.04,"d":"0.040"},null,{"v":0.15,"d":"0.150"},{"v":1E-4,"d":"0.000"},null,null,{"v":0.04,"d":"0.040"},{"v":0.0175,"d":"0.018"},0.005,0.005,{"v":2.8E-3,"d":"0.003"},{"v":2.8E-3,"d":"0.003"},0.005,0.009,{"v":0.08,"d":"0.080"},{"v":1E-3,"d":"0.001"},{"v":0.0036,"d":"0.004"},0.025,{"v":0.03,"d":"0.030"},0.015,0.015,{"v":0.0013,"d":"0.001"},{"v":0.01,"d":"0.010"},{"v":0.03,"d":"0.030"},{"v":0.03,"d":"0.030"},{"v":0.02,"d":"0.020"},{"v":0.07,"d":"0.070"},{"v":0.02,"d":"0.020"},{"v":0.01,"d":"0.010"},{"v":0.01,"d":"0.010"},0.013,0.025,{"v":0.0006,"d":"0.001"},0.004,0.004,0.015,0.004,0.058,0.014,{"v":0.1,"d":"0.100"},{"v":0.01,"d":"0.010"},0.026,{"v":0.23,"d":"0.230"},{"v":0.1,"d":"0.100"},{"v":0.04,"d":"0.040"},"0,01",{"v":0.08,"d":"0.080"},{"v":0.01,"d":"0.010"},0.004,{"v":0.05,"d":"0.050"},null,0.003,{"v":0.08,"d":"0.080"},{"v":0.26,"d":"0.260"},{"v":0.01,"d":"0.010"},{"v":0.1,"d":"0.100"},0.015,{"v":0.03,"d":"0.030"},{"v":0.05,"d":"0.050"},null,{"v":0.03,"d":"0.030"},{"v":0.2,"d":"0.200"},{"v":0.05,"d":"0.050"},{"v":0.1,"d":"0.100"},{"v":0.04,"d":"0.040"},{"v":0.05,"d":"0.050"},0.014,{"v":15,"d":"15.000"},{"v":0.06,"d":"0.060"},null,0.025,null,{"v":0.3,"d":"0.300"},{"v":0.03,"d":"0.030"},0.003,{"v":0.02,"d":"0.020"},0.013,{"v":0.2,"d":"0.200"},0.012,{"v":0.02,"d":"0.020"},{"v":0.00065,"d":"0.001"},{"v":0.01,"d":"0.010"},{"v":0.03,"d":"0.030"},0.003,{"v":0.0025,"d":"0.003"},{"v":0.01,"d":"0.010"},{"v":0.01,"d":"0.010"},0.008,null,{"v":0.1,"d":"0.100"},0.014,{"v":0.08,"d":"0.080"},null,{"v":0.2,"d":"0.200"},{"v":10,"d":"10.000"},null,{"v":0.22,"d":"0.220"},0.015,0.015,0.009,{"v":0.01,"d":"0.010"},{"v":1.04,"d":"1.040"},{"v":0.5,"d":"0.500"}]
["Índice para Toxicidade do produto (>2,5 - Alerta alto risco)",null,{"v":1.7494703688911244,"d":"1.75"},{"v":2.799990182467421,"d":"2.80"},{"v":4.522878745280337,"d":"4.52"},{"v":0.9407023173881188,"d":"0.94"},{"v":1.2407430300610562,"d":"1.24"},{"v":3.40135972093719,"d":"3.40"},{"v":3.40135972093719,"d":"3.40"},{"v":3.40135972093719,"d":"3.40"},{"v":1.8010299956639813,"d":"1.80"},{"v":3.4436974992327123,"d":"3.44"},null,null,{"$f":"IF(O7>0,(((4-LOG10(O7))+(-LOG(O8)))/2),\"\")","v":{"v":4.107335082494616,"d":"4.11"}},{"v":3.8723637474483468,"d":"3.87"},{"v":1.7440583195105628,"d":"1.74"},{"$f":"IF(R7>0,(((4-LOG10(R7))+(-LOG(R8)))/2),\"\")","v":{"v":1.3106194123418133,"d":"1.31"}},{"v":3.0122840957453683,"d":"3.01"},{"v":2.659379381312206,"d":"2.66"},null,{"v":2.513436073200151,"d":"2.51"},{"v":2.8163220394869906,"d":"2.82"},{"$f":"IF(X7>0,(((4-LOG10(X7))+(-LOG(X8)))/2),\"\")","v":{"v":1.6505149978319906,"d":"1.65"}},{"v":2.8723637474483468,"d":"2.87"},{"v":2.8723637474483468,"d":"2.87"},{"$f":"IF(AA7>0,(((4-LOG10(AA7))+(-LOG(AA8)))/2),\"\")","v":{"v":3.878480975656853,"d":"3.88"}},{"v":4.284318117920506,"d":"4.28"},{"$f":"IF(AC7>0,(((4-LOG10(AC7))+(-LOG(AC8)))/2),\"\")","v":{"v":0.9568200846626258,"d":"0.96"}},null,null,{"v":1.3610808334989761,"d":"1.36"},{"v":2.210108201691595,"d":"2.21"},{"v":3.0824719491399417,"d":"3.08"},{"v":3.926935982160881,"d":"3.93"},{"$f":"IF(AJ7>0,(((4-LOG10(AJ7))+(-LOG(AJ8)))/2),\"\")","v":{"v":2.093543321678572,"d":"2.09"}},{"v":2.56246936830415,"d":"2.56"},{"v":2.56246936830415,"d":"2.56"},null,{"v":1.7494703688911244,"d":"1.75"},{"$f":"IF(AO7>0,(((4-LOG10(AO7))+(-LOG(AO8)))/2),\"\")","v":{"v":1.292513326014591,"d":"1.29"}},{"v":2.513436073200151,"d":"2.51"},{"$f":"IF(AQ7>0,(((4-LOG10(AQ7))+(-LOG(AQ8)))/2),\"\")","v":{"v":3.3268235127746806,"d":"3.33"}},{"v":4.522878745280337,"d":"4.52"},{"v":0.47969882994296337,"d":"0.48"},{"v":3.383501944803923,"d":"3.38"},{"$f":"IF(AU7>0,(((4-LOG10(AU7))+(-LOG(AU8)))/2),\"\")","v":{"v":3.0417730257250373,"d":"3.04"}},{"v":4.093543321678572,"d":"4.09"},{"$f":"IF(AW7>0,(((4-LOG10(AW7))+(-LOG(AW8)))/2),\"\")","v":{"v":3.240743030061056,"d":"3.24"}},{"v":2.210108201691595,"d":"2.21"},null,{"$f":"IF(AZ7>0,(((4-LOG10(AZ7))+(-LOG(AZ8)))/2),\"\")","v":{"v":1.8428030213890185,"d":"1.84"}},{"$f":"IF(BA7>0,(((4-LOG10(BA7))+(-LOG(BA8)))/2),\"\")","v":{"v":2.7044676964867502,"d":"2.70"}},{"$f":"IF(BB7>0,(((4-LOG10(BB7))+(-LOG(BB8)))/2),\"\")","v":{"v":1.4707869877714972,"d":"1.47"}},{"v":2.210108201691595,"d":"2.21"},{"$f":"IF(BD7>0,(((4-LOG10(BD7))+(-LOG(BD8)))/2),\"\")","v":{"v":1.2416133608492068,"d":"1.24"}},{"$f":"IF(BE7>0,(((4-LOG10(BE7))+(-LOG(BE8)))/2),\"\")","v":{"v":1.2416133608492068,"d":"1.24"}},null,{"$f":"IF(BG7>0,(((4-LOG10(BG7))+(-LOG(BG8)))/2),\"\")","v":{"v":3.210108201691595,"d":"3.21"}},{"v":2.5228787452803374,"d":"2.52"},{"v":2.5228787452803374,"d":"2.52"},null,{"v":2.5228787452803374,"d":"2.52"},{"v":1.8315700895415952,"d":"1.83"},{"$f":"IF(BM7>0,(((4-LOG10(BM7))+(-LOG(BM8)))/2),\"\")","v":{"v":2.56246936830415,"d":"2.56"}},{"v":2.659379381312206,"d":"2.66"},{"v":1.6076913536835624,"d":"1.61"},{"v":3.40135972093719,"d":"3.40"},{"$f":"IF(BQ7>0,(((4-LOG10(BQ7))+(-LOG(BQ8)))/2),\"\")","v":{"v":3.5352905371428536,"d":"3.54"}},null,null,{"$f":"IF(BT7>0,(((4-LOG10(BT7))+(-LOG(BT8)))/2),\"\")","v":{"v":1.4062396395817685,"d":"1.41"}},{"v":2.513436073200151,"d":"2.51"},{"v":2.513436073200151,"d":"2.51"},{"v":1.5,"d":"1.50"},{"$f":"IF(BX7>0,(((4-LOG10(BX7))+(-LOG(BX8)))/2),\"\")","v":{"v":3.2614393726401687,"d":"3.26"}},{"v":1.9863251961126216,"d":"1.99"},{"v":3.40135972093719,"d":"3.40"},{"v":3.495699914119041,"d":"3.50"},{"$f":"IF(CB7>0,(((4-LOG10(CB7))+(-LOG(CB8)))/2),\"\")","v":{"v":2.865010161677338,"d":"2.87"}},{"$f":"IF(CC7>0,(((4-LOG10(CC7))+(-LOG(CC8)))/2),\"\")","v":{"v":2.4119543704721593,"d":"2.41"}},{"v":3.210108201691595,"d":"3.21"},{"v":2.4498147274412183,"d":"2.45"},{"v":3.710108201691595,"d":"3.71"},{"v":3.710108201691595,"d":"3.71"},{"v":1.5,"d":"1.50"},{"$f":"IF(CI7>0,(((4-LOG10(CI7))+(-LOG(CI8)))/2),\"\")","v":{"v":2,"d":"2.00"}},null,{"$f":"IF(CK7>0,(((4-LOG10(CK7))+(-LOG(CK8)))/2),\"\")","v":{"v":3.878480975656853,"d":"3.88"}},{"v":5.34518491628705,"d":"5.35"},null,{"$f":"IF(CN7>0,(((4-LOG10(CN7))+(-LOG(CN8)))/2),\"\")","v":{"v":4.70446769648675,"d":"4.70"}},{"$f":"IF(CO7>0,(((4-LOG10(CO7))+(-LOG(CO8)))/2),\"\")","v":{"v":4.70446769648675,"d":"4.70"}},null,null,{"$f":"IF(CR7>0,(((4-LOG10(CR7))+(-LOG(CR8)))/2),\"\")","v":{"v":2.011138197355576,"d":"2.01"}},{"$f":"IF(CS7>0,(((4-LOG10(CS7))+(-LOG(CS8)))/2),\"\")","v":{"v":4.70446769648675,"d":"4.70"}},null,{"v":2.784318117920506,"d":"2.78"},null,{"v":4.080575454631372,"d":"4.08"},{"v":3.013898580810468,"d":"3.01"},{"v":2.483288122256525,"d":"2.48"},{"v":2.483288122256525,"d":"2.48"},{"v":3.40135972093719,"d":"3.40"},null,null,{"$f":"IF(DD7>0,(((4-LOG10(DD7))+(-LOG(DD8)))/2),\"\")","v":{"v":2.884775539310863,"d":"2.88"}},{"v":5.34518491628705,"d":"5.35"},{"$f":"IF(DF7>0,(((4-LOG10(DF7))+(-LOG(DF8)))/2),\"\")","v":{"v":3.878480975656853,"d":"3.88"}},{"$f":"IF(DG7>0,(((4-LOG10(DG7))+(-LOG(DG8)))/2),\"\")","v":{"v":3.240743030061056,"d":"3.24"}},{"v":1.6076913536835624,"d":"1.61"},{"$f":"IF(DI7>0,(((4-LOG10(DI7))+(-LOG(DI8)))/2),\"\")","v":{"v":4.1419983281826,"d":"4.14"}},{"v":1.9604093769761877,"d":"1.96"},{"$f":"IF(DK7>0,(((4-LOG10(DK7))+(-LOG(DK8)))/2),\"\")","v":{"v":2.0226376045104684,"d":"2.02"}},{"$f":"IF(DL7>0,(((4-LOG10(DL7))+(-LOG(DL8)))/2),\"\")","v":{"v":1.7891980365650846,"d":"1.79"}},{"v":2.483288122256525,"d":"2.48"},{"v":2.865243527891042,"d":"2.87"},{"v":2.865243527891042,"d":"2.87"},{"v":2.926935982160881,"d":"2.93"},{"$f":"IF(DQ7>0,(((4-LOG10(DQ7))+(-LOG(DQ8)))/2),\"\")","v":{"v":4.70446769648675,"d":"4.70"}},{"v":2.854982694318741,"d":"2.85"},{"v":3.210108201691595,"d":"3.21"},{"v":3.210108201691595,"d":"3.21"},{"$f":"IF(DU7>0,(((4-LOG10(DU7))+(-LOG(DU8)))/2),\"\")","v":{"v":1.8010299956639813,"d":"1.80"}},{"v":3.210108201691595,"d":"3.21"},{"$f":"IF(DW7>0,(((4-LOG10(DW7))+(-LOG(DW8)))/2),\"\")","v":{"v":4.06246936830415,"d":"4.06"}},{"$f":"IF(DX7>0,(((4-LOG10(DX7))+(-LOG(DX8)))/2),\"\")","v":{"v":2.8675910884952316,"d":"2.87"}},{"v":2.659379381312206,"d":"2.66"},null,null,{"v":4.154901959985743,"d":"4.15"},null,{"v":4.4430283238465815,"d":"4.44"},{"v":3.40135972093719,"d":"3.40"},{"v":2.240743030061056,"d":"2.24"},{"v":2.8268235127746806,"d":"2.83"},{"v":1.6989700043360187,"d":"1.70"},{"v":2.0277586639249154,"d":"2.03"},{"v":3.6220625721637543,"d":"3.62"},{"v":3.765826334793921,"d":"3.77"},{"v":1.8315700895415952,"d":"1.83"},null,{"$f":"IF(EN7>0,(((4-LOG10(EN7))+(-LOG(EN8)))/2),\"\")","v":{"v":1.7614393726401687,"d":"1.76"}},{"v":2.4498147274412183,"d":"2.45"},{"$f":"IF(EP7>0,(((4-LOG10(EP7))+(-LOG(EP8)))/2),\"\")","v":{"v":2.5106815258077626,"d":"2.51"}},null,null,{"$f":"IF(ES7>0,(((4-LOG10(ES7))+(-LOG(ES8)))/2),\"\")","v":{"v":2.1705175786677824,"d":"2.17"}},{"$f":"IF(ET7>0,(((4-LOG10(ET7))+(-LOG(ET8)))/2),\"\")","v":{"v":2.485105264584072,"d":"2.49"}},{"$f":"IF(EU7>0,(((4-LOG10(EU7))+(-LOG(EU8)))/2),\"\")","v":{"v":2.2118293248971037,"d":"2.21"}},{"v":3.926935982160881,"d":"3.93"},{"v":2.210108201691595,"d":"2.21"},{"$f":"IF(EX7>0,(((4-LOG10(EX7))+(-LOG(EX8)))/2),\"\")","v":{"v":2.5704308513527345,"d":"2.57"}},{"v":1.610924374808178,"d":"1.61"},{"v":2.3873453591370684,"d":"2.39"},{"v":1.6989700043360187,"d":"1.70"},{"$f":"IF(FB7>0,(((4-LOG10(FB7))+(-LOG(FB8)))/2),\"\")","v":{"v":3.600329725273209,"d":"3.60"}},{"$f":"IF(FC7>0,(((4-LOG10(FC7))+(-LOG(FC8)))/2),\"\")","v":{"v":1.8588929334688322,"d":"1.86"}},null,{"v":1.3610808334989761,"d":"1.36"},{"$f":"IF(FF7>0,(((4-LOG10(FF7))+(-LOG(FF8)))/2),\"\")","v":{"v":3.989405350465031,"d":"3.99"}},null,{"$f":"IF(FH7>0,(((4-LOG10(FH7))+(-LOG(FH8)))/2),\"\")","v":{"v":1.2709834037517471,"d":"1.27"}},{"v":2.3873453591370684,"d":"2.39"},{"v":2.3873453591370684,"d":"2.39"},{"v":2.3873453591370684,"d":"2.39"},{"v":3.6220625721637543,"d":"3.62"},{"v":4.4430283238465815,"d":"4.44"},{"$f":"IF(FN7>0,(((4-LOG10(FN7))+(-LOG(FN8)))/2),\"\")","v":{"v":1.4976802733851249,"d":"1.50"}},{"v":3.8723637474483468,"d":"3.87"},{"v":3.926935982160881,"d":"3.93"},{"v":3.629818655252878,"d":"3.63"},{"$f":"IF(FR7>0,(((4-LOG10(FR7))+(-LOG(FR8)))/2),\"\")","v":{"v":2.884775539310863,"d":"2.88"}},{"v":1.448783147159332,"d":"1.45"},{"v":3.2967299097830223,"d":"3.30"},{"v":3,"d":"3.00"},{"v":2.784318117920506,"d":"2.78"},{"$f":"IF(FW7>0,(((4-LOG10(FW7))+(-LOG(FW8)))/2),\"\")","v":{"v":4.809894379144197,"d":"4.81"}},{"v":2.5228787452803374,"d":"2.52"},{"v":2.439713034397075,"d":"2.44"},{"v":1.448783147159332,"d":"1.45"},{"v":1.7440583195105628,"d":"1.74"},{"v":3.6220625721637543,"d":"3.62"},{"v":2.1736351519653763,"d":"2.17"},{"$f":"IF(GD7>0,(((4-LOG10(GD7))+(-LOG(GD8)))/2),\"\")","v":{"v":3.309894379144197,"d":"3.31"}},{"v":3.6220625721637543,"d":"3.62"},{"v":3.6220625721637543,"d":"3.62"},{"v":3.6220625721637543,"d":"3.62"},{"v":4.080575454631372,"d":"4.08"},{"$f":"IF(GI7>0,(((4-LOG10(GI7))+(-LOG(GI8)))/2),\"\")","v":{"v":3.2614393726401687,"d":"3.26"}},{"v":4.792513326014591,"d":"4.79"},{"$f":"IF(GK7>0,(((4-LOG10(GK7))+(-LOG(GK8)))/2),\"\")","v":{"v":3.5774509799928715,"d":"3.58"}},{"v":4.792513326014591,"d":"4.79"},{"v":1.3610808334989761,"d":"1.36"},{"v":3.210108201691595,"d":"3.21"},{"v":3.210108201691595,"d":"3.21"},null,{"v":2.396856977793784,"d":"2.40"},{"$f":"IF(GR7>0,(((4-LOG10(GR7))+(-LOG(GR8)))/2),\"\")","v":{"v":1.2639510358153232,"d":"1.26"}},{"v":2.5595932038596043,"d":"2.56"},{"v":1.6298186552528782,"d":"1.63"},{"v":2.9793036574208873,"d":"2.98"},{"v":2.9430283238465815,"d":"2.94"},{"v":2.9430283238465815,"d":"2.94"},null,{"$f":"IF(GY7>0,(((4-LOG10(GY7))+(-LOG(GY8)))/2),\"\")","v":{"v":2.257850080326607,"d":"2.26"}},null,{"v":2.9430283238465815,"d":"2.94"},null,null,{"$f":"IF(HD7>0,(((4-LOG10(HD7))+(-LOG(HD8)))/2),\"\")","v":{"v":2.6883753548010496,"d":"2.69"}},{"v":2.664413578642458,"d":"2.66"},{"v":3.2158991379665025,"d":"3.22"},{"$f":"IF(HG7>0,(((4-LOG10(HG7))+(-LOG(HG8)))/2),\"\")","v":{"v":3.5774509799928715,"d":"3.58"}},{"v":2.664413578642458,"d":"2.66"},{"v":1.7494703688911244,"d":"1.75"},{"v":1.5,"d":"1.50"},{"$f":"IF(HK7>0,(((4-LOG10(HK7))+(-LOG(HK8)))/2),\"\")","v":{"v":2.6220625721637543,"d":"2.62"}},{"$f":"IF(HL7>0,(((4-LOG10(HL7))+(-LOG(HL8)))/2),\"\")","v":{"v":2.6220625721637543,"d":"2.62"}},{"v":3.9119543704721593,"d":"3.91"},{"v":2.455047444280301,"d":"2.46"},{"v":2.439713034397075,"d":"2.44"},{"v":2.513436073200151,"d":"2.51"},{"v":4.045757490560675,"d":"4.05"},{"v":2.882235776546225,"d":"2.88"},{"v":1.7440583195105628,"d":"1.74"},{"$f":"IF(HT7>0,(((4-LOG10(HT7))+(-LOG(HT8)))/2),\"\")","v":{"v":3.6399203482970215,"d":"3.64"}},{"$f":"IF(HU7>0,(((4-LOG10(HU7))+(-LOG(HU8)))/2),\"\")","v":{"v":1.2673085742757908,"d":"1.27"}},null,{"v":2.799990182467421,"d":"2.80"},{"$f":"IF(HX7>0,(((4-LOG10(HX7))+(-LOG(HX8)))/2),\"\")","v":{"v":2.2118293248971037,"d":"2.21"}},{"$f":"IF(HY7>0,(((4-LOG10(HY7))+(-LOG(HY8)))/2),\"\")","v":{"v":4.090228032229065,"d":"4.09"}},{"v":1.3010299956639813,"d":"1.30"},{"$f":"IF(IA7>0,(((4-LOG10(IA7))+(-LOG(IA8)))/2),\"\")","v":{"v":1.8729435802119663,"d":"1.87"}},{"v":4.878480975656853,"d":"4.88"},{"$f":"IF(IC7>0,(((4-LOG10(IC7))+(-LOG(IC8)))/2),\"\")","v":{"v":2.586153855662777,"d":"2.59"}},null,{"$f":"IF(IE7>0,(((4-LOG10(IE7))+(-LOG(IE8)))/2),\"\")","v":{"v":3.6399203482970215,"d":"3.64"}},{"$f":"IF(IF7>0,(((4-LOG10(IF7))+(-LOG(IF8)))/2),\"\")","v":{"v":3.659379381312206,"d":"3.66"}},{"v":4.045757490560675,"d":"4.05"},null,{"$f":"IF(II7>0,(((4-LOG10(II7))+(-LOG(II8)))/2),\"\")","v":{"v":1.7474250108400469,"d":"1.75"}},{"$f":"IF(IJ7>0,(((4-LOG10(IJ7))+(-LOG(IJ8)))/2),\"\")","v":{"v":2.7218487496163566,"d":"2.72"}},{"v":3.40135972093719,"d":"3.40"},{"$f":"IF(IL7>0,(((4-LOG10(IL7))+(-LOG(IL8)))/2),\"\")","v":{"v":2.586153855662777,"d":"2.59"}},{"$f":"IF(IM7>0,(((4-LOG10(IM7))+(-LOG(IM8)))/2),\"\")","v":{"v":1.6968093174446974,"d":"1.70"}},{"v":2.5228787452803374,"d":"2.52"},{"v":2.5228787452803374,"d":"2.52"},null,{"$f":"IF(IQ7>0,(((4-LOG10(IQ7))+(-LOG(IQ8)))/2),\"\")","v":{"v":4.090228032229065,"d":"4.09"}},{"v":1.4132611782735025,"d":"1.41"},{"v":4.284318117920506,"d":"4.28"},{"v":2.8268235127746806,"d":"2.83"},{"$f":"IF(IU7>0,(((4-LOG10(IU7))+(-LOG(IU8)))/2),\"\")","v":{"v":3.093543321678572,"d":"3.09"}},{"v":3.3606231995235856,"d":"3.36"},{"$f":"IF(IW7>0,(((4-LOG10(IW7))+(-LOG(IW8)))/2),\"\")","v":{"v":2.085026652029182,"d":"2.09"}},{"$f":"IF(IX7>0,(((4-LOG10(IX7))+(-LOG(IX8)))/2),\"\")","v":{"v":4.489405350465031,"d":"4.49"}},{"v":4.080575454631372,"d":"4.08"},{"$f":"IF(IZ7>0,(((4-LOG10(IZ7))+(-LOG(IZ8)))/2),\"\")","v":{"v":3.080575454631372,"d":"3.08"}},{"$f":"IF(JA7>0,(((4-LOG10(JA7))+(-LOG(JA8)))/2),\"\")","v":{"v":5.18837535480105,"d":"5.19"}},null,{"v":1.4132611782735025,"d":"1.41"},{"v":4.152259161754902,"d":"4.15"},{"v":2.9793036574208873,"d":"2.98"},{"v":2.2718169834354787,"d":"2.27"},{"v":2.1462149119510316,"d":"2.15"},{"v":3.3287886595888967,"d":"3.33"},{"$f":"IF(JI7>0,(((4-LOG10(JI7))+(-LOG(JI8)))/2),\"\")","v":{"v":1.8010299956639813,"d":"1.80"}},{"$f":"IF(JJ7>0,(((4-LOG10(JJ7))+(-LOG(JJ8)))/2),\"\")","v":{"v":1.1505149978319906,"d":"1.15"}},{"v":2.92539044367231,"d":"2.93"},{"v":3.629818655252878,"d":"3.63"},{"v":3.495699914119041,"d":"3.50"},{"$f":"IF(JN7>0,(((4-LOG10(JN7))+(-LOG(JN8)))/2),\"\")","v":{"v":2.535035219957706,"d":"2.54"}},{"v":4.154901959985743,"d":"4.15"},{"v":2.7614393726401687,"d":"2.76"},{"v":3.9793036574208873,"d":"3.98"},{"v":2.842014827271541,"d":"2.84"},{"v":2.842014827271541,"d":"2.84"},{"$f":"IF(JT7>0,(((4-LOG10(JT7))+(-LOG(JT8)))/2),\"\")","v":{"v":2.7703037561203843,"d":"2.77"}},{"$f":"IF(JU7>0,(((4-LOG10(JU7))+(-LOG(JU8)))/2),\"\")","v":{"v":2.96479633912994,"d":"2.96"}},{"v":0.17281545451235725,"d":"0.17"},{"$f":"IF(JW7>0,(((4-LOG10(JW7))+(-LOG(JW8)))/2),\"\")","v":{"v":3.210108201691595,"d":"3.21"}},{"$f":"IF(JX7>0,(((4-LOG10(JX7))+(-LOG(JX8)))/2),\"\")","v":{"v":1.4707869877714972,"d":"1.47"}},{"$f":"IF(JY7>0,(((4-LOG10(JY7))+(-LOG(JY8)))/2),\"\")","v":{"v":2.1566818653688533,"d":"2.16"}},{"v":2.240743030061056,"d":"2.24"},{"v":1.4808886808156407,"d":"1.48"},{"v":2.439713034397075,"d":"2.44"},{"v":2.8163220394869906,"d":"2.82"},{"v":2.8163220394869906,"d":"2.82"},{"v":2.1462149119510316,"d":"2.15"},{"v":1.3010299956639813,"d":"1.30"},{"v":2.4498147274412183,"d":"2.45"},{"$f":"IF(KH7>0,(((4-LOG10(KH7))+(-LOG(KH8)))/2),\"\")","v":{"v":2.257850080326607,"d":"2.26"}},{"$f":"IF(KI7>0,(((4-LOG10(KI7))+(-LOG(KI8)))/2),\"\")","v":{"v":0.9568200846626258,"d":"0.96"}},{"$f":"IF(KJ7>0,(((4-LOG10(KJ7))+(-LOG(KJ8)))/2),\"\")","v":{"v":3.867237332390463,"d":"3.87"}},{"$f":"IF(KK7>0,(((4-LOG10(KK7))+(-LOG(KK8)))/2),\"\")","v":{"v":3.809894379144197,"d":"3.81"}},{"$f":"IF(KL7>0,(((4-LOG10(KL7))+(-LOG(KL8)))/2),\"\")","v":{"v":2.1705175786677824,"d":"2.17"}},{"v":2.5192894529667758,"d":"2.52"},{"v":3.629818655252878,"d":"3.63"},{"v":3.210108201691595,"d":"3.21"},{"v":3.6220625721637543,"d":"3.62"},{"v":3.926935982160881,"d":"3.93"},{"v":2.439713034397075,"d":"2.44"},{"v":2.1462149119510316,"d":"2.15"},{"v":2.92539044367231,"d":"2.93"},{"v":2.926935982160881,"d":"2.93"},{"$f":"IF(KV7>0,(((4-LOG10(KV7))+(-LOG(KV8)))/2),\"\")","v":{"v":2.4119543704721593,"d":"2.41"}},{"v":3,"d":"3.00"},{"$f":"IF(KX7>0,(((4-LOG10(KX7))+(-LOG(KX8)))/2),\"\")","v":{"v":5.18837535480105,"d":"5.19"}},{"v":2.1736351519653763,"d":"2.17"},{"$f":"IF(KZ7>0,(((4-LOG10(KZ7))+(-LOG(KZ8)))/2),\"\")","v":{"v":1.1505149978319906,"d":"1.15"}},{"$f":"IF(LA7>0,(((4-LOG10(LA7))+(-LOG(LA8)))/2),\"\")","v":{"v":3.867237332390463,"d":"3.87"}},null,{"v":2.56246936830415,"d":"2.56"},{"v":2.5228787452803374,"d":"2.52"},{"$f":"IF(LE7>0,(((4-LOG10(LE7))+(-LOG(LE8)))/2),\"\")","v":{"v":1.7474250108400469,"d":"1.75"}},{"v":3.6220625721637543,"d":"3.62"},{"v":1.4715475743317636,"d":"1.47"},{"v":1.4132611782735025,"d":"1.41"},{"v":1.4715475743317636,"d":"1.47"},{"v":2.06246936830415,"d":"2.06"},{"v":2.5595932038596043,"d":"2.56"},{"v":3.3957793217807164,"d":"3.40"},{"$f":"IF(LM7>0,(((4-LOG10(LM7))+(-LOG(LM8)))/2),\"\")","v":{"v":1.4062396395817685,"d":"1.41"}},{"$f":"IF(LN7>0,(((4-LOG10(LN7))+(-LOG(LN8)))/2),\"\")","v":{"v":2.5563601827349887,"d":"2.56"}},{"$f":"IF(LO7>0,(((4-LOG10(LO7))+(-LOG(LO8)))/2),\"\")","v":{"v":1.5643887216201464,"d":"1.56"}},{"$f":"IF(LP7>0,(((4-LOG10(LP7))+(-LOG(LP8)))/2),\"\")","v":{"v":4.121301985603488,"d":"4.12"}},{"$f":"IF(LQ7>0,(((4-LOG10(LQ7))+(-LOG(LQ8)))/2),\"\")","v":{"v":2.5106815258077626,"d":"2.51"}},{"$nulls":3},{"v":2.8054169578177337,"d":"2.81"},{"v":2.56246936830415,"d":"2.56"},{"v":3.926935982160881,"d":"3.93"},{"v":1.3979400086720377,"d":"1.40"},{"v":1.3979400086720377,"d":"1.40"},{"$f":"IF(LZ7>0,(((4-LOG10(LZ7))+(-LOG(LZ8)))/2),\"\")","v":{"v":2.5088643834802156,"d":"2.51"}},{"v":3.2967299097830223,"d":"3.30"},{"v":4.301029995663981,"d":"4.30"},{"v":1.7614393726401687,"d":"1.76"},{"v":3.6220625721637543,"d":"3.62"},{"v":2.7158991379665025,"d":"2.72"},{"v":2.7158991379665025,"d":"2.72"},{"v":0.47969882994296337,"d":"0.48"},{"v":1.1505149978319906,"d":"1.15"},{"v":3,"d":"3.00"},{"v":1.3010299956639813,"d":"1.30"},null,{"v":3.12225313579244,"d":"3.12"},{"v":1.448783147159332,"d":"1.45"},{"$f":"IF(MN7>0,(((4-LOG10(MN7))+(-LOG(MN8)))/2),\"\")","v":{"v":3.809894379144197,"d":"3.81"}},{"v":2.240743030061056,"d":"2.24"},null,{"v":4.093543321678572,"d":"4.09"},null,{"$f":"IF(MS7>0,(((4-LOG10(MS7))+(-LOG(MS8)))/2),\"\")","v":{"v":3.5352905371428536,"d":"3.54"}},{"$f":"IF(MT7>0,(((4-LOG10(MT7))+(-LOG(MT8)))/2),\"\")","v":{"v":1.2709834037517471,"d":"1.27"}},{"$f":"IF(MU7>0,(((4-LOG10(MU7))+(-LOG(MU8)))/2),\"\")","v":{"v":4.70446769648675,"d":"4.70"}},{"v":2.1883753548010496,"d":"2.19"},null,{"v":1.7614393726401687,"d":"1.76"},{"$f":"IF(MY7>0,(((4-LOG10(MY7))+(-LOG(MY8)))/2),\"\")","v":{"v":2.8239087409443187,"d":"2.82"}},{"v":1.8315700895415952,"d":"1.83"},{"v":3.6220625721637543,"d":"3.62"},{"$f":"IF(NB7>0,(((4-LOG10(NB7))+(-LOG(NB8)))/2),\"\")","v":{"v":2.671472073571448,"d":"2.67"}},2.73,{"v":2.4914833303506096,"d":"2.49"},{"v":4.792513326014591,"d":"4.79"},{"v":4.792513326014591,"d":"4.79"},{"v":3.4436974992327123,"d":"3.44"},null,{"v":4.989405350465031,"d":"4.99"},{"v":2.664413578642458,"d":"2.66"},null,{"v":2.2718169834354787,"d":"2.27"},null,{"$f":"IF(NN7>0,(((4-LOG10(NN7))+(-LOG(NN8)))/2),\"\")","v":{"v":2.671472073571448,"d":"2.67"}},{"v":3.013898580810468,"d":"3.01"},{"v":4.4430283238465815,"d":"4.44"},null,null,{"v":2.8723637474483468,"d":"2.87"},{"v":3.9119543704721593,"d":"3.91"},{"v":4.989405350465031,"d":"4.99"},{"v":3.40135972093719,"d":"3.40"},{"v":2.926935982160881,"d":"2.93"},{"v":1.6076913536835624,"d":"1.61"},{"v":1.4132611782735025,"d":"1.41"},{"v":3.0122840957453683,"d":"3.01"},{"v":4.4430283238465815,"d":"4.44"},{"v":2.1736351519653763,"d":"2.17"},{"v":2.7158991379665025,"d":"2.72"},{"v":1.3979400086720377,"d":"1.40"},{"v":3.6338031200885155,"d":"3.63"},{"v":3.12225313579244,"d":"3.12"},{"v":3.2158991379665025,"d":"3.22"},{"v":3.2158991379665025,"d":"3.22"},{"$f":"IF(OI7>0,(((4-LOG10(OI7))+(-LOG(OI8)))/2),\"\")","v":{"v":2.1807553715226815,"d":"2.18"}},{"v":3.2158991379665025,"d":"3.22"},{"$f":"IF(OK7>0,(((4-LOG10(OK7))+(-LOG(OK8)))/2),\"\")","v":{"v":4.06246936830415,"d":"4.06"}},{"v":2.1736351519653763,"d":"2.17"},{"v":1.5484550065040281,"d":"1.55"},{"$f":"IF(ON7>0,(((4-LOG10(ON7))+(-LOG(ON8)))/2),\"\")","v":{"v":2.535035219957706,"d":"2.54"}},null,{"$f":"IF(OP7>0,(((4-LOG10(OP7))+(-LOG(OP8)))/2),\"\")","v":{"v":1.6505149978319906,"d":"1.65"}},{"$f":"IF(OQ7>0,(((4-LOG10(OQ7))+(-LOG(OQ8)))/2),\"\")","v":{"v":2.865010161677338,"d":"2.87"}},{"v":4.080575454631372,"d":"4.08"},{"v":2.865243527891042,"d":"2.87"},{"v":4.301029995663981,"d":"4.30"},{"v":1.9604093769761877,"d":"1.96"},{"v":3.0824719491399417,"d":"3.08"},{"v":3.0824719491399417,"d":"3.08"},{"v":1.5484550065040281,"d":"1.55"},{"$f":"IF(OY7>0,(((4-LOG10(OY7))+(-LOG(OY8)))/2),\"\")","v":{"v":3.878480975656853,"d":"3.88"}},{"$f":"IF(OZ7>0,(((4-LOG10(OZ7))+(-LOG(OZ8)))/2),\"\")","v":{"v":2.8388903526330402,"d":"2.84"}},{"$f":"IF(PA7>0,(((4-LOG10(PA7))+(-LOG(PA8)))/2),\"\")","v":{"v":4.5,"d":"4.50"}},{"$f":"IF(PB7>0,(((4-LOG10(PB7))+(-LOG(PB8)))/2),\"\")","v":{"v":2.9982697339452464,"d":"3.00"}},{"v":2.455047444280301,"d":"2.46"},{"v":3.40135972093719,"d":"3.40"},{"v":2.1883753548010496,"d":"2.19"},{"v":2.006658910110247,"d":"2.01"},null,{"v":1.2407430300610562,"d":"1.24"},{"v":2.6505149978319906,"d":"2.65"},{"$f":"IF(PJ7>0,(((4-LOG10(PJ7))+(-LOG(PJ8)))/2),\"\")","v":{"v":2.610924374808178,"d":"2.61"}},{"$f":"IF(PK7>0,(((4-LOG10(PK7))+(-LOG(PK8)))/2),\"\")","v":{"v":2.890469833775569,"d":"2.89"}},null,{"$f":"IF(PM7>0,(((4-LOG10(PM7))+(-LOG(PM8)))/2),\"\")","v":{"v":2.610924374808178,"d":"2.61"}},{"$f":"IF(PN7>0,(((4-LOG10(PN7))+(-LOG(PN8)))/2),\"\")","v":{"v":2.1566818653688533,"d":"2.16"}},null,{"v":3.9119543704721593,"d":"3.91"},{"v":2.439713034397075,"d":"2.44"},null,{"v":0.9407023173881188,"d":"0.94"},{"v":4.093543321678572,"d":"4.09"},{"v":3.6338031200885155,"d":"3.63"},{"v":3,"d":"3.00"},{"v":4.4430283238465815,"d":"4.44"},{"v":1.2407430300610562,"d":"1.24"},{"$f":"IF(PY7>0,(((4-LOG10(PY7))+(-LOG(PY8)))/2),\"\")","v":{"v":3.659379381312206,"d":"3.66"}},{"$f":"IF(PZ7>0,(((4-LOG10(PZ7))+(-LOG(PZ8)))/2),\"\")","v":{"v":2.485105264584072,"d":"2.49"}},{"$f":"IF(QA7>0,(((4-LOG10(QA7))+(-LOG(QA8)))/2),\"\")","v":{"v":3.4447051448503756,"d":"3.44"}},{"v":1.3010299956639813,"d":"1.30"},{"v":1.1505149978319906,"d":"1.15"},{"v":2.799990182467421,"d":"2.80"},{"$f":"IF(QE7>0,(((4-LOG10(QE7))+(-LOG(QE8)))/2),\"\")","v":{"v":2.8388903526330402,"d":"2.84"}},{"v":1.4808886808156407,"d":"1.48"},{"v":3.40135972093719,"d":"3.40"},{"v":2.865243527891042,"d":"2.87"},null,{"$f":"IF(QJ7>0,(((4-LOG10(QJ7))+(-LOG(QJ8)))/2),\"\")","v":{"v":4.489405350465031,"d":"4.49"}},{"$f":"IF(QK7>0,(((4-LOG10(QK7))+(-LOG(QK8)))/2),\"\")","v":{"v":3.182258126592544,"d":"3.18"}},{"$f":"IF(QL7>0,(((4-LOG10(QL7))+(-LOG(QL8)))/2),\"\")","v":{"v":2.072058784981982,"d":"2.07"}},{"$f":"IF(QM7>0,(((4-LOG10(QM7))+(-LOG(QM8)))/2),\"\")","v":{"v":1.5912173152201095,"d":"1.59"}},{"v":2.06246936830415,"d":"2.06"},null,{"$f":"IF(QP7>0,(((4-LOG10(QP7))+(-LOG(QP8)))/2),\"\")","v":{"v":3.262164405837785,"d":"3.26"}},{"v":2.3873453591370684,"d":"2.39"},{"v":2.5595932038596043,"d":"2.56"},{"v":1.4132611782735025,"d":"1.41"},{"$f":"IF(QT7>0,(((4-LOG10(QT7))+(-LOG(QT8)))/2),\"\")","v":{"v":2.610924374808178,"d":"2.61"}},{"v":2.8054169578177337,"d":"2.81"},{"$f":"IF(QV7>0,(((4-LOG10(QV7))+(-LOG(QV8)))/2),\"\")","v":{"v":1.6505149978319906,"d":"1.65"}},null,{"v":1.9863251961126216,"d":"1.99"},{"$f":"IF(QY7>0,(((4-LOG10(QY7))+(-LOG(QY8)))/2),\"\")","v":{"v":1.7891980365650846,"d":"1.79"}},null,{"$f":"IF(RA7>0,(((4-LOG10(RA7))+(-LOG(RA8)))/2),\"\")","v":{"v":2.890469833775569,"d":"2.89"}},{"v":2.92539044367231,"d":"2.93"},{"$f":"IF(RC7>0,(((4-LOG10(RC7))+(-LOG(RC8)))/2),\"\")","v":{"v":1.7614393726401687,"d":"1.76"}},{"v":3.8723637474483468,"d":"3.87"},{"$f":"IF(RE7>0,(((4-LOG10(RE7))+(-LOG(RE8)))/2),\"\")","v":{"v":3.989405350465031,"d":"3.99"}},{"v":4.878480975656853,"d":"4.88"},{"$f":"IF(RG7>0,(((4-LOG10(RG7))+(-LOG(RG8)))/2),\"\")","v":{"v":4.5774509799928715,"d":"4.58"}},{"$f":"IF(RH7>0,(((4-LOG10(RH7))+(-LOG(RH8)))/2),\"\")","v":{"v":1.8729435802119663,"d":"1.87"}},{"v":3.3957793217807164,"d":"3.40"},{"v":2.784318117920506,"d":"2.78"},{"$nulls":3},{"v":3.3606231995235856,"d":"3.36"},null,{"$f":"IF(RP7>0,(((4-LOG10(RP7))+(-LOG(RP8)))/2),\"\")","v":{"v":2.9982697339452464,"d":"3.00"}},{"$f":"IF(RQ7>0,(((4-LOG10(RQ7))+(-LOG(RQ8)))/2),\"\")","v":{"v":1.4976802733851249,"d":"1.50"}},{"v":3.013898580810468,"d":"3.01"},{"v":1.6989700043360187,"d":"1.70"},{"v":3.710108201691595,"d":"3.71"},{"v":1.9397130343970748,"d":"1.94"},{"v":1.3610808334989761,"d":"1.36"},{"$f":"IF(RW7>0,(((4-LOG10(RW7))+(-LOG(RW8)))/2),\"\")","v":{"v":2.5228787452803374,"d":"2.52"}},{"v":2.7614393726401687,"d":"2.76"},{"v":2.5228787452803374,"d":"2.52"},{"v":2.5228787452803374,"d":"2.52"},{"v":2.5228787452803374,"d":"2.52"},{"v":2.5228787452803374,"d":"2.52"},{"v":2.5228787452803374,"d":"2.52"},{"v":2.513436073200151,"d":"2.51"},{"v":2.513436073200151,"d":"2.51"},{"v":2.9793036574208873,"d":"2.98"},{"v":2.784318117920506,"d":"2.78"},{"v":2.847152385544071,"d":"2.85"},null,{"$f":"IF(SJ7>0,(((4-LOG10(SJ7))+(-LOG(SJ8)))/2),\"\")","v":{"v":3.309894379144197,"d":"3.31"}},{"$f":"IF(SK7>0,(((4-LOG10(SK7))+(-LOG(SK8)))/2),\"\")","v":{"v":2.56246936830415,"d":"2.56"}},{"$f":"IF(SL7>0,(((4-LOG10(SL7))+(-LOG(SL8)))/2),\"\")","v":{"v":2.085026652029182,"d":"2.09"}},null,{"$f":"IF(SN7>0,(((4-LOG10(SN7))+(-LOG(SN8)))/2),\"\")","v":{"v":2.483288122256525,"d":"2.48"}},{"$f":"IF(SO7>0,(((4-LOG10(SO7))+(-LOG(SO8)))/2),\"\")","v":{"v":3.4447051448503756,"d":"3.44"}},{"v":2.4914833303506096,"d":"2.49"},{"$f":"IF(SQ7>0,(((4-LOG10(SQ7))+(-LOG(SQ8)))/2),\"\")","v":{"v":3.0417730257250373,"d":"3.04"}},{"v":2.799990182467421,"d":"2.80"},{"v":2.5192894529667758,"d":"2.52"},2.73,null,null,{"v":3.7819186764796218,"d":"3.78"},{"$f":"IF(SX7>0,(((4-LOG10(SX7))+(-LOG(SX8)))/2),\"\")","v":{"v":3.262164405837785,"d":"3.26"}},{"v":3.9793036574208873,"d":"3.98"},{"v":2.659379381312206,"d":"2.66"},{"$f":"IF(TA7>0,(((4-LOG10(TA7))+(-LOG(TA8)))/2),\"\")","v":{"v":1.2639510358153232,"d":"1.26"}},{"$f":"IF(TB7>0,(((4-LOG10(TB7))+(-LOG(TB8)))/2),\"\")","v":{"v":2.8239087409443187,"d":"2.82"}},{"v":3.40135972093719,"d":"3.40"},{"v":3.3606231995235856,"d":"3.36"},{"v":0.47969882994296337,"d":"0.48"},{"$f":"IF(TF7>0,(((4-LOG10(TF7))+(-LOG(TF8)))/2),\"\")","v":{"v":1.6505149978319906,"d":"1.65"}},{"$f":"IF(TG7>0,(((4-LOG10(TG7))+(-LOG(TG8)))/2),\"\")","v":{"v":1.8588929334688322,"d":"1.86"}},{"v":4.4430283238465815,"d":"4.44"},{"v":4.152259161754902,"d":"4.15"},{"$f":"IF(TJ7>0,(((4-LOG10(TJ7))+(-LOG(TJ8)))/2),\"\")","v":{"v":2.6883753548010496,"d":"2.69"}},{"v":3.9793036574208873,"d":"3.98"},{"$f":"IF(TL7>0,(((4-LOG10(TL7))+(-LOG(TL8)))/2),\"\")","v":{"v":2.1807553715226815,"d":"2.18"}},{"v":3.383501944803923,"d":"3.38"},{"v":3.2158991379665025,"d":"3.22"},{"v":3,"d":"3.00"},{"$f":"IF(TP7>0,(((4-LOG10(TP7))+(-LOG(TP8)))/2),\"\")","v":{"v":2.011138197355576,"d":"2.01"}},{"$f":"IF(TQ7>0,(((4-LOG10(TQ7))+(-LOG(TQ8)))/2),\"\")","v":{"v":3.182258126592544,"d":"3.18"}},{"v":2.847152385544071,"d":"2.85"},{"v":1.4715475743317636,"d":"1.47"},{"v":1.8315700895415952,"d":"1.83"},{"$f":"IF(TU7>0,(((4-LOG10(TU7))+(-LOG(TU8)))/2),\"\")","v":{"v":4.107335082494616,"d":"4.11"}},{"$f":"IF(TV7>0,(((4-LOG10(TV7))+(-LOG(TV8)))/2),\"\")","v":{"v":4.1419983281826,"d":"4.14"}},{"v":4.045757490560675,"d":"4.05"},null,{"$f":"IF(TY7>0,(((4-LOG10(TY7))+(-LOG(TY8)))/2),\"\")","v":{"v":4.5774509799928715,"d":"4.58"}},{"v":0.9407023173881188,"d":"0.94"},{"v":2.659379381312206,"d":"2.66"},{"v":2.9793036574208873,"d":"2.98"},{"v":2.7614393726401687,"d":"2.76"},{"v":1.6989700043360187,"d":"1.70"},{"v":3.3606231995235856,"d":"3.36"},{"v":2.926935982160881,"d":"2.93"},{"$f":"IF(UG7>0,(((4-LOG10(UG7))+(-LOG(UG8)))/2),\"\")","v":{"v":1.5643887216201464,"d":"1.56"}},{"v":2.006658910110247,"d":"2.01"},{"v":2.455047444280301,"d":"2.46"},null,{"v":2.854982694318741,"d":"2.85"},null,{"v":0.17281545451235725,"d":"0.17"},{"v":2.240743030061056,"d":"2.24"},null,{"v":2,"d":"2.00"},{"v":3.013898580810468,"d":"3.01"},{"v":1.448783147159332,"d":"1.45"},{"$f":"IF(US7>0,(((4-LOG10(US7))+(-LOG(US8)))/2),\"\")","v":{"v":4.70446769648675,"d":"4.70"}},{"v":2.210108201691595,"d":"2.21"},{"v":1.6298186552528782,"d":"1.63"},{"v":1.6076913536835624,"d":"1.61"},{"v":2.483288122256525,"d":"2.48"},{"v":2.659379381312206,"d":"2.66"},{"$f":"IF(UY7>0,(((4-LOG10(UY7))+(-LOG(UY8)))/2),\"\")","v":{"v":5.18837535480105,"d":"5.19"}},{"$f":"IF(UZ7>0,(((4-LOG10(UZ7))+(-LOG(UZ8)))/2),\"\")","v":{"v":2.483288122256525,"d":"2.48"}},{"v":4.152259161754902,"d":"4.15"},null,{"$f":"IF(VC7>0,(((4-LOG10(VC7))+(-LOG(VC8)))/2),\"\")","v":{"v":4.70446769648675,"d":"4.70"}},{"v":0.9407023173881188,"d":"0.94"},{"v":2.4914833303506096,"d":"2.49"},null,{"$f":"IF(VG7>0,(((4-LOG10(VG7))+(-LOG(VG8)))/2),\"\")","v":{"v":1.8516674048692345,"d":"1.85"}},{"v":3.013898580810468,"d":"3.01"},null,null,{"$f":"IF(VK7>0,(((4-LOG10(VK7))+(-LOG(VK8)))/2),\"\")","v":{"v":1.6968093174446974,"d":"1.70"}},{"v":4.878480975656853,"d":"4.88"},{"$f":"IF(VM7>0,(((4-LOG10(VM7))+(-LOG(VM8)))/2),\"\")","v":{"v":3.093543321678572,"d":"3.09"}},{"$f":"IF(VN7>0,(((4-LOG10(VN7))+(-LOG(VN8)))/2),\"\")","v":{"v":3.093543321678572,"d":"3.09"}},{"v":2.847152385544071,"d":"2.85"},{"v":2.847152385544071,"d":"2.85"},{"$f":"IF(VQ7>0,(((4-LOG10(VQ7))+(-LOG(VQ8)))/2),\"\")","v":{"v":3.093543321678572,"d":"3.09"}},{"v":2.842014827271541,"d":"2.84"},{"v":2.0277586639249154,"d":"2.03"},{"$f":"IF(VT7>0,(((4-LOG10(VT7))+(-LOG(VT8)))/2),\"\")","v":{"v":4.5,"d":"4.50"}},{"v":3.4436974992327123,"d":"3.44"},{"v":2.6505149978319906,"d":"2.65"},{"$f":"IF(VW7>0,(((4-LOG10(VW7))+(-LOG(VW8)))/2),\"\")","v":{"v":2.5088643834802156,"d":"2.51"}},{"$f":"IF(VX7>0,(((4-LOG10(VX7))+(-LOG(VX8)))/2),\"\")","v":{"v":4.70446769648675,"d":"4.70"}},{"$f":"IF(VY7>0,(((4-LOG10(VY7))+(-LOG(VY8)))/2),\"\")","v":{"v":4.70446769648675,"d":"4.70"}},{"v":3.7819186764796218,"d":"3.78"},{"v":2.240743030061056,"d":"2.24"},{"v":2.439713034397075,"d":"2.44"},{"v":2.439713034397075,"d":"2.44"},{"$f":"IF(WD7>0,(((4-LOG10(WD7))+(-LOG(WD8)))/2),\"\")","v":{"v":2.610924374808178,"d":"2.61"}},{"v":1.6076913536835624,"d":"1.61"},{"v":3.210108201691595,"d":"3.21"},{"v":4.093543321678572,"d":"4.09"},{"v":2,"d":"2.00"},{"v":2.006658910110247,"d":"2.01"},{"$f":"IF(WJ7>0,(((4-LOG10(WJ7))+(-LOG(WJ8)))/2),\"\")","v":{"v":1.8428030213890185,"d":"1.84"}},{"$f":"IF(WK7>0,(((4-LOG10(WK7))+(-LOG(WK8)))/2),\"\")","v":{"v":4.809894379144197,"d":"4.81"}},{"$f":"IF(WL7>0,(((4-LOG10(WL7))+(-LOG(WL8)))/2),\"\")","v":{"v":3.0277586639249154,"d":"3.03"}},{"$f":"IF(WM7>0,(((4-LOG10(WM7))+(-LOG(WM8)))/2),\"\")","v":{"v":3.0277586639249154,"d":"3.03"}},{"$f":"IF(WN7>0,(((4-LOG10(WN7))+(-LOG(WN8)))/2),\"\")","v":{"v":2.7218487496163566,"d":"2.72"}},{"v":2.882235776546225,"d":"2.88"},{"$f":"IF(WP7>0,(((4-LOG10(WP7))+(-LOG(WP8)))/2),\"\")","v":{"v":2.5563601827349887,"d":"2.56"}},{"v":3.765826334793921,"d":"3.77"},{"$f":"IF(WR7>0,(((4-LOG10(WR7))+(-LOG(WR8)))/2),\"\")","v":{"v":2.629818655252878,"d":"2.63"}},{"$f":"IF(WS7>0,(((4-LOG10(WS7))+(-LOG(WS8)))/2),\"\")","v":{"v":2.0226376045104684,"d":"2.02"}},{"v":1.7440583195105628,"d":"1.74"},{"$f":"IF(WU7>0,(((4-LOG10(WU7))+(-LOG(WU8)))/2),\"\")","v":{"v":1.3106194123418133,"d":"1.31"}},{"v":2.784318117920506,"d":"2.78"},{"v":2.4914833303506096,"d":"2.49"},{"v":2.926935982160881,"d":"2.93"},{"v":2.0277586639249154,"d":"2.03"},{"v":3.383501944803923,"d":"3.38"},{"v":2.5595932038596043,"d":"2.56"},{"v":1.3979400086720377,"d":"1.40"},null,{"$f":"IF(XD7>0,(((4-LOG10(XD7))+(-LOG(XD8)))/2),\"\")","v":{"v":3.600329725273209,"d":"3.60"}},{"v":2.0277586639249154,"d":"2.03"},{"$f":"IF(XF7>0,(((4-LOG10(XF7))+(-LOG(XF8)))/2),\"\")","v":{"v":1.292513326014591,"d":"1.29"}},{"v":2.240743030061056,"d":"2.24"},{"$f":"IF(XH7>0,(((4-LOG10(XH7))+(-LOG(XH8)))/2),\"\")","v":{"v":2,"d":"2.00"}},{"v":3.6220625721637543,"d":"3.62"},{"v":4.045757490560675,"d":"4.05"},{"v":1.9863251961126216,"d":"1.99"},null,{"$f":"IF(XM7>0,(((4-LOG10(XM7))+(-LOG(XM8)))/2),\"\")","v":{"v":2.7044676964867502,"d":"2.70"}},{"v":2.513436073200151,"d":"2.51"},{"$f":"IF(XO7>0,(((4-LOG10(XO7))+(-LOG(XO8)))/2),\"\")","v":{"v":2.772577569995745,"d":"2.77"}},{"v":3.3287886595888967,"d":"3.33"},{"$f":"IF(XQ7>0,(((4-LOG10(XQ7))+(-LOG(XQ8)))/2),\"\")","v":{"v":1.2673085742757908,"d":"1.27"}},{"$f":"IF(XR7>0,(((4-LOG10(XR7))+(-LOG(XR8)))/2),\"\")","v":{"v":2.772577569995745,"d":"2.77"}},{"v":3.765826334793921,"d":"3.77"},{"v":1.9397130343970748,"d":"1.94"},{"v":1.610924374808178,"d":"1.61"},null,{"$f":"IF(XW7>0,(((4-LOG10(XW7))+(-LOG(XW8)))/2),\"\")","v":{"v":2.5228787452803374,"d":"2.52"}},null,{"v":1.4715475743317636,"d":"1.47"},{"$f":"IF(XZ7>0,(((4-LOG10(XZ7))+(-LOG(XZ8)))/2),\"\")","v":{"v":2.5704308513527345,"d":"2.57"}},{"v":5.34518491628705,"d":"5.35"},{"v":2.3873453591370684,"d":"2.39"},{"v":2.006658910110247,"d":"2.01"},{"v":2.513436073200151,"d":"2.51"},{"$f":"IF(YE7>0,(((4-LOG10(YE7))+(-LOG(YE8)))/2),\"\")","v":{"v":2.96479633912994,"d":"2.96"}},{"v":2.210108201691595,"d":"2.21"},{"$f":"IF(YG7>0,(((4-LOG10(YG7))+(-LOG(YG8)))/2),\"\")","v":{"v":4.121301985603488,"d":"4.12"}},{"v":2.4498147274412183,"d":"2.45"},{"v":3.0824719491399417,"d":"3.08"},{"$f":"IF(YJ7>0,(((4-LOG10(YJ7))+(-LOG(YJ8)))/2),\"\")","v":{"v":3.080575454631372,"d":"3.08"}},{"v":4.522878745280337,"d":"4.52"},{"v":4.4430283238465815,"d":"4.44"},{"v":3.383501944803923,"d":"3.38"},{"$f":"IF(YN7>0,(((4-LOG10(YN7))+(-LOG(YN8)))/2),\"\")","v":{"v":2.8675910884952316,"d":"2.87"}},null,{"v":1.5,"d":"1.50"},{"v":3.765826334793921,"d":"3.77"},{"$f":"IF(YR7>0,(((4-LOG10(YR7))+(-LOG(YR8)))/2),\"\")","v":{"v":2.7703037561203843,"d":"2.77"}},null,{"v":2.513436073200151,"d":"2.51"},{"$f":"IF(YU7>0,(((4-LOG10(YU7))+(-LOG(YU8)))/2),\"\")","v":{"v":2.093543321678572,"d":"2.09"}},null,{"v":1.2407430300610562,"d":"1.24"},{"v":3.6220625721637543,"d":"3.62"},{"v":3.6220625721637543,"d":"3.62"},{"v":2.842014827271541,"d":"2.84"},{"v":2.240743030061056,"d":"2.24"},{"$f":"IF(ZB7>0,(((4-LOG10(ZB7))+(-LOG(ZB8)))/2),\"\")","v":{"v":2.072058784981982,"d":"2.07"}},{"$f":"IF(ZC7>0,(((4-LOG10(ZC7))+(-LOG(ZC8)))/2),\"\")","v":{"v":2.548455006504028,"d":"2.55"}}]
["14.8 - Koc",null,242,{"v":1073,"d":"1,073"},{"v":6631,"d":"6,631"},30,{"v":39.5,"d":"40"},72,72,72,200,156,null,null,744,{"v":9315,"d":"9,315"},{"v":56.2,"d":"56"},null,620,866,null,589,304,{"v":73.88,"d":"74"},335,335,null,{"v":288735,"d":"288,735"},null,{"v":1000,"d":"1,000"},85,301,364,{"v":30714,"d":"30,714"},{"v":156250,"d":"156,250"},{"v":89.6,"d":"90"},316,316,30,242,null,589,{"v":1000,"d":"1,000"},{"v":6631,"d":"6,631"},{"v":11.6,"d":"12"},{"v":9629,"d":"9,629"},null,{"v":26062,"d":"26,062"},{"v":5363,"d":"5,363"},364,965,null,null,{"v":1E-4,"d":"0"},364,null,null,{"v":20800,"d":"20,800"},null,174,174,130,174,700,null,866,80,72,{"v":4483,"d":"4,483"},null,null,{"v":73.8,"d":"74"},589,589,86,10,750,{"v":25.2,"d":"25"},{"v":2197,"d":"2,197"},null,{"v":4998,"d":"4,998"},225,241,{"v":9100,"d":"9,100"},{"v":9100,"d":"9,100"},86,{"v":245.2,"d":"245"},null,null,{"v":64300,"d":"64,300"},null,{"v":236610,"d":"236,610"},{"v":236610,"d":"236,610"},169,null,null,{"v":236610,"d":"236,610"},{"v":37480,"d":"37,480"},{"v":21175,"d":"21,175"},null,{"v":35660,"d":"35,660"},43,772,772,{"v":25.2,"d":"25"},32,null,872,{"v":64300,"d":"64,300"},{"v":17.8,"d":"18"},{"v":5363,"d":"5,363"},80,null,112,null,13,772,200,200,{"v":1.4,"d":"1"},{"v":236610,"d":"236,610"},300,225,225,{"v":1.6,"d":"2"},225,null,{"v":99.4,"d":"99"},866,null,null,{"v":157643,"d":"157,643"},null,{"v":8151,"d":"8,151"},72,205,388,{"v":22.7,"d":"23"},220,850,{"v":2967,"d":"2,967"},700,{"v":63300,"d":"63,300"},null,241,null,null,{"v":1440,"d":"1,440"},239,{"v":173900,"d":"173,900"},null,{"v":156250,"d":"156,250"},364,null,409,106,{"v":22.7,"d":"23"},null,300,30,301,{"v":12000,"d":"12,000"},{"v":20800,"d":"20,800"},null,106,106,106,850,{"v":8151,"d":"8,151"},123,{"v":9315,"d":"9,315"},{"v":156250,"d":"156,250"},220,872,225,{"v":12000,"d":"12,000"},125,{"v":21175,"d":"21,175"},500,174,769,225,{"v":56.2,"d":"56"},850,{"v":41182,"d":"41,182"},{"v":2016,"d":"2,016"},850,850,850,{"v":35660,"d":"35,660"},10,{"v":10240000,"d":"10,240,000"},{"v":3627,"d":"3,627"},{"v":10240000,"d":"10,240,000"},301,225,225,{"v":43546,"d":"43,546"},{"v":2184750,"d":"2,184,750"},"-",{"v":1000000,"d":"1,000,000"},90,{"v":3760,"d":"3,760"},{"v":4620,"d":"4,620"},{"v":4620,"d":"4,620"},{"$nulls":3},{"v":4620,"d":"4,620"},30,26,{"v":2185000,"d":"2,185,000"},{"v":1067,"d":"1,067"},998,{"v":3627,"d":"3,627"},{"v":1067,"d":"1,067"},242,86,{"v":4236500,"d":"4,236,500"},{"v":4236500,"d":"4,236,500"},{"v":10000,"d":"10,000"},{"v":226.1,"d":"226"},769,589,{"v":17757,"d":"17,757"},{"v":1152,"d":"1,152"},{"v":56.2,"d":"56"},{"v":31037,"d":"31,037"},null,{"v":1950,"d":"1,950"},{"v":1073,"d":"1,073"},null,{"v":3847,"d":"3,847"},{"v":78.4,"d":"78"},null,{"v":251717,"d":"251,717"},{"v":22836,"d":"22,836"},null,{"v":31037,"d":"31,037"},{"v":30900,"d":"30,900"},{"v":17757,"d":"17,757"},null,134,{"v":1000,"d":"1,000"},72,{"v":22836,"d":"22,836"},{"v":40.8,"d":"41"},174,174,50,{"v":3847,"d":"3,847"},600,{"v":288735,"d":"288,735"},388,{"v":2000,"d":"2,000"},{"v":11354,"d":"11,354"},null,null,{"v":35660,"d":"35,660"},null,{"v":59677,"d":"59,677"},{"v":100000,"d":"100,000"},600,727,{"v":3760,"d":"3,760"},{"v":46.2,"d":"46"},228,{"v":2287,"d":"2,287"},{"v":1.6,"d":"2"},{"v":105.2,"d":"105"},{"v":3394,"d":"3,394"},220,{"v":2197,"d":"2,197"},{"v":145600,"d":"145,600"},{"v":157643,"d":"157,643"},28,30,889,889,null,null,{"v":98.4,"d":"98"},null,{"v":1E-4,"d":"0"},null,205,728,769,304,304,228,{"v":78.4,"d":"78"},241,{"$nulls":3},{"v":3534,"d":"3,534"},239,{"v":2556,"d":"2,556"},220,225,850,{"v":156250,"d":"156,250"},769,228,{"v":3394,"d":"3,394"},{"v":1.4,"d":"1"},{"v":4998,"d":"4,998"},{"v":9598,"d":"9,598"},{"v":59677,"d":"59,677"},{"v":41182,"d":"41,182"},{"v":105.2,"d":"105"},null,400,316,174,134,850,{"v":28700,"d":"28,700"},600,{"v":28700,"d":"28,700"},{"v":7566,"d":"7,566"},{"v":1000000,"d":"1,000,000"},{"v":1100,"d":"1,100"},{"v":73.8,"d":"74"},{"v":1417,"d":"1,417"},109,null,null,{"v":37480,"d":"37,480"},null,20,{"v":17491,"d":"17,491"},316,{"v":156250,"d":"156,250"},54,54,null,{"v":12000,"d":"12,000"},{"v":3104,"d":"3,104"},45,850,{"v":4753,"d":"4,753"},{"v":4753,"d":"4,753"},{"v":11.6,"d":"12"},137,125,{"v":17.96,"d":"18"},52,{"v":13120,"d":"13,120"},225,{"v":3534,"d":"3,534"},205,null,{"v":26062,"d":"26,062"},{"v":1000,"d":"1,000"},{"v":4483,"d":"4,483"},null,{"v":236610,"d":"236,610"},402,{"v":1440,"d":"1,440"},45,null,700,850,null,145,{"v":2252,"d":"2,252"},{"v":10240000,"d":"10,240,000"},{"v":10240000,"d":"10,240,000"},156,null,{"v":157450,"d":"157,450"},{"v":1067,"d":"1,067"},null,{"v":46.2,"d":"46"},{"v":352.5,"d":"353"},null,43,{"v":8151,"d":"8,151"},32,{"v":1950,"d":"1,950"},335,{"v":10000,"d":"10,000"},{"v":157450,"d":"157,450"},{"v":25.2,"d":"25"},{"v":1.4,"d":"1"},80,600,620,{"v":8151,"d":"8,151"},{"v":41182,"d":"41,182"},{"v":4753,"d":"4,753"},54,217,{"v":13120,"d":"13,120"},998,998,null,998,null,{"v":41182,"d":"41,182"},{"v":78.9,"d":"79"},{"v":145600,"d":"145,600"},26,{"v":73.88,"d":"74"},null,{"v":35660,"d":"35,660"},200,{"v":3104,"d":"3,104"},112,{"v":30714,"d":"30,714"},{"v":30714,"d":"30,714"},{"v":78.9,"d":"79"},{"v":17.8,"d":"18"},null,400,{"v":903012,"d":"903,012"},{"v":226.1,"d":"226"},{"v":25.2,"d":"25"},402,{"v":37.92,"d":"38"},{"v":1000,"d":"1,000"},{"v":39.5,"d":"40"},517,null,null,{"v":3500000,"d":"3,500,000"},{"$nulls":3},{"v":10000,"d":"10,000"},769,null,30,{"v":26062,"d":"26,062"},217,{"v":9598,"d":"9,598"},{"v":8151,"d":"8,151"},{"v":39.5,"d":"40"},{"v":30900,"d":"30,900"},{"v":173900,"d":"173,900"},null,{"v":17.96,"d":"18"},137,{"v":1073,"d":"1,073"},null,728,72,200,{"v":352.5,"d":"353"},null,{"v":3200,"d":"3,200"},{"v":165.4,"d":"165"},{"v":1000,"d":"1,000"},{"v":7566,"d":"7,566"},30,477,106,{"v":1000000,"d":"1,000,000"},600,null,{"v":17491,"d":"17,491"},{"v":73.2,"d":"73"},{"v":100000,"d":"100,000"},750,13,965,null,{"v":3394,"d":"3,394"},null,{"v":9315,"d":"9,315"},{"v":12000,"d":"12,000"},{"v":251717,"d":"251,717"},null,null,{"v":1100,"d":"1,100"},{"v":21175,"d":"21,175"},null,223,75,{"v":11354,"d":"11,354"},{"v":43546,"d":"43,546"},{"v":903012,"d":"903,012"},123,43,{"v":22.7,"d":"23"},{"v":9100,"d":"9,100"},{"v":15800,"d":"15,800"},301,374,28,174,174,174,174,174,589,589,{"v":3760,"d":"3,760"},{"v":21175,"d":"21,175"},378,null,{"v":2016,"d":"2,016"},null,null,400,149,null,{"v":2252,"d":"2,252"},null,{"v":1073,"d":"1,073"},{"v":2556,"d":"2,556"},145,{"v":1000,"d":"1,000"},50,{"v":1816,"d":"1,816"},477,30,866,"-",null,72,{"v":11354,"d":"11,354"},{"v":11.6,"d":"12"},{"v":73.2,"d":"73"},300,{"v":8151,"d":"8,151"},727,{"v":2185000,"d":"2,185,000"},30,null,{"v":9629,"d":"9,629"},998,{"v":9598,"d":"9,598"},null,{"v":3200,"d":"3,200"},378,{"v":28700,"d":"28,700"},700,744,null,{"v":17757,"d":"17,757"},20,null,30,866,{"v":3760,"d":"3,760"},28,{"v":22.7,"d":"23"},{"v":11354,"d":"11,354"},{"v":1.4,"d":"1"},109,{"v":37.92,"d":"38"},{"v":226.1,"d":"226"},75,300,130,{"v":98.4,"d":"98"},205,null,66,43,225,{"v":236610,"d":"236,610"},364,90,80,772,866,{"v":59677,"d":"59,677"},149,727,null,{"v":236610,"d":"236,610"},30,{"v":2252,"d":"2,252"},null,{"v":9500,"d":"9,500"},43,{"v":3500000,"d":"3,500,000"},85,{"v":40.8,"d":"41"},{"v":251717,"d":"251,717"},{"v":2000,"d":"2,000"},{"v":2000,"d":"2,000"},378,378,{"v":2000,"d":"2,000"},889,220,400,156,517,null,{"v":236610,"d":"236,610"},{"v":236610,"d":"236,610"},{"v":1816,"d":"1,816"},205,769,769,null,80,225,{"v":26062,"d":"26,062"},66,{"v":37.92,"d":"38"},null,500,null,null,{"v":1000,"d":"1,000"},{"v":1152,"d":"1,152"},{"v":1417,"d":"1,417"},{"v":2967,"d":"2,967"},{"v":3983,"d":"3,983"},null,{"v":56.2,"d":"56"},null,{"v":21175,"d":"21,175"},{"v":2252,"d":"2,252"},{"v":1.4,"d":"1"},220,{"v":9629,"d":"9,629"},{"v":1000000,"d":"1,000,000"},54,{"v":63300,"d":"63,300"},null,220,null,205,{"v":245.2,"d":"245"},850,{"v":17757,"d":"17,757"},750,169,null,589,{"v":1373,"d":"1,373"},{"v":2287,"d":"2,287"},null,{"v":1373,"d":"1,373"},{"v":2967,"d":"2,967"},{"v":15800,"d":"15,800"},409,null,374,null,{"v":28700,"d":"28,700"},null,{"v":64300,"d":"64,300"},106,{"v":37.92,"d":"38"},589,null,364,null,241,{"v":30714,"d":"30,714"},null,{"v":6631,"d":"6,631"},{"v":8151,"d":"8,151"},{"v":9629,"d":"9,629"},{"v":99.4,"d":"99"},null,86,{"v":2967,"d":"2,967"},null,223,589,{"v":89.6,"d":"90"},52,{"v":39.5,"d":"40"},850,850,889,205,{"v":165.4,"d":"165"},{"v":1224,"d":"1,224"}]
["14.9 - t1/2 (DT50)",null,{"v":10,"d":"10.0"},{"v":354,"d":"354.0"},{"v":30,"d":"30.0"},{"v":26,"d":"26.0"},{"v":10,"d":"10.0"},{"v":7,"d":"7.0"},{"v":7,"d":"7.0"},{"v":7,"d":"7.0"},1.6,{"v":14,"d":"14.0"},null,{"v":59,"d":"59.0"},39.2,{"v":32,"d":"32.0"},{"v":50,"d":"50.0"},11.6,{"v":48,"d":"48.0"},{"v":1,"d":"1.0"},8.8,{"v":78,"d":"78.0"},4.7,{"v":12.07,"d":"12.1"},{"v":14,"d":"14.0"},{"v":14,"d":"14.0"},{"v":908,"d":"908.0"},{"v":23,"d":"23.0"},0.1,{"v":150,"d":"150.0"},{"v":24,"d":"24.0"},{"v":597,"d":"597.0"},{"v":142,"d":"142.0"},{"v":141,"d":"141.0"},{"v":60,"d":"60.0"},1.8,{"v":37,"d":"37.0"},{"v":37,"d":"37.0"},{"v":21,"d":"21.0"},{"v":10,"d":"10.0"},{"v":35,"d":"35.0"},{"v":78,"d":"78.0"},0.2,{"v":30,"d":"30.0"},200.2,{"v":4.89,"d":"4.9"},4.3,{"v":92,"d":"92.0"},55.4,{"v":142,"d":"142.0"},24.4,{"v":10,"d":"10.0"},1.5,13.1,{"v":142,"d":"142.0"},3.2,3.2,{"v":90,"d":"90.0"},{"v":350,"d":"350.0"},{"v":75,"d":"75.0"},{"v":75,"d":"75.0"},{"v":60,"d":"60.0"},{"v":75,"d":"75.0"},3.7,{"v":8,"d":"8.0"},{"v":1,"d":"1.0"},{"v":400,"d":"400.0"},{"v":7,"d":"7.0"},113.2,null,null,{"v":64,"d":"64.0"},{"v":78,"d":"78.0"},{"v":78,"d":"78.0"},{"v":13,"d":"13.0"},{"v":0.52,"d":"0.5"},{"v":250,"d":"250.0"},{"v":7,"d":"7.0"},{"v":8,"d":"8.0"},{"v":268,"d":"268.0"},33.2,{"v":40,"d":"40.0"},34.4,0.5,0.5,{"v":13,"d":"13.0"},13.8,null,{"v":908,"d":"908.0"},{"v":13,"d":"13.0"},0.1,{"v":26,"d":"26.0"},{"v":26,"d":"26.0"},{"v":450,"d":"450.0"},null,{"v":13,"d":"13.0"},{"v":26,"d":"26.0"},80.5,{"v":10,"d":"10.0"},{"v":59,"d":"59.0"},{"v":34,"d":"34.0"},{"v":541,"d":"541.0"},{"v":200,"d":"200.0"},{"v":200,"d":"200.0"},{"v":7,"d":"7.0"},{"v":60,"d":"60.0"},null,{"v":190,"d":"190.0"},{"v":13,"d":"13.0"},{"v":7,"d":"7.0"},55.4,{"v":400,"d":"400.0"},{"v":38,"d":"38.0"},19.6,{"v":0.88,"d":"0.9"},{"v":23,"d":"23.0"},{"v":200,"d":"200.0"},0.8,0.8,{"v":0.67,"d":"0.7"},{"v":26,"d":"26.0"},{"v":16,"d":"16.0"},{"v":40,"d":"40.0"},{"v":40,"d":"40.0"},3.1,{"v":40,"d":"40.0"},{"v":21,"d":"21.0"},0.5,{"v":1,"d":"1.0"},null,null,{"v":42,"d":"42.0"},null,{"v":50,"d":"50.0"},{"v":7,"d":"7.0"},{"v":1358,"d":"1,358.0"},8.5,{"v":0.55,"d":"0.6"},0.5,{"v":22,"d":"22.0"},{"v":22,"d":"22.0"},3.7,{"v":4,"d":"4.0"},{"v":5,"d":"5.0"},34.4,{"v":10,"d":"10.0"},{"v":1161,"d":"1,161.0"},{"v":15,"d":"15.0"},{"v":13,"d":"13.0"},{"v":9,"d":"9.0"},1.7,{"v":60,"d":"60.0"},{"v":142,"d":"142.0"},{"v":37,"d":"37.0"},{"v":93,"d":"93.0"},{"v":40,"d":"40.0"},{"v":0.55,"d":"0.6"},0.8,22.6,{"v":11,"d":"11.0"},{"v":597,"d":"597.0"},1.4,{"v":90,"d":"90.0"},39.3,{"v":40,"d":"40.0"},{"v":40,"d":"40.0"},{"v":40,"d":"40.0"},{"v":22,"d":"22.0"},{"v":50,"d":"50.0"},{"v":545,"d":"545.0"},{"v":32,"d":"32.0"},{"v":60,"d":"60.0"},{"v":11,"d":"11.0"},{"v":190,"d":"190.0"},{"v":191,"d":"191.0"},{"v":10000,"d":"10,000.0"},{"v":11,"d":"11.0"},{"v":10,"d":"10.0"},{"v":8,"d":"8.0"},{"v":75,"d":"75.0"},{"v":63,"d":"63.0"},{"v":191,"d":"191.0"},{"v":50,"d":"50.0"},{"v":22,"d":"22.0"},16.3,{"v":7,"d":"7.0"},{"v":22,"d":"22.0"},{"v":22,"d":"22.0"},{"v":22,"d":"22.0"},{"v":34,"d":"34.0"},{"v":0.52,"d":"0.5"},{"v":13,"d":"13.0"},10.5,{"v":13,"d":"13.0"},{"v":597,"d":"597.0"},{"v":40,"d":"40.0"},{"v":40,"d":"40.0"},0.5,{"v":2345,"d":"2,345.0"},{"v":9.62,"d":"9.6"},{"v":3000,"d":"3,000.0"},{"v":49,"d":"49.0"},{"v":130,"d":"130.0"},{"v":3,"d":"3.0"},{"v":3,"d":"3.0"},2.5,72.7,2.5,{"v":3,"d":"3.0"},{"v":21,"d":"21.0"},{"v":82,"d":"82.0"},{"v":2345,"d":"2,345.0"},75.5,0.1,10.5,75.5,{"v":10,"d":"10.0"},{"v":13,"d":"13.0"},4.7,4.7,{"v":4,"d":"4.0"},{"v":15,"d":"15.0"},{"v":63,"d":"63.0"},{"v":78,"d":"78.0"},{"v":11,"d":"11.0"},{"v":61,"d":"61.0"},{"v":50,"d":"50.0"},{"v":7,"d":"7.0"},6.5,{"v":30,"d":"30.0"},{"v":354,"d":"354.0"},1.7,41.1,25.4,50.9,66.6,16.1,null,{"v":7,"d":"7.0"},4.1,{"v":11,"d":"11.0"},null,{"v":18,"d":"18.0"},{"v":20,"d":"20.0"},{"v":7,"d":"7.0"},16.1,2.2,{"v":75,"d":"75.0"},{"v":75,"d":"75.0"},{"v":450,"d":"450.0"},41.1,7.4,{"v":23,"d":"23.0"},8.5,2.7,0.4,99.6,135.1,{"v":34,"d":"34.0"},{"v":35,"d":"35.0"},26.8,{"v":13,"d":"13.0"},7.4,{"v":142,"d":"142.0"},{"v":130,"d":"130.0"},41.2,{"v":86,"d":"86.0"},{"v":0.34,"d":"0.3"},3.1,39.8,{"v":1,"d":"1.0"},{"v":11,"d":"11.0"},{"v":8,"d":"8.0"},{"v":164,"d":"164.0"},{"v":42,"d":"42.0"},{"v":45,"d":"45.0"},2.5,21.9,21.9,{"v":271,"d":"271.0"},{"v":309,"d":"309.0"},57.1,{"v":350,"d":"350.0"},13.1,{"v":400,"d":"400.0"},{"v":1358,"d":"1,358.0"},{"v":183,"d":"183.0"},{"v":63,"d":"63.0"},4.7,4.7,{"v":86,"d":"86.0"},25.4,34.4,72.7,0.1,null,3.2,{"v":13,"d":"13.0"},0.5,{"v":11,"d":"11.0"},{"v":40,"d":"40.0"},{"v":22,"d":"22.0"},{"v":60,"d":"60.0"},{"v":63,"d":"63.0"},{"v":86,"d":"86.0"},{"v":1,"d":"1.0"},{"v":0.67,"d":"0.7"},33.2,{"v":72,"d":"72.0"},26.8,16.3,39.8,null,{"v":41,"d":"41.0"},{"v":37,"d":"37.0"},{"v":75,"d":"75.0"},{"v":18,"d":"18.0"},{"v":22,"d":"22.0"},{"v":12,"d":"12.0"},7.4,{"v":12,"d":"12.0"},{"v":35,"d":"35.0"},{"v":3000,"d":"3,000.0"},{"v":39,"d":"39.0"},{"v":64,"d":"64.0"},1.3,26.7,0.5,{"v":10,"d":"10.0"},80.5,{"v":1161,"d":"1,161.0"},null,182.3,{"v":37,"d":"37.0"},{"v":60,"d":"60.0"},{"v":105,"d":"105.0"},{"v":105,"d":"105.0"},{"v":30,"d":"30.0"},{"v":10000,"d":"10,000.0"},{"v":26,"d":"26.0"},2.7,{"v":22,"d":"22.0"},76.3,76.3,200.2,{"v":120,"d":"120.0"},{"v":11,"d":"11.0"},{"v":60,"d":"60.0"},{"v":90,"d":"90.0"},{"v":15,"d":"15.0"},{"v":191,"d":"191.0"},3.2,{"v":1358,"d":"1,358.0"},null,{"v":92,"d":"92.0"},{"v":150,"d":"150.0"},113.2,39.3,{"v":26,"d":"26.0"},{"v":146,"d":"146.0"},{"v":15,"d":"15.0"},2.7,{"v":50,"d":"50.0"},3.7,{"v":22,"d":"22.0"},37.1,0.9,{"v":214,"d":"214.0"},{"v":13,"d":"13.0"},{"v":13,"d":"13.0"},{"v":14,"d":"14.0"},0.1,{"v":25,"d":"25.0"},75.5,null,41.2,12.5,37.1,{"v":541,"d":"541.0"},{"v":50,"d":"50.0"},{"v":60,"d":"60.0"},{"v":30,"d":"30.0"},{"v":14,"d":"14.0"},{"v":4,"d":"4.0"},{"v":25,"d":"25.0"},{"v":7,"d":"7.0"},{"v":0.67,"d":"0.7"},{"v":400,"d":"400.0"},7.4,{"v":48,"d":"48.0"},{"v":50,"d":"50.0"},16.3,76.3,{"v":105,"d":"105.0"},{"v":0.17,"d":"0.2"},{"v":15,"d":"15.0"},0.1,0.1,49.1,0.1,{"v":21,"d":"21.0"},16.3,6.5,{"v":164,"d":"164.0"},{"v":82,"d":"82.0"},{"v":12.07,"d":"12.1"},{"v":268,"d":"268.0"},{"v":34,"d":"34.0"},0.8,{"v":26,"d":"26.0"},19.6,{"v":141,"d":"141.0"},{"v":141,"d":"141.0"},6.5,{"v":7,"d":"7.0"},142.2,{"v":10,"d":"10.0"},1.3,{"v":15,"d":"15.0"},{"v":7,"d":"7.0"},{"v":146,"d":"146.0"},11.5,{"v":150,"d":"150.0"},{"v":10,"d":"10.0"},{"v":560,"d":"560.0"},{"v":400,"d":"400.0"},{"v":2416,"d":"2,416.0"},null,82.4,{"v":400,"d":"400.0"},null,{"v":4,"d":"4.0"},{"v":63,"d":"63.0"},null,{"v":26,"d":"26.0"},{"v":92,"d":"92.0"},{"v":0.17,"d":"0.2"},{"v":72,"d":"72.0"},{"v":50,"d":"50.0"},{"v":10,"d":"10.0"},4.1,{"v":9,"d":"9.0"},{"v":56,"d":"56.0"},{"v":60,"d":"60.0"},{"v":120,"d":"120.0"},{"v":354,"d":"354.0"},142.2,{"v":183,"d":"183.0"},{"v":7,"d":"7.0"},0.8,12.5,135.1,{"v":502,"d":"502.0"},121.2,0.1,{"v":35,"d":"35.0"},{"v":11,"d":"11.0"},0.2,{"v":40,"d":"40.0"},{"v":3000,"d":"3,000.0"},7.4,82.4,182.3,21.7,{"v":13,"d":"13.0"},{"v":250,"d":"250.0"},{"v":23,"d":"23.0"},24.4,{"v":2416,"d":"2,416.0"},{"v":1,"d":"1.0"},{"v":5,"d":"5.0"},{"v":32,"d":"32.0"},1.4,66.6,{"v":55,"d":"55.0"},50.9,{"v":39,"d":"39.0"},{"v":10,"d":"10.0"},{"v":60,"d":"60.0"},{"v":22,"d":"22.0"},1.2,0.4,0.5,1.3,{"v":545,"d":"545.0"},{"v":541,"d":"541.0"},{"v":0.55,"d":"0.6"},0.5,{"v":181,"d":"181.0"},{"v":597,"d":"597.0"},{"v":237,"d":"237.0"},{"v":45,"d":"45.0"},{"v":75,"d":"75.0"},{"v":75,"d":"75.0"},{"v":75,"d":"75.0"},{"v":75,"d":"75.0"},{"v":75,"d":"75.0"},{"v":78,"d":"78.0"},{"v":78,"d":"78.0"},{"v":130,"d":"130.0"},{"v":10,"d":"10.0"},{"v":7,"d":"7.0"},null,{"v":7,"d":"7.0"},{"v":8,"d":"8.0"},99.6,{"v":41,"d":"41.0"},0.4,{"v":56,"d":"56.0"},{"v":214,"d":"214.0"},4.3,{"v":354,"d":"354.0"},0.5,0.9,{"v":150,"d":"150.0"},{"v":450,"d":"450.0"},{"v":2,"d":"2.0"},0.2,2.5,{"v":1,"d":"1.0"},{"v":9.62,"d":"9.6"},{"v":50,"d":"50.0"},{"v":7,"d":"7.0"},0.4,200.2,21.7,22.6,{"v":50,"d":"50.0"},{"v":142,"d":"142.0"},{"v":2345,"d":"2,345.0"},2.5,49.1,{"v":4.89,"d":"4.9"},0.1,{"v":72,"d":"72.0"},{"v":13,"d":"13.0"},{"v":502,"d":"502.0"},{"v":7,"d":"7.0"},{"v":12,"d":"12.0"},3.7,39.2,{"v":38,"d":"38.0"},{"v":11,"d":"11.0"},null,{"v":55,"d":"55.0"},{"v":26,"d":"26.0"},{"v":1,"d":"1.0"},{"v":130,"d":"130.0"},{"v":45,"d":"45.0"},{"v":0.55,"d":"0.6"},0.4,{"v":0.67,"d":"0.7"},26.7,11.5,{"v":15,"d":"15.0"},1.2,{"v":16,"d":"16.0"},{"v":60,"d":"60.0"},57.1,{"v":1358,"d":"1,358.0"},null,{"v":30,"d":"30.0"},{"v":541,"d":"541.0"},{"v":191,"d":"191.0"},{"v":26,"d":"26.0"},{"v":142,"d":"142.0"},{"v":49,"d":"49.0"},{"v":400,"d":"400.0"},{"v":200,"d":"200.0"},{"v":1,"d":"1.0"},26.8,0.4,{"v":142,"d":"142.0"},{"v":60,"d":"60.0"},{"v":26,"d":"26.0"},{"v":26,"d":"26.0"},{"v":214,"d":"214.0"},null,0.1,{"v":541,"d":"541.0"},null,{"v":24,"d":"24.0"},2.2,66.6,2.7,2.7,{"v":7,"d":"7.0"},{"v":7,"d":"7.0"},2.7,21.9,0.5,{"v":10,"d":"10.0"},{"v":14,"d":"14.0"},{"v":560,"d":"560.0"},{"v":30,"d":"30.0"},{"v":26,"d":"26.0"},{"v":26,"d":"26.0"},{"v":2,"d":"2.0"},{"v":1358,"d":"1,358.0"},{"v":63,"d":"63.0"},{"v":63,"d":"63.0"},{"v":400,"d":"400.0"},{"v":400,"d":"400.0"},{"v":40,"d":"40.0"},{"v":92,"d":"92.0"},{"v":30,"d":"30.0"},11.5,{"v":10,"d":"10.0"},{"v":8,"d":"8.0"},{"v":72,"d":"72.0"},{"v":72,"d":"72.0"},{"v":20,"d":"20.0"},{"v":61,"d":"61.0"},1.3,{"v":22,"d":"22.0"},{"v":500,"d":"500.0"},{"v":0.88,"d":"0.9"},{"v":50,"d":"50.0"},11.6,{"v":10,"d":"10.0"},{"v":214,"d":"214.0"},{"v":0.67,"d":"0.7"},0.5,{"v":4.89,"d":"4.9"},{"v":3000,"d":"3,000.0"},{"v":105,"d":"105.0"},{"v":4,"d":"4.0"},0.8,0.5,{"v":35,"d":"35.0"},{"v":1358,"d":"1,358.0"},13.8,{"v":22,"d":"22.0"},{"v":11,"d":"11.0"},{"v":250,"d":"250.0"},{"v":450,"d":"450.0"},1.5,{"v":78,"d":"78.0"},{"v":13,"d":"13.0"},{"v":0.34,"d":"0.3"},6.5,{"v":13,"d":"13.0"},{"v":22,"d":"22.0"},{"v":181,"d":"181.0"},{"v":93,"d":"93.0"},null,{"v":237,"d":"237.0"},null,{"v":12,"d":"12.0"},{"v":37,"d":"37.0"},{"v":13,"d":"13.0"},{"v":40,"d":"40.0"},11.5,{"v":78,"d":"78.0"},{"v":309,"d":"309.0"},{"v":142,"d":"142.0"},0.5,34.4,{"v":141,"d":"141.0"},{"v":35,"d":"35.0"},{"v":30,"d":"30.0"},{"v":50,"d":"50.0"},{"v":4.89,"d":"4.9"},0.5,null,{"v":13,"d":"13.0"},{"v":22,"d":"22.0"},{"v":271,"d":"271.0"},{"v":22,"d":"22.0"},{"v":78,"d":"78.0"},1.8,{"v":90,"d":"90.0"},{"v":10,"d":"10.0"},{"v":22,"d":"22.0"},{"v":22,"d":"22.0"},21.9,{"v":1358,"d":"1,358.0"},121.2,5.5]
["Índice de vulnerabilidade GUS (IUPAC) (>2 - Alerta alto risco)",null,1.62,2.47,0.26,3.25,{"v":2.4,"d":"2.40"},1.81,1.81,1.81,2.18,1.58,null,3.15,-0.92,0.05,3.82,3.42,2.03,{"v":0,"d":"0.00"},null,2.65,1.02,3.13,1.08,1.08,0.91,{"v":-2,"d":"-2.00"},null,2.18,3.92,4.22,{"v":3.1,"d":"3.10"},-1.05,-2.12,0.55,0.52,0.52,4.89,1.62,3.34,2.65,{"v":0,"d":"0.00"},0.26,6.76,0.01,null,-0.82,1.21,{"v":3.1,"d":"3.10"},1.35,4.77,null,1.03,{"v":3.1,"d":"3.10"},2.58,2.58,-0.62,{"v":2.3,"d":"2.30"},{"v":3.3,"d":"3.30"},{"v":3.3,"d":"3.30"},{"v":2.2,"d":"2.20"},{"v":3.3,"d":"3.30"},0.58,0.47,{"v":0,"d":"0.00"},5.46,1.81,0.27,null,null,1.18,2.65,2.65,{"v":2.3,"d":"2.30"},0.13,3.34,{"v":2.2,"d":"2.20"},3.98,1.06,2.29,2.53,2.63,"-0.03","-0.03",{"v":2.3,"d":"2.30"},1.99,null,0.91,{"v":-0.9,"d":"-0.90"},{"v":-4,"d":"-4.00"},-2.66,-2.66,3.89,null,1.21,-2.66,-1.09,-0.27,3.15,-0.85,6.16,2.66,2.66,{"v":2.2,"d":"2.20"},3.44,null,2.23,{"v":-0.9,"d":"-0.90"},2.32,1.21,5.46,2.62,2.69,{"v":1.1,"d":"1.10"},4.14,2.66,{"v":0,"d":"0.00"},{"v":0,"d":"0.00"},-0.56,-2.66,2.02,2.53,2.53,1.87,2.53,0.89,2.01,{"v":0,"d":"0.00"},null,null,-3.14,null,0.15,1.81,{"v":5.4,"d":"5.40"},1.31,-0.69,{"v":-0.5,"d":"-0.50"},{"v":1.4371723157801364,"d":"1.44"},-0.05,0.58,-0.48,1.33,2.63,0.57,2.56,0.99,2.48,-1.17,1.47,-2.12,{"v":3.1,"d":"3.10"},1.06,2.09,3.16,-0.69,-0.08,2.72,2.52,4.22,-0.01,-0.62,{"v":1.5,"d":"1.50"},3.16,3.16,3.16,{"v":1.4371723157801364,"d":"1.44"},0.15,3.74,0.05,-2.12,1.73,2.23,3.76,-0.32,1.98,-0.27,1.25,{"v":3.3,"d":"3.30"},2.85,3.76,3.82,{"v":1.4371723157801364,"d":"1.44"},-0.75,0.59,{"v":1.4371723157801364,"d":"1.44"},{"v":1.4371723157801364,"d":"1.44"},{"v":1.4371723157801364,"d":"1.44"},-0.85,0.13,-3.35,0.68,-3.35,4.22,2.53,2.53,0.19,-2.29,1.94,-6.95,3.46,{"v":0.9,"d":"0.90"},0.16,0.16,2.18,2.26,2.18,0.16,4.89,4.85,{"v":-7.6,"d":"-7.60"},1.83,{"v":-1,"d":"-1.00"},0.68,1.83,1.62,{"v":2.3,"d":"2.30"},-2.95,-2.95,{"v":0,"d":"0.00"},1.94,2.85,2.65,{"v":-0.3,"d":"-0.30"},1.81,3.82,-0.42,1.81,-0.71,2.47,1.47,1.09,2.95,2.17,-2.55,0.27,null,-0.42,-0.16,{"v":-0.3,"d":"-0.30"},null,2.33,1.47,1.81,0.27,1.35,{"v":3.3,"d":"3.30"},{"v":3.3,"d":"3.30"},6.29,1.09,1.06,{"v":-2,"d":"-2.00"},1.31,0.48,0.02,1.98,0.26,-0.85,{"v":0.5,"d":"0.50"},{"v":-1.1,"d":"-1.10"},-1.62,1.06,2.45,{"v":0.9,"d":"0.90"},{"v":2.5,"d":"2.50"},3.18,{"v":-0.3,"d":"-0.30"},1.87,3.38,{"v":0,"d":"0.00"},1.73,3.98,-1.35,-3.14,4.22,{"v":1,"d":"1.00"},1.41,1.41,{"v":3.2,"d":"3.20"},3.23,3.53,{"v":2.3,"d":"2.30"},1.03,2.29,{"v":5.4,"d":"5.40"},2.57,2.85,1.02,1.02,3.18,2.95,2.63,2.26,null,null,0.48,2.48,-0.18,1.73,2.53,{"v":1.4371723157801364,"d":"1.44"},-2.12,2.85,3.18,{"v":0,"d":"0.00"},-0.56,2.29,0.02,{"v":-1.1,"d":"-1.10"},-0.75,3.38,null,0.59,0.52,{"v":3.3,"d":"3.30"},2.33,{"v":1.4371723157801364,"d":"1.44"},-0.49,1.06,-0.49,0.26,-6.95,1.03,1.18,1.64,2.25,null,0.57,-1.09,2.56,null,-0.32,0.52,-2.12,4.58,4.58,0.03,-0.32,0.72,1.01,{"v":1.4371723157801364,"d":"1.44"},0.61,0.61,6.76,3.87,1.98,5.42,{"v":3.9,"d":"3.90"},-0.13,3.76,0.48,{"v":5.4,"d":"5.40"},null,-0.82,2.18,0.27,{"v":1.5,"d":"1.50"},-2.66,3.02,0.99,1.01,{"v":1.3,"d":"1.30"},0.58,{"v":1.4371723157801364,"d":"1.44"},1.99,{"v":-0.1,"d":"-0.10"},1.51,-3.35,-3.35,1.58,{"v":-4,"d":"-4.00"},-1.67,1.83,null,{"v":2.5,"d":"2.50"},1.59,1.99,6.16,0.15,3.44,-0.71,1.08,{"v":0,"d":"0.00"},-1.67,{"v":2.2,"d":"2.20"},-0.56,5.46,1.06,2.03,0.15,-0.75,0.61,4.58,{"v":0,"d":"0.00"},-0.13,{"v":-1,"d":"-1.00"},{"v":-1,"d":"-1.00"},1.22,{"v":-1,"d":"-1.00"},0.89,-0.75,1.71,-1.35,4.85,3.13,1.06,-0.85,{"v":0,"d":"0.00"},0.72,2.69,-1.05,-1.05,1.71,2.32,2.03,1.18,-1.65,1.94,{"v":2.2,"d":"2.20"},3.02,2.57,2.18,{"v":2.4,"d":"2.40"},{"v":3.3,"d":"3.30"},1.72,2.57,null,0.49,2.29,null,{"v":0,"d":"0.00"},2.85,null,3.25,-0.82,{"v":0,"d":"0.00"},0.02,0.15,{"v":2.4,"d":"2.40"},-0.16,-1.17,-0.86,5.42,3.87,2.47,2.03,2.57,1.81,{"v":0,"d":"0.00"},1.59,0.26,1.97,0.38,{"v":-1,"d":"-1.00"},0.26,2.52,-0.11,3.16,-6.95,1.06,0.49,-0.32,1.56,-1.62,3.34,4.14,1.35,2.57,{"v":0,"d":"0.00"},1.33,0.05,-0.01,-2.55,{"v":-1.2,"d":"-1.20"},2.17,1.03,-0.27,null,2.22,1.49,0.02,0.19,-1.65,3.74,6.16,-0.69,"-0.03",0.13,4.22,{"v":2.7,"d":"2.70"},4.22,{"v":3.3,"d":"3.30"},{"v":3.3,"d":"3.30"},{"v":3.3,"d":"3.30"},{"v":3.3,"d":"3.30"},{"v":3.3,"d":"3.30"},2.65,2.65,{"v":0.9,"d":"0.90"},-0.27,4.12,null,0.59,0.47,1.98,0.59,-0.51,-0.86,1.51,null,2.47,-0.18,{"v":-0.1,"d":"-0.10"},2.18,6.29,-0.29,-0.11,{"v":1,"d":"1.00"},{"v":0,"d":"0.00"},1.94,{"v":1.3,"d":"1.30"},1.81,0.02,6.76,1.56,2.72,0.15,2.45,{"v":-7.6,"d":"-7.60"},{"v":1,"d":"1.00"},1.22,0.01,{"v":-1,"d":"-1.00"},0.02,1.21,1.97,4.12,-0.49,0.58,-0.92,2.62,{"v":-0.3,"d":"-0.30"},null,{"v":-1.2,"d":"-1.20"},3.25,{"v":0,"d":"0.00"},{"v":0.9,"d":"0.90"},4.22,-0.69,0.02,-0.56,2.25,2.57,1.94,1.49,2.02,{"v":2.2,"d":"2.20"},3.53,{"v":5.4,"d":"5.40"},null,3.22,6.16,3.76,-2.66,{"v":3.1,"d":"3.10"},3.46,5.46,2.66,{"v":0,"d":"0.00"},{"v":-1.1,"d":"-1.10"},-0.51,2.45,null,-2.66,3.25,1.51,null,-0.02,6.16,null,3.92,1.35,-2.55,0.48,0.48,4.12,4.12,0.48,1.41,{"v":-0.5,"d":"-0.50"},1.18,1.58,{"v":3.3,"d":"3.30"},0.03,-2.66,-2.66,-0.29,{"v":5.4,"d":"5.40"},2.85,2.85,1.72,5.46,2.53,-0.82,3.22,2.57,4.77,1.25,2.19,2.19,1.47,1.81,1.64,-0.05,1.94,{"v":1.1,"d":"1.10"},3.82,3.42,-0.27,1.51,-0.56,{"v":-0.5,"d":"-0.50"},0.01,-6.95,4.58,-0.48,-0.08,{"v":-0.5,"d":"-0.50"},3.34,{"v":5.4,"d":"5.40"},1.99,{"v":1.4371723157801364,"d":"1.44"},{"v":-0.3,"d":"-0.30"},3.34,3.89,null,2.65,0.96,{"v":-0.3,"d":"-0.30"},1.81,0.96,-0.05,0.13,2.09,null,{"v":2.7,"d":"2.70"},null,-0.49,1.06,{"v":-0.9,"d":"-0.90"},3.16,2.57,2.65,3.23,{"v":3.1,"d":"3.10"},null,2.63,-1.05,{"v":0.5,"d":"0.50"},0.26,0.15,0.01,2.01,null,{"v":2.3,"d":"2.30"},-0.05,{"v":3.2,"d":"3.20"},2.22,2.65,0.55,{"v":3.9,"d":"3.90"},{"v":2.4,"d":"2.40"},{"v":1.4371723157801364,"d":"1.44"},{"v":1.4371723157801364,"d":"1.44"},1.41,{"v":5.4,"d":"5.40"},0.38,0.71]
["Potencial de contaminação (1; 2 - médio risco; 3 - alto risco)",null,1,3,3,2,1,2,2,2,1,3,null,3,3,3,3,3,3,1,3,3,1,2,2,2,3,2,3,1,1,2,3,2,2,1,2,2,1,1,3,3,1,3,2,1,3,3,1,3,1,3,3,3,3,3,3,1,3,3,3,1,3,1,3,1,3,2,3,null,null,2,3,3,2,1,2,3,2,3,2,3,2,1,1,2,2,null,3,2,3,2,2,1,null,3,2,1,1,3,2,3,3,3,3,1,null,3,2,3,1,3,3,2,3,3,3,1,1,1,2,2,3,3,3,3,3,1,1,null,null,2,null,3,2,3,2,1,1,2,2,1,1,3,2,3,3,1,2,1,3,2,3,3,2,3,1,3,2,1,2,1,1,3,3,3,3,2,3,3,3,2,2,3,2,3,2,1,2,3,2,2,3,2,1,2,2,2,2,2,1,1,2,1,2,3,3,1,2,3,2,2,3,1,1,3,3,3,1,1,1,2,2,1,2,2,1,2,1,1,1,2,2,3,2,3,3,1,3,1,3,3,3,2,3,2,1,null,1,1,2,null,2,2,2,1,1,3,3,1,3,1,2,2,1,1,3,3,2,3,2,1,1,3,3,3,3,1,3,2,1,2,2,2,2,3,2,2,2,3,3,1,3,3,3,3,2,2,1,1,3,2,2,3,3,3,1,2,1,2,3,2,2,2,3,1,1,2,2,2,1,2,3,1,2,3,2,2,1,1,1,1,2,3,2,1,2,3,3,1,3,null,2,2,2,2,2,3,3,3,1,2,2,2,2,2,2,3,1,2,2,1,3,null,3,1,3,3,2,3,1,1,3,1,2,3,1,3,1,1,3,3,2,2,null,3,1,3,3,3,1,1,2,1,2,3,1,3,1,3,3,1,2,2,1,2,1,1,3,1,3,1,1,2,1,2,3,2,1,3,2,2,2,1,3,3,3,1,2,3,3,2,1,1,3,3,3,null,3,3,null,1,2,null,2,3,1,2,3,1,1,1,3,3,2,3,3,2,2,1,1,3,3,3,1,1,1,1,3,2,1,3,2,2,1,2,3,1,3,1,3,3,1,2,3,3,3,1,3,1,1,1,1,1,3,3,1,1,2,2,3,3,3,3,3,3,3,3,3,3,1,2,null,2,3,3,1,1,3,3,3,3,1,1,1,1,1,1,2,1,3,3,2,1,2,2,2,3,3,2,2,3,1,1,2,3,3,2,1,1,3,3,2,null,3,2,1,3,3,1,1,1,2,2,2,1,2,1,1,3,null,2,3,2,2,3,2,3,3,1,2,1,3,3,2,2,3,null,1,3,null,1,1,2,1,1,2,2,1,2,1,3,3,3,3,2,2,1,3,2,2,3,3,3,3,2,2,3,2,3,3,2,3,1,2,3,3,3,3,1,3,1,1,1,2,2,1,3,1,3,3,2,2,2,2,1,3,3,2,1,3,2,2,2,2,null,3,null,1,3,2,3,2,3,3,3,3,2,2,3,3,3,1,1,null,2,2,3,1,3,1,1,1,2,2,2,3,3,1]
["Nome comercial",null,"2,4 D; Aminol; DMA","Epoxiconazol; Abacus; Ópera; Prospect","Abamectina; Ampligo; Vertimec","Nicossulfurom; Accent; Sanson; Stoy","Metsulfurom-metílico; Accurate; Nufuron; Zartan","Acefato; Acero; Orthene; Ace; Avant; Cefanol; Evolution; Orthene; Rapel","Acefato; Acero; Orthene; Ace; Avant; Cefanol; Evolution; Orthene; Rapel","Acefato; Acero; Orthene; Ace; Avant; Cefanol; Evolution; Orthene; Rapel","Acetamiprido, Autêntico ","Acetacloro, Kadette; Surpass","Acibenzolar-S-metílico; Bion","Acifluorfem-sódico;  Blazer","Acrinatrina; Rufast","Piraclostrobina; Acronis; Comet","Tiametoxam; Actara; Cruiser; Engeo","Tiencarbazona; Adengo","Linurom; Afalon","Carfentrazona-etílica; Aurora; Rage; Savana; Affinity; Spotlight","Afidopiropeno ","Azoxistrobina; Amistar; Elatus; Priori; Unizeb; Agria; Azimut; Priori Xtra; Tridium; Yoda","Folpete; Folpan Agricur  ","MCPA; Agritone","Alacloro; Alaclor; Laço","Alacloro; Alaclor; Laço","Benzovindiflupir; Alade","Alfa-Cipermetrina;  Fastac","Fosetil; Aliette","Indaziflam; Alion; Metribuzin; Provence Total","Sulfometuron metílico; Ally","Clorantraniliprole; Altacor; Dermacor; Premio","Ciproconazol; Alto 100; Aproach; Artea; Sphere max; Verdadeiro","Metaflumizone; Alverde; Metaflimizona; Verismo","Cipermetrina; Ametista; Commanche; Fury; Hero","Ametoctradina; Zampo","Ametrina; Ametrex; Gesapax; Herbipak  ","Ametrina; Ametrex; Gesapax; Herbipak  ","Amicarbazona; Dinamic","2,4 D; Aminol; DMA","Aminopiralide; Tordon Ultra","Azoxistrobina; Amistar; Elatus; Priori; Unizeb; Agria; Azimut; Priori Xtra; Tridium; Yoda","Amitraz","Abamectina; Ampligo; Vertimec","Imazamoxi; Amplo; Raptor","Tiram; Anchor; Rhodiauram; Vitavax ","Propinebe; Antracol","Teflubenzurom; Antrimo; Imunit; Nomolt","Buprofezina; Applaud","Ciproconazol; Alto 100; Aproach; Artea; Sphere max; Verdadeiro","Picoxistrobina; Aproach Power","Tepraloxidim; Aramo","Tricopir-butolítico; Arbust","Fluroxipir; Arreio","Ciproconazol; Alto 100; Aproach; Artea; Sphere max; Verdadeiro","Asulam; Asulox","Asulam; Asulox","Clorfuazurom; Atabron","Fluquinconazol; Atento","Atrazina; Primestra; Gesaprim; Atranex; Atrasimex; Coyote; Extrazin; Facero; Primagram Gold; Primaiz Gold; Primatop; Primóleo    ","Atrazina; Primestra; Gesaprim; Atranex; Atrasimex; Coyote; Extrazin; Facero; Primagram Gold; Primaiz Gold; Primatop; Primóleo    ","Simazina; Atrasimex","Atrazina; Primestra; Gesaprim; Atranex; Atrasimex; Coyote; Extrazin; Facero; Primagram Gold; Primaiz Gold; Primatop; Primóleo    ","Iprodiona; Attic; Certus; Rovral ","Profoxidim; Aura","Carfentrazona-etílica; Aurora; Rage; Savana; Affinity; Spotlight","Tebutiurom; Aval; Butiron; Lava; Spike","Acefato; Acero; Orthene; Ace; Avant; Cefanol; Evolution; Orthene; Rapel","Indoxacarb; Avatar","Azadiractina; Azamax","Azadiractina; Azamax","Azimsulfurom; Gulliver","Azoxistrobina; Amistar; Elatus; Priori; Unizeb; Agria; Azimut; Priori Xtra; Tridium; Yoda","Azoxistrobina; Amistar; Elatus; Priori; Unizeb; Agria; Azimut; Priori Xtra; Tridium; Yoda","Bentazona; Basagran; Doble; Volt","Dazomete; Basamid","Triadimenol; Baytan; Photon ","Metomil; Bazuka; Brilhamte; Lannate","Flubendiamida; Belt","Mefentrifluconazol; Belyan","Benalaxil; Galben","Carbendazim; Derosal; Fungicarb; Tebuzin; Bendazol; Carben; Carbomax; Derox; ","Ciantraniliprole; Benevia; Fortenza; Verimark ","Benfuracarbe; Benforce; Pottente","Benfuracarbe; Benforce; Pottente","Bentazona; Basagran; Doble; Volt","Bentiavalicarbe isopropílico; Totalit","Benzoato de emamectina; Proclaim","Benzovindiflupir; Alade","Beta-ciflutrina; Bulldock ; Turbo","Bicarbonato de potássio; Kaligreen","Bifentrina; Capture; Sperto; Talisman; Biflex; Bistar; Insemat; Starion; Talstar","Bifentrina; Capture; Sperto; Talisman; Biflex; Bistar; Insemat; Starion; Talstar","Triciclazol; Bim","Acibenzolar-S-metílico; Bion","Bispirabaque; Riper","Bifentrina; Capture; Sperto; Talisman; Biflex; Bistar; Insemat; Starion; Talstar","Bistrifluron; Hanaro","Piriproxifem; Blade; Cordial; Privilege; Tiger","Acifluorfem-sódico;  Blazer","Fenpropatrina; Bold; Danimen; Meothrin ","Sulfentrazona; Boral; Kicker; Ponteiro; Solara","Boscalida; Boscalid; Cantus; Spot","Boscalida; Boscalid; Cantus; Spot","Metomil; Bazuka; Brilhamte; Lannate","Bromacila; Krovar","Brometo de metila ","Bromuconazol; Condor","Beta-ciflutrina; Bulldock ; Turbo","Metam-sódico; Bunema","Buprofezina; Applaud","Tebutiurom; Aval; Butiron; Lava; Spike","Cadusafós; Rugby","Mesotriona; Calisto","Tiacloprido; Calypso","Picloram; Campestre","Boscalida; Boscalid; Cantus; Spot","Captana; Captan; Merpan; Orthocide ","Captana; Captan; Merpan; Orthocide ","Tiodicarbe; Captor; Futur; Larvim; Semevim","Bifentrina; Capture; Sperto; Talisman; Biflex; Bistar; Insemat; Starion; Talstar","Carbaril; Sevin","Carbendazim; Derosal; Fungicarb; Tebuzin; Bendazol; Carben; Carbomax; Derox; ","Carbendazim; Derosal; Fungicarb; Tebuzin; Bendazol; Carben; Carbomax; Derox; ","Flonicamida; Carbine","Carbendazim; Derosal; Fungicarb; Tebuzin; Bendazol; Carben; Carbomax; Derox; ","Carbossulfano;  Marshal","Carboxina; Vitavax Thiram","Carfentrazona-etílica; Aurora; Rage; Savana; Affinity; Spotlight","Cartape; Cartarys","Cartape; Cartarys","Flufenoxurom; Cascade","Casugamicina; Kasumin","Clorpirifós; Klorpan; Losban; Catcher; Nufos; Record; Vexter","Acefato; Acero; Orthene; Ace; Avant; Cefanol; Evolution; Orthene; Rapel","Flutriafol; Celeiro; Impact; Skip; Tasker; Tornado; Zoom","Fenamidona; Censor","Cletodim; Centurion; Poquer; Select","Tiofanato-metílico; Cercobin; Support; Topsin","Clorotalonil; Cerconil; Cuprodil; Daconil; Glider; Zetanil; Dacobre; Dacostar; Funginil; Ichiban; Isatalonil; Totalit; Zetaran","Triflumurom; Certero; Thorn; Wasp","Iprodiona; Attic; Certus; Rovral ","Tolfenpirade; Chaser","Pimetrozina; Chess","Ciantraniliprole; Benevia; Fortenza; Verimark ","Ciazofamida; Hanami","Ciclaniliprol; Hayate","Ciclossulfamurom; Invest","Fostiazato; Cierto","Ciflumetofen; Okay","Cimoxanil; Equation","Cipermetrina; Ametista; Commanche; Fury; Hero","Ciproconazol; Alto 100; Aproach; Artea; Sphere max; Verdadeiro","Ciprodinil; Truzon","Ciromazina; Trigard ","Clorimurom-etílico; Classic; Panzer; Twister; Clorim; Clorimuron; ","Cletodim; Centurion; Poquer; Select","Clodinafope-Propargil; Topic","Clomazona; Reator","Cloransulam-metílico; Pacto","Clorantraniliprole; Altacor; Dermacor; Premio","Clorfenapir; Pirate","Clorfuazurom; Atabron","Cloridrato de propamocarbe; Infinito","Clorimurom-etílico; Classic; Panzer; Twister; Clorim; Clorimuron; ","Clorimurom-etílico; Classic; Panzer; Twister; Clorim; Clorimuron; ","Clorimurom-etílico; Classic; Panzer; Twister; Clorim; Clorimuron; ","Clorotalonil; Cerconil; Cuprodil; Daconil; Glider; Zetanil; Dacobre; Dacostar; Funginil; Ichiban; Isatalonil; Totalit; Zetaran","Clorpirifós; Klorpan; Losban; Catcher; Nufos; Record; Vexter","Clotianidina; Poncho","Piraclostrobina; Acronis; Comet","Cipermetrina; Ametista; Commanche; Fury; Hero","Fluazinam; Completo; Frowncide","Bromuconazol; Condor","Imidacloprido; Connect; Cropstar; Sombrero","Hidróxido de cobre; Contact","Imazapir; Contain","Piriproxifem; Blade; Cordial; Privilege; Tiger","Terbufós; Counter","Atrazina; Primestra; Gesaprim; Atranex; Atrasimex; Coyote; Extrazin; Facero; Primagram Gold; Primaiz Gold; Primatop; Primóleo    ","Tebuconazol; Cronnos; Egan; Folicur; Fusão; Nativo; Tebuco","Imidacloprido; Connect; Cropstar; Sombrero","Tiametoxam; Actara; Cruiser; Engeo","Clorotalonil; Cerconil; Cuprodil; Daconil; Glider; Zetanil; Dacobre; Dacostar; Funginil; Ichiban; Isatalonil; Totalit; Zetaran","Lufenuron; Curyom; Game; Match","Profenofós; Curyom ","Clorotalonil; Cerconil; Cuprodil; Daconil; Glider; Zetanil; Dacobre; Dacostar; Funginil; Ichiban; Isatalonil; Totalit; Zetaran","Clorotalonil; Cerconil; Cuprodil; Daconil; Glider; Zetanil; Dacobre; Dacostar; Funginil; Ichiban; Isatalonil; Totalit; Zetaran","Clorotalonil; Cerconil; Cuprodil; Daconil; Glider; Zetanil; Dacobre; Dacostar; Funginil; Ichiban; Isatalonil; Totalit; Zetaran","Fenpropatrina; Bold; Danimen; Meothrin ","Dazomete; Basamid","Deltametrina; Decis; K-Obiol; K-Othrine ","Ditianona; Delan","Deltametrina; Decis; K-Obiol; K-Othrine ","Clorantraniliprole; Altacor; Dermacor; Premio","Carbendazim; Derosal; Fungicarb; Tebuzin; Bendazol; Carben; Carbomax; Derox; ","Carbendazim; Derosal; Fungicarb; Tebuzin; Bendazol; Carben; Carbomax; Derox; ","Diafentiuron; Polo","Dibrometo de Diquate","Dicamba; Rainvel ","Dicloreto de Paraquate; Gramoxone; Paraquat; Tocha","Diclosulam; Spider","Difenoconazol; Flair; Prisma; Score","Diflubenzurom; Diflumax; Dimilim","Diflubenzurom; Diflumax; Dimilim","Dimetoato; Dimexion","Dimetomorfe; Forum","Dimetoato; Dimexion","Diflubenzurom; Diflumax; Dimilim","Amicarbazona; Dinamic","Dinofeturam; Maxsan","Diquate; Reglone","Diurom; Direx; Karmex","Mancozebe; Dithane; Mancozeb; Manzate; Ridomil","Ditianona; Delan","Diurom; Direx; Karmex","2,4 D; Aminol; DMA","Bentazona; Basagran; Doble; Volt","Dodina; Dodex","Dodina; Dodex","Lactofem; Drible; Naja","Metolacloro; Dual Gold; Sequence","Tebuconazol; Cronnos; Egan; Folicur; Fusão; Nativo; Tebuco","Azoxistrobina; Amistar; Elatus; Priori; Unizeb; Agria; Azimut; Priori Xtra; Tridium; Yoda","Etofenproxi; Eleitto; Safety; Trebon","Tetraconazol; Eminent ","Tiametoxam; Actara; Cruiser; Engeo","Espirodiclofeno; Envidor","Trifloxisulfuron; Envoke","Enxofre; Kumulus","Epoxiconazol; Abacus; Ópera; Prospect","Cimoxanil; Equation","Famoxadona; Equation","Foransulfurom; Equip Plus","Pirimetanil; Erune","Esfenvalerato; Pirephos; Sumidan","Espinetoram; Exalt","Espinosade; Natular","Espirodiclofeno; Envidor","Espiromesifeno; Oberon","Etofenproxi; Eleitto; Safety; Trebon","Etoxazol; Smite","Etoxissulfurom; Gladium","Etridiazol; Terrazole","Acefato; Acero; Orthene; Ace; Avant; Cefanol; Evolution; Orthene; Rapel","Espinetoram; Exalt","Sulfoxaflor; Expedition","Atrazina; Primestra; Gesaprim; Atranex; Atrasimex; Coyote; Extrazin; Facero; Primagram Gold; Primaiz Gold; Primatop; Primóleo    ","Atrazina; Primestra; Gesaprim; Atranex; Atrasimex; Coyote; Extrazin; Facero; Primagram Gold; Primaiz Gold; Primatop; Primóleo    ","Quincloraque; Facet","Famoxadona; Equation","Glufosinato de amônio; Fascinate; Finale; Liberty; Patrol","Alfa-Cipermetrina;  Fastac","Fenamidona; Censor","Fenitrotiona; Sumifog; Sumigran; Sumithion ","Fenoxaprop-P-ethyl; Podium; Rapsode; Selefen ","Fenpirazamina; Prolectus","Fenpiroximato; Ortus","Fenpropatrina; Bold; Danimen; Meothrin ","Fenpropimorfe; Versatilis","Gama-Cialotrina; Fentrol; Stalion","Permetrina; Fersol","Glufosinato de amônio; Fascinate; Finale; Liberty; Patrol","Fipronil; Regente; Standak","Difenoconazol; Flair; Prisma; Score","Flazassulfurom; Katana","Fomesafem; Flex; Fusiflex","Trifloxistrobina; Flint ","Flonicamida; Carbine","Florpirauxifen-benzil; Gapper","Fluazifope-p-butil;  Fusilade; Pilot ","Fluazinam; Completo; Frowncide","Flubendiamida; Belt","Fludioxonil; Maxim XL","Flufenoxurom; Cascade","Flumetsulam; Prevaiil; Scorpion","Flumicloraque-pentílico; Radiant; Resource","Flumioxazina; Flumyzin; Sumyzin; Zethamaxx","Flumioxazina; Flumyzin; Sumyzin; Zethamaxx","Fluopicolide; Xavante","Fluopiram; Verango Prime","Flupiradifurona; Sivanto","Fluquinconazol; Atento","Fluroxipir; Arreio","Flutolanil; Moncut","Flutriafol; Celeiro; Impact; Skip; Tasker; Tornado; Zoom","Fluxapiroxade; Orkestra","Tebuconazol; Cronnos; Egan; Folicur; Fusão; Nativo; Tebuco","Folpete; Folpan Agricur  ","Folpete; Folpan Agricur  ","Fomesafem; Flex; Fusiflex","Foransulfurom; Equip Plus","Ciantraniliprole; Benevia; Fortenza; Verimark ","Dimetomorfe; Forum","Fosetil; Aliette","Fosfeto de alúminio; Gastoxin","Fosmete; Imidam","Fostiazato; Cierto","Protioconazol; Fox","Fluazinam; Completo; Frowncide","Carbendazim; Derosal; Fungicarb; Tebuzin; Bendazol; Carben; Carbomax; Derox; ","Clorotalonil; Cerconil; Cuprodil; Daconil; Glider; Zetanil; Dacobre; Dacostar; Funginil; Ichiban; Isatalonil; Totalit; Zetaran","Cipermetrina; Ametista; Commanche; Fury; Hero","Tebuconazol; Cronnos; Egan; Folicur; Fusão; Nativo; Tebuco","Fomesafem; Flex; Fusiflex","Fluazifope-p-butil;  Fusilade; Pilot ","Tiodicarbe; Captor; Futur; Larvim; Semevim","Benalaxil; Galben","Novalurom; Gallaxy;  Rimon","Gama-Cialotrina; Fentrol; Stalion","Lufenuron; Curyom; Game; Match","Florpirauxifen-benzil; Gapper","Fosfeto de alúminio; Gastoxin","Prometrina; Gesagard","Ametrina; Ametrex; Gesapax; Herbipak  ","Atrazina; Primestra; Gesaprim; Atranex; Atrasimex; Coyote; Extrazin; Facero; Primagram Gold; Primaiz Gold; Primatop; Primóleo    ","Etoxissulfurom; Gladium","Clorotalonil; Cerconil; Cuprodil; Daconil; Glider; Zetanil; Dacobre; Dacostar; Funginil; Ichiban; Isatalonil; Totalit; Zetaran","Glifosato; Glyphotal; Roundup; Trop","Glufosinato de amônio; Fascinate; Finale; Liberty; Patrol","Glifosato; Glyphotal; Roundup; Trop","Oxyfluorfem; Goal","Dicloreto de Paraquate; Gramoxone; Paraquat; Tocha","Pirimifós-metílico; Graolin","Azimsulfurom; Gulliver","Halauxifen-metíl; Texaro","Halossulfurom-metílico; Sempra","Haloxifope-P-metílico; Verdict-max","Ciazofamida; Hanami","Bistrifluron; Hanaro","Ciclaniliprol; Hayate","Saflufenacil; Heat","Pendimetalina; Herbadox","Ametrina; Ametrex; Gesapax; Herbipak  ","Cipermetrina; Ametista; Commanche; Fury; Hero","Hexazinona; Hexanil; Magnus; Token","Hexazinona; Hexanil; Magnus; Token","Hexitiazox; Talento","Hidróxido de cobre; Contact","Hidróxido de Fentina; Mertin ","Iodossulfurom-metílico-sódico; Hussar","Clorotalonil; Cerconil; Cuprodil; Daconil; Glider; Zetanil; Dacobre; Dacostar; Funginil; Ichiban; Isatalonil; Totalit; Zetaran","Imazalil; Imazacure; Magnate ","Imazalil; Imazacure; Magnate ","Imazamoxi; Amplo; Raptor","Imazapique; Only","Imazapir; Contain","Imazaquim; Oneshot ","Imazetapir; Zaphir","Imibenconazol; Manage ","Imidacloprido; Connect; Cropstar; Sombrero","Fosmete; Imidam","Flutriafol; Celeiro; Impact; Skip; Tasker; Tornado; Zoom","Impirfluxam; Sugoy","Teflubenzurom; Antrimo; Imunit; Nomolt","Indaziflam; Alion; Metribuzin; Provence Total","Indoxacarb; Avatar","Cloridrato de propamocarbe; Infinito","Bifentrina; Capture; Sperto; Talisman; Biflex; Bistar; Insemat; Starion; Talstar","Metoxifenozida; Intrepid","Ciclossulfamurom; Invest","Iodossulfurom-metílico-sódico; Hussar","Ipconazol; Rancona","Iprodiona; Attic; Certus; Rovral ","Clorotalonil; Cerconil; Cuprodil; Daconil; Glider; Zetanil; Dacobre; Dacostar; Funginil; Ichiban; Isatalonil; Totalit; Zetaran","Isofetamida; Kenja","Isoxaflutol; Provence","Propiconazol; Juno; Stratego; Tilt","Deltametrina; Decis; K-Obiol; K-Othrine ","Deltametrina; Decis; K-Obiol; K-Othrine ","Acetacloro, Kadette; Surpass","Bicarbonato de potássio; Kaligreen","Lambda-Cialotrina; Karate zeon","Diurom; Direx; Karmex","Casugamicina; Kasumin","Flazassulfurom; Katana","Orthosulfamuron; Kelion","Isofetamida; Kenja","Sulfentrazona; Boral; Kicker; Ponteiro; Solara","Clorpirifós; Klorpan; Losban; Catcher; Nufos; Record; Vexter","Bromacila; Krovar","Enxofre; Kumulus","Alacloro; Alaclor; Laço","Lactofem; Drible; Naja","Lambda-Cialotrina; Karate zeon","Metomil; Bazuka; Brilhamte; Lannate","Tiodicarbe; Captor; Futur; Larvim; Semevim","Tebutiurom; Aval; Butiron; Lava; Spike","Glufosinato de amônio; Fascinate; Finale; Liberty; Patrol","Linurom; Afalon","Clorpirifós; Klorpan; Losban; Catcher; Nufos; Record; Vexter","Lufenuron; Curyom; Game; Match","Imazalil; Imazacure; Magnate ","Hexazinona; Hexanil; Magnus; Token","Malation; Nordick","Imibenconazol; Manage ","Mancozebe; Dithane; Mancozeb; Manzate; Ridomil","Mancozebe; Dithane; Mancozeb; Manzate; Ridomil","Mandipropamida; Revus","Mancozebe; Dithane; Mancozeb; Manzate; Ridomil","Carbossulfano;  Marshal","Lufenuron; Curyom; Game; Match","Metalaxil-M; Maxim","Fludioxonil; Maxim XL","Dinofeturam; Maxsan","MCPA; Agritone","Mefentrifluconazol; Belyan","Fenpropatrina; Bold; Danimen; Meothrin ","Captana; Captan; Merpan; Orthocide ","Hidróxido de Fentina; Mertin ","Mesotriona; Calisto","Metaflumizone; Alverde; Metaflimizona; Verismo","Metaflumizone; Alverde; Metaflimizona; Verismo","Metalaxil-M; Maxim","Metam-sódico; Bunema","Metconazol; Ópera Ultra","Metidationa; Suprathion","Metiram; Polyram","Metolacloro; Dual Gold; Sequence","Metomil; Bazuka; Brilhamte; Lannate","Metoxifenozida; Intrepid","Metribuzim; Sencor; Tenace; Unimark","Indaziflam; Alion; Metribuzin; Provence Total","Metsulfurom-metílico; Accurate; Nufuron; Zartan","Miclobutanil; Systhane","Tebufenozida; Mimic","Pidiflumetofen; Miravis","Sulfluramida; Mirex S","Pencicurom; Moceren","Flutolanil; Moncut","MSMA; Volcane","Lactofem; Drible; Naja","Tebuconazol; Cronnos; Egan; Folicur; Fusão; Nativo; Tebuco","Espinosade; Natular","Nicossulfurom; Accent; Sanson; Stoy","Teflubenzurom; Antrimo; Imunit; Nomolt","Malation; Nordick","Novalurom; Gallaxy;  Rimon","Clorpirifós; Klorpan; Losban; Catcher; Nufos; Record; Vexter","Metsulfurom-metílico; Accurate; Nufuron; Zartan","Espiromesifeno; Oberon","Ciflumetofen; Okay","Propargito; Omite","Imazaquim; Oneshot ","Imazapique; Only","Epoxiconazol; Abacus; Ópera; Prospect","Metconazol; Ópera Ultra","Fluxapiroxade; Orkestra","Acefato; Acero; Orthene; Ace; Avant; Cefanol; Evolution; Orthene; Rapel","Captana; Captan; Merpan; Orthocide ","Orthosulfamuron; Kelion","Fenpiroximato; Ortus","Oxadiazona; Ronstar","Oxatiapiprolina; Zorvec","Oxicloreto de cobre","Oxyfluorfem; Goal","Cloransulam-metílico; Pacto","Quizalofope-P-tefurílico; Panther","Clorimurom-etílico; Classic; Panzer; Twister; Clorim; Clorimuron; ","Dicloreto de Paraquate; Gramoxone; Paraquat; Tocha","Glufosinato de amônio; Fascinate; Finale; Liberty; Patrol","Pencicurom; Moceren","Pendimetalina; Herbadox","Penoxsulam; Raster","Permetrina; Fersol","Triadimenol; Baytan; Photon ","Picloram; Campestre","Picoxistrobina; Aproach Power","Pidiflumetofen; Miravis","Fluazifope-p-butil;  Fusilade; Pilot ","Pimetrozina; Chess","Piraclostrobina; Acronis; Comet","Clorfenapir; Pirate","Esfenvalerato; Pirephos; Sumidan","Piridabem; Sanmite","Pirimetanil; Erune","Pirimifós-metílico; Graolin","Piriproxifem; Blade; Cordial; Privilege; Tiger","Piritiobaque-sódico; Staple","Piroxassulfona; Yamato","Setoxidim; Poast","Fenoxaprop-P-ethyl; Podium; Rapsode; Selefen ","Diafentiuron; Polo","Metiram; Polyram","Clotianidina; Poncho","Sulfentrazona; Boral; Kicker; Ponteiro; Solara","Cletodim; Centurion; Poquer; Select","Benfuracarbe; Benforce; Pottente","Trifluralina; Premelin","Clorantraniliprole; Altacor; Dermacor; Premio","Triticonazol; Premis","Flumetsulam; Prevaiil; Scorpion","Atrazina; Primestra; Gesaprim; Atranex; Atrasimex; Coyote; Extrazin; Facero; Primagram Gold; Primaiz Gold; Primatop; Primóleo    ","Atrazina; Primestra; Gesaprim; Atranex; Atrasimex; Coyote; Extrazin; Facero; Primagram Gold; Primaiz Gold; Primatop; Primóleo    ","Atrazina; Primestra; Gesaprim; Atranex; Atrasimex; Coyote; Extrazin; Facero; Primagram Gold; Primaiz Gold; Primatop; Primóleo    ","Atrazina; Primestra; Gesaprim; Atranex; Atrasimex; Coyote; Extrazin; Facero; Primagram Gold; Primaiz Gold; Primatop; Primóleo    ","Atrazina; Primestra; Gesaprim; Atranex; Atrasimex; Coyote; Extrazin; Facero; Primagram Gold; Primaiz Gold; Primatop; Primóleo    ","Azoxistrobina; Amistar; Elatus; Priori; Unizeb; Agria; Azimut; Priori Xtra; Tridium; Yoda","Azoxistrobina; Amistar; Elatus; Priori; Unizeb; Agria; Azimut; Priori Xtra; Tridium; Yoda","Difenoconazol; Flair; Prisma; Score","Piriproxifem; Blade; Cordial; Privilege; Tiger","Procimidona; Rotaxil; Sumiguard; Sumilex ","Benzoato de emamectina; Proclaim","Profenofós; Curyom ","Profoxidim; Aura","Fenpirazamina; Prolectus","Prometrina; Gesagard","Propanil; Stam","Propargito; Omite","Propiconazol; Juno; Stratego; Tilt","Propinebe; Antracol","Epoxiconazol; Abacus; Ópera; Prospect","Protioconazol; Fox","Isoxaflutol; Provence","Indaziflam; Alion; Metribuzin; Provence Total","Quincloraque; Facet","Quizalofop-P-ethyl; Targa ","Quizalofope-P-tefurílico; Panther","Flumicloraque-pentílico; Radiant; Resource","Carfentrazona-etílica; Aurora; Rage; Savana; Affinity; Spotlight","Dicamba; Rainvel ","Ipconazol; Rancona","Acefato; Acero; Orthene; Ace; Avant; Cefanol; Evolution; Orthene; Rapel","Fenoxaprop-P-ethyl; Podium; Rapsode; Selefen ","Imazamoxi; Amplo; Raptor","Penoxsulam; Raster","Clomazona; Reator","Clorpirifós; Klorpan; Losban; Catcher; Nufos; Record; Vexter","Fipronil; Regente; Standak","Diquate; Reglone","Flumicloraque-pentílico; Radiant; Resource","Mandipropamida; Revus","Tiram; Anchor; Rhodiauram; Vitavax ","Mancozebe; Dithane; Mancozeb; Manzate; Ridomil","Novalurom; Gallaxy;  Rimon","Bispirabaque; Riper","Oxadiazona; Ronstar","Procimidona; Rotaxil; Sumiguard; Sumilex ","Glifosato; Glyphotal; Roundup; Trop","Iprodiona; Attic; Certus; Rovral ","Acrinatrina; Rufast","Rugby","Etofenproxi; Eleitto; Safety; Trebon","Saflufenacil; Heat","Piridabem; Sanmite","Nicossulfurom; Accent; Sanson; Stoy","Carfentrazona-etílica; Aurora; Rage; Savana; Affinity; Spotlight","Difenoconazol; Flair; Prisma; Score","Flumetsulam; Prevaiil; Scorpion","Cletodim; Centurion; Poquer; Select","Fenoxaprop-P-ethyl; Podium; Rapsode; Selefen ","Tiodicarbe; Captor; Futur; Larvim; Semevim","Halossulfurom-metílico; Sempra","Metribuzim; Sencor; Tenace; Unimark","Metolacloro; Dual Gold; Sequence","Setoxidim; Poast","Carbaril; Sevin","Simazina; Atrasimex","Flupiradifurona; Sivanto","Flutriafol; Celeiro; Impact; Skip; Tasker; Tornado; Zoom","Etoxazol; Smite","Tembotriona; Soberan","Sulfentrazona; Boral; Kicker; Ponteiro; Solara","Imidacloprido; Connect; Cropstar; Sombrero","Bifentrina; Capture; Sperto; Talisman; Biflex; Bistar; Insemat; Starion; Talstar","Ciproconazol; Alto 100; Aproach; Artea; Sphere max; Verdadeiro","Diclosulam; Spider","Tebutiurom; Aval; Butiron; Lava; Spike","Boscalida; Boscalid; Cantus; Spot","Carfentrazona-etílica; Aurora; Rage; Savana; Affinity; Spotlight","Gama-Cialotrina; Fentrol; Stalion","Propanil; Stam","Fipronil; Regente; Standak","Piritiobaque-sódico; Staple","Bifentrina; Capture; Sperto; Talisman; Biflex; Bistar; Insemat; Starion; Talstar","Nicossulfurom; Accent; Sanson; Stoy","Propiconazol; Juno; Stratego; Tilt","Impirfluxam; Sugoy","Sulfato de cobre","Sulfentrazona; Boral; Kicker; Ponteiro; Solara","Sulfluramida; Mirex S","Sulfometuron metílico; Ally","Sulfoxaflor; Expedition","Esfenvalerato; Pirephos; Sumidan","Fenitrotiona; Sumifog; Sumigran; Sumithion ","Fenitrotiona; Sumifog; Sumigran; Sumithion ","Procimidona; Rotaxil; Sumiguard; Sumilex ","Procimidona; Rotaxil; Sumiguard; Sumilex ","Fenitrotiona; Sumifog; Sumigran; Sumithion ","Flumioxazina; Flumyzin; Sumyzin; Zethamaxx","Tiofanato-metílico; Cercobin; Support; Topsin","Metidationa; Suprathion","Acetacloro, Kadette; Surpass","Miclobutanil; Systhane","Hexitiazox; Talento","Bifentrina; Capture; Sperto; Talisman; Biflex; Bistar; Insemat; Starion; Talstar","Bifentrina; Capture; Sperto; Talisman; Biflex; Bistar; Insemat; Starion; Talstar","Quizalofop-P-ethyl; Targa ","Flutriafol; Celeiro; Impact; Skip; Tasker; Tornado; Zoom","Tebuconazol; Cronnos; Egan; Folicur; Fusão; Nativo; Tebuco","Tebuconazol; Cronnos; Egan; Folicur; Fusão; Nativo; Tebuco","Tebufenozida; Mimic","Tebutiurom; Aval; Butiron; Lava; Spike","Carbendazim; Derosal; Fungicarb; Tebuzin; Bendazol; Carben; Carbomax; Derox; ","Teflubenzurom; Antrimo; Imunit; Nomolt","Tembotriona; Soberan","Metribuzim; Sencor; Tenace; Unimark","Tepraloxidim; Aramo","Terbufós; Counter","Terbutilazina; Terbumax","Terbutilazina; Terbumax","Etridiazol; Terrazole","Tetraconazol; Eminent ","Halauxifen-metíl; Texaro","Triflumurom; Certero; Thorn; Wasp","Tiabendazol; Tecto","Tiacloprido; Calypso","Tiametoxam; Actara; Cruiser; Engeo","Tiencarbazona; Adengo","Piriproxifem; Blade; Cordial; Privilege; Tiger","Propiconazol; Juno; Stratego; Tilt","Tiodicarbe; Captor; Futur; Larvim; Semevim","Tiofanato-metílico; Cercobin; Support; Topsin","Tiram; Anchor; Rhodiauram; Vitavax ","Dicloreto de Paraquate; Gramoxone; Paraquat; Tocha","Hexazinona; Hexanil; Magnus; Token","Tolfenpirade; Chaser","Clodinafope-Propargil; Topic","Tiofanato-metílico; Cercobin; Support; Topsin","Aminopiralide; Tordon Ultra","Flutriafol; Celeiro; Impact; Skip; Tasker; Tornado; Zoom","Bentiavalicarbe isopropílico; Totalit","Clorotalonil; Cerconil; Cuprodil; Daconil; Glider; Zetanil; Dacobre; Dacostar; Funginil; Ichiban; Isatalonil; Totalit; Zetaran","Etofenproxi; Eleitto; Safety; Trebon","Triadimenol; Baytan; Photon ","Triciclazol; Bim","Tricopir-butolítico; Arbust","Azoxistrobina; Amistar; Elatus; Priori; Unizeb; Agria; Azimut; Priori Xtra; Tridium; Yoda","Triflumizol; Trifimine","Trifloxistrobina; Flint ","Trifloxisulfuron; Envoke","Triflumizol; Trifimine","Triflumurom; Certero; Thorn; Wasp","Trifluralina; Premelin","Ciromazina; Trigard ","Trinexapaque-etílico; Trix","Triticonazol; Premis","Trinexapaque-etílico; Trix","Glifosato; Glyphotal; Roundup; Trop","Ciprodinil; Truzon","Beta-ciflutrina; Bulldock ; Turbo","Clorimurom-etílico; Classic; Panzer; Twister; Clorim; Clorimuron; ","Metribuzim; Sencor; Tenace; Unimark","Azoxistrobina; Amistar; Elatus; Priori; Unizeb; Agria; Azimut; Priori Xtra; Tridium; Yoda","Fluopiram; Verango Prime","Ciproconazol; Alto 100; Aproach; Artea; Sphere max; Verdadeiro","Haloxifope-P-metílico; Verdict-max","Ciantraniliprole; Benevia; Fortenza; Verimark ","Metaflumizone; Alverde; Metaflimizona; Verismo","Fenpropimorfe; Versatilis","Abamectina; Ampligo; Vertimec","Clorpirifós; Klorpan; Losban; Catcher; Nufos; Record; Vexter","Tiram; Anchor; Rhodiauram; Vitavax ","Carboxina; Vitavax Thiram","MSMA; Volcane","Bentazona; Basagran; Doble; Volt","Triflumurom; Certero; Thorn; Wasp","Fluopicolide; Xavante","Piroxassulfona; Yamato","Azoxistrobina; Amistar; Elatus; Priori; Unizeb; Agria; Azimut; Priori Xtra; Tridium; Yoda","Ametoctradina; Zampo","Imazetapir; Zaphir","Metsulfurom-metílico; Accurate; Nufuron; Zartan","Clorotalonil; Cerconil; Cuprodil; Daconil; Glider; Zetanil; Dacobre; Dacostar; Funginil; Ichiban; Isatalonil; Totalit; Zetaran","Clorotalonil; Cerconil; Cuprodil; Daconil; Glider; Zetanil; Dacobre; Dacostar; Funginil; Ichiban; Isatalonil; Totalit; Zetaran","Flumioxazina; Flumyzin; Sumyzin; Zethamaxx","Flutriafol; Celeiro; Impact; Skip; Tasker; Tornado; Zoom","Oxatiapiprolina; Zorvec","Zoxamida"]
["EIQ (<58,33; 58,33 - 94,46; > 94,46)",null,{"v":38.67,"d":"38.7"},{"v":94.33333333333333,"d":"94.3"},{"v":108.16666666666667,"d":"108.2"},{"v":28.666666666666668,"d":"28.7"},{"v":32,"d":"32.0"},{"v":47.333333333333336,"d":"47.3"},{"v":47.333333333333336,"d":"47.3"},{"v":47.333333333333336,"d":"47.3"},{"v":37.666666666666664,"d":"37.7"},{"v":32.666666666666664,"d":"32.7"},{"v":52.666666666666664,"d":"52.7"},{"v":31.666666666666668,"d":"31.7"},{"v":50,"d":"50.0"},{"v":67,"d":"67.0"},{"v":34.333333333333336,"d":"34.3"},{"v":52.333333333333336,"d":"52.3"},{"v":56.666666666666664,"d":"56.7"},{"v":36,"d":"36.0"},{"v":34,"d":"34.0"},{"v":63,"d":"63.0"},48.7,{"v":38.666666666666664,"d":"38.7"},{"v":19.333333333333332,"d":"19.3"},{"v":19.333333333333332,"d":"19.3"},{"v":70.66666666666667,"d":"70.7"},{"v":63,"d":"63.0"},{"v":37.666666666666664,"d":"37.7"},{"v":39.166666666666664,"d":"39.2"},{"v":25.666666666666668,"d":"25.7"},{"v":42,"d":"42.0"},{"v":89.33333333333333,"d":"89.3"},{"v":50.666666666666664,"d":"50.7"},{"v":63,"d":"63.0"},{"v":39.333333333333336,"d":"39.3"},21.5,21.5,null,{"v":38.67,"d":"38.7"},54.5,{"v":63,"d":"63.0"},{"v":56.333333333333336,"d":"56.3"},{"v":108.16666666666667,"d":"108.2"},{"v":75.33333333333333,"d":"75.3"},{"v":39,"d":"39.0"},{"v":32.166666666666664,"d":"32.2"},{"v":74.83333333333333,"d":"74.8"},{"v":54.666666666666664,"d":"54.7"},{"v":89.33333333333333,"d":"89.3"},{"v":59,"d":"59.0"},{"v":40.666666666666664,"d":"40.7"},{"v":48.166666666666664,"d":"48.2"},{"v":42.666666666666664,"d":"42.7"},{"v":89.33333333333333,"d":"89.3"},{"v":41,"d":"41.0"},{"v":41,"d":"41.0"},{"v":30.833333333333332,"d":"30.8"},null,{"v":50,"d":"50.0"},{"v":50,"d":"50.0"},{"v":32.333333333333336,"d":"32.3"},{"v":50,"d":"50.0"},{"v":55,"d":"55.0"},null,{"v":36,"d":"36.0"},{"v":51.333333333333336,"d":"51.3"},{"v":47.333333333333336,"d":"47.3"},{"v":65.33333333333333,"d":"65.3"},{"v":38.666666666666664,"d":"38.7"},{"v":38.666666666666664,"d":"38.7"},{"v":36.333333333333336,"d":"36.3"},{"v":63,"d":"63.0"},{"v":63,"d":"63.0"},{"v":25,"d":"25.0"},{"v":40.333333333333336,"d":"40.3"},{"v":91.33333333333333,"d":"91.3"},{"v":53.833333333333336,"d":"53.8"},60.5,{"v":86,"d":"86.0"},{"v":41.333333333333336,"d":"41.3"},{"v":60.666666666666664,"d":"60.7"},{"v":57.833333333333336,"d":"57.8"},{"v":70,"d":"70.0"},{"v":70,"d":"70.0"},{"v":25,"d":"25.0"},{"v":43,"d":"43.0"},{"v":64,"d":"64.0"},{"v":70.66666666666667,"d":"70.7"},{"v":50.666666666666664,"d":"50.7"},{"v":22,"d":"22.0"},69.5,69.5,{"v":47.333333333333336,"d":"47.3"},{"v":52.666666666666664,"d":"52.7"},{"v":23,"d":"23.0"},69.5,{"v":30.666666666666668,"d":"30.7"},{"v":59.666666666666664,"d":"59.7"},{"v":31.666666666666668,"d":"31.7"},{"v":51,"d":"51.0"},{"v":51,"d":"51.0"},{"v":74.66666666666667,"d":"74.7"},{"v":74.66666666666667,"d":"74.7"},{"v":53.833333333333336,"d":"53.8"},{"v":33.333333333333336,"d":"33.3"},{"v":53.57,"d":"53.6"},{"v":75.66666666666667,"d":"75.7"},{"v":50.666666666666664,"d":"50.7"},{"v":34.666666666666664,"d":"34.7"},{"v":54.666666666666664,"d":"54.7"},{"v":51.333333333333336,"d":"51.3"},{"v":143.16666666666666,"d":"143.2"},{"v":44,"d":"44.0"},54.5,{"v":50.333333333333336,"d":"50.3"},{"v":74.66666666666667,"d":"74.7"},{"v":51.166666666666664,"d":"51.2"},{"v":51.166666666666664,"d":"51.2"},{"v":74,"d":"74.0"},69.5,{"v":58,"d":"58.0"},{"v":60.666666666666664,"d":"60.7"},{"v":60.666666666666664,"d":"60.7"},{"v":33,"d":"33.0"},{"v":60.666666666666664,"d":"60.7"},{"v":68.66666666666667,"d":"68.7"},{"v":40.666666666666664,"d":"40.7"},{"v":36,"d":"36.0"},null,null,{"v":70.66666666666667,"d":"70.7"},{"v":43,"d":"43.0"},{"v":87.16666666666667,"d":"87.2"},{"v":47.333333333333336,"d":"47.3"},{"v":118,"d":"118.0"},{"v":37.666666666666664,"d":"37.7"},{"v":37.333333333333336,"d":"37.3"},{"v":62.333333333333336,"d":"62.3"},{"v":47.333333333333336,"d":"47.3"},{"v":56.666666666666664,"d":"56.7"},{"v":55,"d":"55.0"},{"v":42.666666666666664,"d":"42.7"},{"v":31.666666666666668,"d":"31.7"},{"v":57.833333333333336,"d":"57.8"},{"v":50.666666666666664,"d":"50.7"},{"v":101.66666666666667,"d":"101.7"},{"v":26.666666666666668,"d":"26.7"},{"v":49,"d":"49.0"},{"v":39,"d":"39.0"},{"v":33,"d":"33.0"},{"v":63,"d":"63.0"},{"v":89.33333333333333,"d":"89.3"},{"v":56.666666666666664,"d":"56.7"},{"v":61.833333333333336,"d":"61.8"},{"v":36.166666666666664,"d":"36.2"},{"v":37.333333333333336,"d":"37.3"},{"v":29.333333333333332,"d":"29.3"},{"v":34,"d":"34.0"},{"v":22.666666666666668,"d":"22.7"},{"v":42,"d":"42.0"},null,{"v":30.833333333333332,"d":"30.8"},{"v":64,"d":"64.0"},{"v":36.166666666666664,"d":"36.2"},{"v":36.166666666666664,"d":"36.2"},{"v":36.166666666666664,"d":"36.2"},{"v":47.333333333333336,"d":"47.3"},{"v":87.16666666666667,"d":"87.2"},{"v":115.33333333333333,"d":"115.3"},{"v":67,"d":"67.0"},{"v":63,"d":"63.0"},{"v":56.666666666666664,"d":"56.7"},{"v":75.66666666666667,"d":"75.7"},{"v":70,"d":"70.0"},{"v":50,"d":"50.0"},{"v":22.333333333333332,"d":"22.3"},{"v":59.666666666666664,"d":"59.7"},{"v":102.66666666666667,"d":"102.7"},{"v":50,"d":"50.0"},50.5,{"v":70,"d":"70.0"},{"v":34.333333333333336,"d":"34.3"},{"v":47.333333333333336,"d":"47.3"},{"v":49.666666666666664,"d":"49.7"},{"v":50,"d":"50.0"},{"v":47.333333333333336,"d":"47.3"},{"v":47.333333333333336,"d":"47.3"},{"v":47.333333333333336,"d":"47.3"},{"v":51,"d":"51.0"},{"v":40.333333333333336,"d":"40.3"},{"v":67.33333333333333,"d":"67.3"},{"v":55,"d":"55.0"},{"v":67.33333333333333,"d":"67.3"},{"v":42,"d":"42.0"},{"v":60.666666666666664,"d":"60.7"},{"v":60.666666666666664,"d":"60.7"},{"v":33,"d":"33.0"},{"v":47,"d":"47.0"},42.5,{"v":54.333333333333336,"d":"54.3"},{"v":29.666666666666668,"d":"29.7"},{"v":64.66666666666667,"d":"64.7"},{"v":65.33333333333333,"d":"65.3"},{"v":65.33333333333333,"d":"65.3"},52.5,{"v":56,"d":"56.0"},52.5,{"v":65.33333333333333,"d":"65.3"},null,{"v":90.66666666666667,"d":"90.7"},{"v":52.333333333333336,"d":"52.3"},{"v":46.166666666666664,"d":"46.2"},{"v":46,"d":"46.0"},{"v":55,"d":"55.0"},{"v":46.166666666666664,"d":"46.2"},{"v":38.67,"d":"38.7"},{"v":25,"d":"25.0"},{"v":39.666666666666664,"d":"39.7"},{"v":39.666666666666664,"d":"39.7"},null,{"v":36.166666666666664,"d":"36.2"},50.5,{"v":63,"d":"63.0"},{"v":40.333333333333336,"d":"40.3"},{"v":59,"d":"59.0"},{"v":34.333333333333336,"d":"34.3"},{"v":46,"d":"46.0"},{"v":32.666666666666664,"d":"32.7"},{"v":29.666666666666668,"d":"29.7"},{"v":94.33333333333333,"d":"94.3"},{"v":33,"d":"33.0"},{"v":88,"d":"88.0"},{"v":29,"d":"29.0"},{"v":54.333333333333336,"d":"54.3"},{"v":56,"d":"56.0"},{"v":45.666666666666664,"d":"45.7"},{"v":68.33333333333333,"d":"68.3"},{"v":46,"d":"46.0"},{"v":40.666666666666664,"d":"40.7"},{"v":40.333333333333336,"d":"40.3"},{"v":36.666666666666664,"d":"36.7"},{"v":35,"d":"35.0"},null,{"v":47.333333333333336,"d":"47.3"},{"v":45.666666666666664,"d":"45.7"},{"v":44.666666666666664,"d":"44.7"},{"v":50,"d":"50.0"},{"v":50,"d":"50.0"},{"v":45.333333333333336,"d":"45.3"},{"v":88,"d":"88.0"},{"v":27.666666666666668,"d":"27.7"},{"v":63,"d":"63.0"},{"v":37.666666666666664,"d":"37.7"},{"v":89.33333333333333,"d":"89.3"},{"v":30.333333333333332,"d":"30.3"},{"v":52,"d":"52.0"},{"v":57,"d":"57.0"},{"v":51,"d":"51.0"},{"v":36.666666666666664,"d":"36.7"},{"v":78.83333333333333,"d":"78.8"},{"v":66.33333333333333,"d":"66.3"},{"v":27.666666666666668,"d":"27.7"},{"v":80,"d":"80.0"},{"v":64.66666666666667,"d":"64.7"},{"v":52.333333333333336,"d":"52.3"},{"v":49.166666666666664,"d":"49.2"},{"v":54,"d":"54.0"},{"v":33,"d":"33.0"},{"v":32.166666666666664,"d":"32.2"},{"v":36.666666666666664,"d":"36.7"},{"v":56.666666666666664,"d":"56.7"},60.5,{"v":55,"d":"55.0"},{"v":70.66666666666667,"d":"70.7"},{"v":23.666666666666668,"d":"23.7"},{"v":23.333333333333332,"d":"23.3"},{"v":46.333333333333336,"d":"46.3"},{"v":46.333333333333336,"d":"46.3"},{"v":64.33333333333333,"d":"64.3"},{"v":65,"d":"65.0"},{"v":69,"d":"69.0"},null,{"v":42.666666666666664,"d":"42.7"},{"v":57.333333333333336,"d":"57.3"},{"v":118,"d":"118.0"},{"v":65,"d":"65.0"},50.5,48.7,48.7,{"v":49.166666666666664,"d":"49.2"},{"v":29,"d":"29.0"},{"v":57.833333333333336,"d":"57.8"},{"v":56,"d":"56.0"},{"v":37.666666666666664,"d":"37.7"},null,{"v":47.666666666666664,"d":"47.7"},{"v":49,"d":"49.0"},{"v":49.333333333333336,"d":"49.3"},{"v":56.666666666666664,"d":"56.7"},{"v":60.666666666666664,"d":"60.7"},{"v":47.333333333333336,"d":"47.3"},{"v":63,"d":"63.0"},50.5,{"v":49.166666666666664,"d":"49.2"},{"v":36.666666666666664,"d":"36.7"},{"v":74,"d":"74.0"},{"v":41.333333333333336,"d":"41.3"},{"v":36.666666666666664,"d":"36.7"},{"v":78.83333333333333,"d":"78.8"},{"v":49.666666666666664,"d":"49.7"},{"v":32.166666666666664,"d":"32.2"},null,{"v":50.666666666666664,"d":"50.7"},21.5,{"v":50,"d":"50.0"},{"v":35,"d":"35.0"},{"v":47.333333333333336,"d":"47.3"},{"v":41.333333333333336,"d":"41.3"},{"v":27.666666666666668,"d":"27.7"},{"v":41.333333333333336,"d":"41.3"},{"v":34,"d":"34.0"},{"v":54.333333333333336,"d":"54.3"},{"v":52.666666666666664,"d":"52.7"},{"v":36.333333333333336,"d":"36.3"},{"v":42.666666666666664,"d":"42.7"},{"v":29.333333333333332,"d":"29.3"},{"v":19.333333333333332,"d":"19.3"},{"v":50.666666666666664,"d":"50.7"},{"v":30.666666666666668,"d":"30.7"},{"v":101.66666666666667,"d":"101.7"},{"v":37,"d":"37.0"},{"v":68.66666666666667,"d":"68.7"},21.5,{"v":63,"d":"63.0"},null,null,{"v":54,"d":"54.0"},{"v":50,"d":"50.0"},{"v":69.83333333333333,"d":"69.8"},{"v":40.666666666666664,"d":"40.7"},{"v":47.333333333333336,"d":"47.3"},{"v":80,"d":"80.0"},{"v":80,"d":"80.0"},{"v":75.33333333333333,"d":"75.3"},null,{"v":22.333333333333332,"d":"22.3"},{"v":62.666666666666664,"d":"62.7"},25.5,{"v":27.666666666666668,"d":"27.7"},{"v":70,"d":"70.0"},{"v":47.666666666666664,"d":"47.7"},{"v":118,"d":"118.0"},null,{"v":74.83333333333333,"d":"74.8"},{"v":39.166666666666664,"d":"39.2"},{"v":65.33333333333333,"d":"65.3"},{"v":64,"d":"64.0"},69.5,{"v":52.666666666666664,"d":"52.7"},{"v":26.666666666666668,"d":"26.7"},{"v":40.666666666666664,"d":"40.7"},{"v":64.33333333333333,"d":"64.3"},{"v":55,"d":"55.0"},{"v":47.333333333333336,"d":"47.3"},49.5,{"v":26.333333333333332,"d":"26.3"},{"v":61.333333333333336,"d":"61.3"},{"v":67.33333333333333,"d":"67.3"},{"v":67.33333333333333,"d":"67.3"},{"v":32.666666666666664,"d":"32.7"},{"v":22,"d":"22.0"},{"v":69.83333333333333,"d":"69.8"},{"v":46.166666666666664,"d":"46.2"},{"v":43,"d":"43.0"},{"v":52.333333333333336,"d":"52.3"},{"v":41,"d":"41.0"},49.5,{"v":51,"d":"51.0"},{"v":87.16666666666667,"d":"87.2"},{"v":33.333333333333336,"d":"33.3"},{"v":29.666666666666668,"d":"29.7"},{"v":19.333333333333332,"d":"19.3"},null,{"v":69.83333333333333,"d":"69.8"},{"v":53.833333333333336,"d":"53.8"},{"v":74,"d":"74.0"},{"v":51.333333333333336,"d":"51.3"},{"v":27.666666666666668,"d":"27.7"},{"v":56.666666666666664,"d":"56.7"},{"v":87.16666666666667,"d":"87.2"},{"v":49.666666666666664,"d":"49.7"},{"v":80,"d":"80.0"},null,{"v":40,"d":"40.0"},{"v":27.666666666666668,"d":"27.7"},{"v":46,"d":"46.0"},{"v":46,"d":"46.0"},{"v":26.333333333333332,"d":"26.3"},{"v":46,"d":"46.0"},{"v":68.66666666666667,"d":"68.7"},{"v":49.666666666666664,"d":"49.7"},{"v":32,"d":"32.0"},{"v":55,"d":"55.0"},{"v":90.66666666666667,"d":"90.7"},{"v":38.666666666666664,"d":"38.7"},{"v":86,"d":"86.0"},{"v":51,"d":"51.0"},{"v":51.166666666666664,"d":"51.2"},{"v":69.83333333333333,"d":"69.8"},{"v":44,"d":"44.0"},{"v":50.666666666666664,"d":"50.7"},{"v":50.666666666666664,"d":"50.7"},{"v":32,"d":"32.0"},{"v":34.666666666666664,"d":"34.7"},{"v":62,"d":"62.0"},{"v":77.33333333333333,"d":"77.3"},{"v":46.666666666666664,"d":"46.7"},{"v":36.166666666666664,"d":"36.2"},{"v":53.833333333333336,"d":"53.8"},{"v":52.666666666666664,"d":"52.7"},{"v":44.666666666666664,"d":"44.7"},{"v":39.166666666666664,"d":"39.2"},{"v":32,"d":"32.0"},{"v":76.66666666666667,"d":"76.7"},{"v":43.666666666666664,"d":"43.7"},{"v":63,"d":"63.0"},null,{"v":35.333333333333336,"d":"35.3"},{"v":57.333333333333336,"d":"57.3"},null,null,50.5,{"v":68.33333333333333,"d":"68.3"},{"v":28.666666666666668,"d":"28.7"},{"v":74.83333333333333,"d":"74.8"},{"v":40,"d":"40.0"},{"v":36.666666666666664,"d":"36.7"},{"v":87.16666666666667,"d":"87.2"},{"v":32,"d":"32.0"},{"v":40.666666666666664,"d":"40.7"},{"v":39,"d":"39.0"},{"v":61,"d":"61.0"},{"v":62.666666666666664,"d":"62.7"},null,{"v":94.33333333333333,"d":"94.3"},{"v":62,"d":"62.0"},{"v":65,"d":"65.0"},{"v":47.333333333333336,"d":"47.3"},{"v":51.166666666666664,"d":"51.2"},{"v":41,"d":"41.0"},{"v":57,"d":"57.0"},{"v":48.666666666666664,"d":"48.7"},{"v":51.833333333333336,"d":"51.8"},{"v":44.333333333333336,"d":"44.3"},{"v":34,"d":"34.0"},{"v":22.666666666666668,"d":"22.7"},{"v":31.666666666666668,"d":"31.7"},{"v":36.166666666666664,"d":"36.2"},{"v":54.333333333333336,"d":"54.3"},{"v":27.666666666666668,"d":"27.7"},{"v":35.333333333333336,"d":"35.3"},{"v":68.66666666666667,"d":"68.7"},{"v":37.333333333333336,"d":"37.3"},{"v":66.33333333333333,"d":"66.3"},{"v":91.33333333333333,"d":"91.3"},{"v":50.333333333333336,"d":"50.3"},{"v":59,"d":"59.0"},{"v":63,"d":"63.0"},{"v":36.666666666666664,"d":"36.7"},{"v":31.666666666666668,"d":"31.7"},{"v":67,"d":"67.0"},null,{"v":56,"d":"56.0"},{"v":61,"d":"61.0"},{"v":54.333333333333336,"d":"54.3"},{"v":52.666666666666664,"d":"52.7"},{"v":59.666666666666664,"d":"59.7"},null,30.5,{"v":28,"d":"28.0"},{"v":30.333333333333332,"d":"30.3"},{"v":33,"d":"33.0"},{"v":46.666666666666664,"d":"46.7"},{"v":115.33333333333333,"d":"115.3"},{"v":51,"d":"51.0"},{"v":37.333333333333336,"d":"37.3"},{"v":70,"d":"70.0"},{"v":54,"d":"54.0"},{"v":42,"d":"42.0"},{"v":80.66666666666667,"d":"80.7"},{"v":23.666666666666668,"d":"23.7"},{"v":50,"d":"50.0"},{"v":50,"d":"50.0"},{"v":50,"d":"50.0"},{"v":50,"d":"50.0"},{"v":50,"d":"50.0"},{"v":63,"d":"63.0"},{"v":63,"d":"63.0"},{"v":64.66666666666667,"d":"64.7"},{"v":59.666666666666664,"d":"59.7"},{"v":54,"d":"54.0"},{"v":64,"d":"64.0"},{"v":50,"d":"50.0"},null,{"v":52,"d":"52.0"},{"v":50.666666666666664,"d":"50.7"},{"v":46,"d":"46.0"},{"v":61,"d":"61.0"},{"v":61.333333333333336,"d":"61.3"},{"v":32.166666666666664,"d":"32.2"},{"v":94.33333333333333,"d":"94.3"},{"v":49.333333333333336,"d":"49.3"},{"v":26.333333333333332,"d":"26.3"},{"v":39.166666666666664,"d":"39.2"},{"v":45.333333333333336,"d":"45.3"},{"v":37.333333333333336,"d":"37.3"},{"v":31.666666666666668,"d":"31.7"},{"v":23.333333333333332,"d":"23.3"},{"v":36,"d":"36.0"},42.5,{"v":64.33333333333333,"d":"64.3"},{"v":47.333333333333336,"d":"47.3"},{"v":30.333333333333332,"d":"30.3"},{"v":75.33333333333333,"d":"75.3"},{"v":37.333333333333336,"d":"37.3"},{"v":34,"d":"34.0"},{"v":87.16666666666667,"d":"87.2"},{"v":80,"d":"80.0"},{"v":52.333333333333336,"d":"52.3"},{"v":23.333333333333332,"d":"23.3"},{"v":26.333333333333332,"d":"26.3"},{"v":39,"d":"39.0"},{"v":46,"d":"46.0"},{"v":36.666666666666664,"d":"36.7"},{"v":23,"d":"23.0"},{"v":48.666666666666664,"d":"48.7"},{"v":54,"d":"54.0"},{"v":41.333333333333336,"d":"41.3"},{"v":55,"d":"55.0"},{"v":50,"d":"50.0"},{"v":143.16666666666666,"d":"143.2"},{"v":40.333333333333336,"d":"40.3"},{"v":37,"d":"37.0"},{"v":61,"d":"61.0"},{"v":28.666666666666668,"d":"28.7"},{"v":36,"d":"36.0"},{"v":64.66666666666667,"d":"64.7"},{"v":23.666666666666668,"d":"23.7"},{"v":37.333333333333336,"d":"37.3"},{"v":30.333333333333332,"d":"30.3"},{"v":74,"d":"74.0"},{"v":29.333333333333332,"d":"29.3"},{"v":44.666666666666664,"d":"44.7"},{"v":36.166666666666664,"d":"36.2"},{"v":28,"d":"28.0"},{"v":58,"d":"58.0"},{"v":32.333333333333336,"d":"32.3"},{"v":69,"d":"69.0"},{"v":118,"d":"118.0"},{"v":36.666666666666664,"d":"36.7"},{"v":23,"d":"23.0"},{"v":51,"d":"51.0"},{"v":70,"d":"70.0"},69.5,{"v":89.33333333333333,"d":"89.3"},{"v":29.666666666666668,"d":"29.7"},{"v":51.333333333333336,"d":"51.3"},{"v":74.66666666666667,"d":"74.7"},{"v":36,"d":"36.0"},{"v":78.83333333333333,"d":"78.8"},{"v":46,"d":"46.0"},{"v":80,"d":"80.0"},null,69.5,{"v":28.666666666666668,"d":"28.7"},{"v":61.333333333333336,"d":"61.3"},null,{"v":39.333333333333336,"d":"39.3"},{"v":51,"d":"51.0"},null,{"v":25.666666666666668,"d":"25.7"},{"v":44.666666666666664,"d":"44.7"},{"v":56,"d":"56.0"},{"v":89.33333333333333,"d":"89.3"},{"v":89.33333333333333,"d":"89.3"},{"v":54,"d":"54.0"},{"v":54,"d":"54.0"},{"v":89.33333333333333,"d":"89.3"},{"v":46.333333333333336,"d":"46.3"},{"v":62.333333333333336,"d":"62.3"},{"v":77.33333333333333,"d":"77.3"},{"v":32.666666666666664,"d":"32.7"},{"v":76.66666666666667,"d":"76.7"},{"v":54,"d":"54.0"},69.5,69.5,{"v":37.333333333333336,"d":"37.3"},{"v":118,"d":"118.0"},50.5,50.5,{"v":43.666666666666664,"d":"43.7"},{"v":51.333333333333336,"d":"51.3"},{"v":60.666666666666664,"d":"60.7"},{"v":74.83333333333333,"d":"74.8"},{"v":23,"d":"23.0"},{"v":44.666666666666664,"d":"44.7"},{"v":40.666666666666664,"d":"40.7"},{"v":102.66666666666667,"d":"102.7"},{"v":47.333333333333336,"d":"47.3"},{"v":47.333333333333336,"d":"47.3"},null,{"v":59,"d":"59.0"},{"v":42.666666666666664,"d":"42.7"},{"v":56.666666666666664,"d":"56.7"},{"v":71.33333333333333,"d":"71.3"},54.5,{"v":34.333333333333336,"d":"34.3"},{"v":52.333333333333336,"d":"52.3"},{"v":59.666666666666664,"d":"59.7"},{"v":61.333333333333336,"d":"61.3"},{"v":74,"d":"74.0"},{"v":62.333333333333336,"d":"62.3"},{"v":39,"d":"39.0"},{"v":54.333333333333336,"d":"54.3"},null,{"v":42.666666666666664,"d":"42.7"},{"v":29.333333333333332,"d":"29.3"},{"v":62.333333333333336,"d":"62.3"},54.5,{"v":118,"d":"118.0"},{"v":43,"d":"43.0"},{"v":47.333333333333336,"d":"47.3"},{"v":40.333333333333336,"d":"40.3"},{"v":91.33333333333333,"d":"91.3"},{"v":47.333333333333336,"d":"47.3"},{"v":48.166666666666664,"d":"48.2"},{"v":63,"d":"63.0"},null,{"v":54,"d":"54.0"},{"v":32.666666666666664,"d":"32.7"},null,{"v":56.666666666666664,"d":"56.7"},{"v":54,"d":"54.0"},{"v":61.833333333333336,"d":"61.8"},{"v":17.666666666666668,"d":"17.7"},{"v":80.66666666666667,"d":"80.7"},{"v":17.666666666666668,"d":"17.7"},{"v":41.333333333333336,"d":"41.3"},{"v":56.666666666666664,"d":"56.7"},{"v":50.666666666666664,"d":"50.7"},{"v":36.166666666666664,"d":"36.2"},{"v":44.666666666666664,"d":"44.7"},{"v":63,"d":"63.0"},{"v":65,"d":"65.0"},{"v":89.33333333333333,"d":"89.3"},{"v":19.333333333333332,"d":"19.3"},{"v":57.833333333333336,"d":"57.8"},{"v":50.666666666666664,"d":"50.7"},{"v":36.666666666666664,"d":"36.7"},{"v":108.16666666666667,"d":"108.2"},{"v":87.16666666666667,"d":"87.2"},{"v":39,"d":"39.0"},{"v":40.666666666666664,"d":"40.7"},null,{"v":25,"d":"25.0"},{"v":56.666666666666664,"d":"56.7"},{"v":64.33333333333333,"d":"64.3"},30.5,{"v":63,"d":"63.0"},{"v":39.333333333333336,"d":"39.3"},25.5,{"v":32,"d":"32.0"},{"v":47.333333333333336,"d":"47.3"},{"v":47.333333333333336,"d":"47.3"},{"v":46.333333333333336,"d":"46.3"},{"v":118,"d":"118.0"},{"v":51.833333333333336,"d":"51.8"},{"v":26,"d":"26.0"}]
["EIQ Impacto trabalhador rural (<  80; 80 - 128; > 128)",null,{"v":90,"d":"90.0"},{"v":100,"d":"100.0"},{"v":150,"d":"150.0"},{"v":48,"d":"48.0"},{"v":64,"d":"64.0"},{"v":40,"d":"40.0"},{"v":40,"d":"40.0"},{"v":40,"d":"40.0"},{"v":32,"d":"32.0"},{"v":60,"d":"60.0"},{"v":80,"d":"80.0"},{"v":48,"d":"48.0"},{"v":56,"d":"56.0"},{"v":80,"d":"80.0"},{"v":28,"d":"28.0"},{"v":100,"d":"100.0"},{"v":80,"d":"80.0"},{"v":64,"d":"64.0"},{"v":56,"d":"56.0"},{"v":72,"d":"72.0"},{"v":90,"d":"90.0"},{"v":64,"d":"64.0"},{"v":24,"d":"24.0"},{"v":24,"d":"24.0"},{"v":64,"d":"64.0"},{"v":80,"d":"80.0"},{"v":64,"d":"64.0"},{"v":60,"d":"60.0"},{"v":36,"d":"36.0"},{"v":48,"d":"48.0"},{"v":100,"d":"100.0"},{"v":60,"d":"60.0"},{"v":80,"d":"80.0"},{"v":64,"d":"64.0"},{"v":24,"d":"24.0"},{"v":24,"d":"24.0"},null,{"v":90,"d":"90.0"},{"v":80,"d":"80.0"},{"v":72,"d":"72.0"},{"v":120,"d":"120.0"},{"v":150,"d":"150.0"},{"v":80,"d":"80.0"},{"v":64,"d":"64.0"},{"v":56,"d":"56.0"},{"v":80,"d":"80.0"},{"v":72,"d":"72.0"},{"v":100,"d":"100.0"},{"v":72,"d":"72.0"},{"v":80,"d":"80.0"},{"v":90,"d":"90.0"},{"v":80,"d":"80.0"},{"v":100,"d":"100.0"},{"v":80,"d":"80.0"},{"v":80,"d":"80.0"},{"v":48,"d":"48.0"},null,{"v":80,"d":"80.0"},{"v":80,"d":"80.0"},{"v":60,"d":"60.0"},{"v":80,"d":"80.0"},{"v":90,"d":"90.0"},null,{"v":64,"d":"64.0"},{"v":64,"d":"64.0"},{"v":40,"d":"40.0"},{"v":70,"d":"70.0"},{"v":56,"d":"56.0"},{"v":56,"d":"56.0"},{"v":64,"d":"64.0"},{"v":72,"d":"72.0"},{"v":72,"d":"72.0"},{"v":32,"d":"32.0"},{"v":72,"d":"72.0"},{"v":100,"d":"100.0"},{"v":70,"d":"70.0"},{"v":70,"d":"70.0"},{"v":72,"d":"72.0"},{"v":56,"d":"56.0"},{"v":80,"d":"80.0"},{"v":40,"d":"40.0"},{"v":80,"d":"80.0"},{"v":80,"d":"80.0"},{"v":32,"d":"32.0"},{"v":80,"d":"80.0"},{"v":72,"d":"72.0"},{"v":64,"d":"64.0"},{"v":60,"d":"60.0"},{"v":32,"d":"32.0"},{"v":80,"d":"80.0"},{"v":80,"d":"80.0"},{"v":40,"d":"40.0"},{"v":80,"d":"80.0"},{"v":32,"d":"32.0"},{"v":80,"d":"80.0"},{"v":32,"d":"32.0"},{"v":80,"d":"80.0"},{"v":48,"d":"48.0"},{"v":48,"d":"48.0"},{"v":80,"d":"80.0"},{"v":72,"d":"72.0"},{"v":72,"d":"72.0"},{"v":70,"d":"70.0"},{"v":48,"d":"48.0"},{"v":74,"d":"74.0"},{"v":80,"d":"80.0"},{"v":60,"d":"60.0"},{"v":60,"d":"60.0"},{"v":72,"d":"72.0"},{"v":64,"d":"64.0"},{"v":250,"d":"250.0"},{"v":80,"d":"80.0"},{"v":90,"d":"90.0"},{"v":90,"d":"90.0"},{"v":72,"d":"72.0"},{"v":90,"d":"90.0"},{"v":90,"d":"90.0"},{"v":100,"d":"100.0"},{"v":80,"d":"80.0"},{"v":80,"d":"80.0"},{"v":80,"d":"80.0"},{"v":80,"d":"80.0"},{"v":56,"d":"56.0"},{"v":80,"d":"80.0"},{"v":70,"d":"70.0"},{"v":64,"d":"64.0"},{"v":64,"d":"64.0"},null,null,{"v":100,"d":"100.0"},{"v":80,"d":"80.0"},{"v":105,"d":"105.0"},{"v":40,"d":"40.0"},{"v":150,"d":"150.0"},{"v":56,"d":"56.0"},{"v":64,"d":"64.0"},{"v":100,"d":"100.0"},{"v":80,"d":"80.0"},{"v":80,"d":"80.0"},{"v":90,"d":"90.0"},{"v":32,"d":"32.0"},{"v":60,"d":"60.0"},{"v":40,"d":"40.0"},{"v":80,"d":"80.0"},{"v":80,"d":"80.0"},{"v":32,"d":"32.0"},{"v":90,"d":"90.0"},{"v":64,"d":"64.0"},{"v":60,"d":"60.0"},{"v":80,"d":"80.0"},{"v":100,"d":"100.0"},{"v":72,"d":"72.0"},{"v":100,"d":"100.0"},{"v":64,"d":"64.0"},{"v":64,"d":"64.0"},{"v":48,"d":"48.0"},{"v":60,"d":"60.0"},{"v":32,"d":"32.0"},{"v":48,"d":"48.0"},null,{"v":48,"d":"48.0"},{"v":90,"d":"90.0"},{"v":64,"d":"64.0"},{"v":64,"d":"64.0"},{"v":64,"d":"64.0"},{"v":80,"d":"80.0"},{"v":105,"d":"105.0"},{"v":100,"d":"100.0"},{"v":80,"d":"80.0"},{"v":80,"d":"80.0"},{"v":64,"d":"64.0"},{"v":80,"d":"80.0"},{"v":60,"d":"60.0"},{"v":64,"d":"64.0"},{"v":32,"d":"32.0"},{"v":80,"d":"80.0"},{"v":200,"d":"200.0"},{"v":80,"d":"80.0"},{"v":70,"d":"70.0"},{"v":60,"d":"60.0"},{"v":28,"d":"28.0"},{"v":80,"d":"80.0"},{"v":72,"d":"72.0"},{"v":90,"d":"90.0"},{"v":80,"d":"80.0"},{"v":80,"d":"80.0"},{"v":80,"d":"80.0"},{"v":48,"d":"48.0"},{"v":72,"d":"72.0"},{"v":80,"d":"80.0"},{"v":80,"d":"80.0"},{"v":80,"d":"80.0"},{"v":48,"d":"48.0"},{"v":80,"d":"80.0"},{"v":80,"d":"80.0"},{"v":28,"d":"28.0"},{"v":32,"d":"32.0"},{"v":72,"d":"72.0"},{"v":64,"d":"64.0"},{"v":32,"d":"32.0"},{"v":72,"d":"72.0"},{"v":100,"d":"100.0"},{"v":100,"d":"100.0"},{"v":70,"d":"70.0"},{"v":64,"d":"64.0"},{"v":70,"d":"70.0"},{"v":100,"d":"100.0"},null,{"v":72,"d":"72.0"},{"v":48,"d":"48.0"},{"v":60,"d":"60.0"},{"v":80,"d":"80.0"},{"v":80,"d":"80.0"},{"v":60,"d":"60.0"},{"v":90,"d":"90.0"},{"v":32,"d":"32.0"},{"v":56,"d":"56.0"},{"v":56,"d":"56.0"},null,{"v":30,"d":"30.0"},{"v":70,"d":"70.0"},{"v":72,"d":"72.0"},{"v":60,"d":"60.0"},{"v":64,"d":"64.0"},{"v":28,"d":"28.0"},{"v":72,"d":"72.0"},{"v":32,"d":"32.0"},{"v":32,"d":"32.0"},{"v":100,"d":"100.0"},{"v":60,"d":"60.0"},{"v":80,"d":"80.0"},{"v":32,"d":"32.0"},{"v":64,"d":"64.0"},{"v":60,"d":"60.0"},{"v":70,"d":"70.0"},{"v":80,"d":"80.0"},{"v":72,"d":"72.0"},{"v":64,"d":"64.0"},{"v":60,"d":"60.0"},{"v":64,"d":"64.0"},{"v":64,"d":"64.0"},null,{"v":40,"d":"40.0"},{"v":70,"d":"70.0"},{"v":56,"d":"56.0"},{"v":80,"d":"80.0"},{"v":80,"d":"80.0"},{"v":64,"d":"64.0"},{"v":80,"d":"80.0"},{"v":60,"d":"60.0"},{"v":80,"d":"80.0"},{"v":56,"d":"56.0"},{"v":135,"d":"135.0"},{"v":48,"d":"48.0"},{"v":64,"d":"64.0"},{"v":70,"d":"70.0"},{"v":48,"d":"48.0"},{"v":48,"d":"48.0"},{"v":120,"d":"120.0"},{"v":90,"d":"90.0"},{"v":60,"d":"60.0"},{"v":105,"d":"105.0"},{"v":72,"d":"72.0"},{"v":80,"d":"80.0"},{"v":96,"d":"96.0"},{"v":80,"d":"80.0"},{"v":56,"d":"56.0"},{"v":32,"d":"32.0"},{"v":64,"d":"64.0"},{"v":64,"d":"64.0"},{"v":70,"d":"70.0"},{"v":72,"d":"72.0"},{"v":100,"d":"100.0"},{"v":32,"d":"32.0"},{"v":32,"d":"32.0"},{"v":80,"d":"80.0"},{"v":80,"d":"80.0"},{"v":64,"d":"64.0"},{"v":72,"d":"72.0"},{"v":64,"d":"64.0"},null,{"v":80,"d":"80.0"},{"v":40,"d":"40.0"},{"v":150,"d":"150.0"},{"v":72,"d":"72.0"},{"v":70,"d":"70.0"},{"v":90,"d":"90.0"},{"v":90,"d":"90.0"},{"v":96,"d":"96.0"},{"v":32,"d":"32.0"},{"v":40,"d":"40.0"},{"v":64,"d":"64.0"},{"v":64,"d":"64.0"},null,{"v":90,"d":"90.0"},{"v":90,"d":"90.0"},{"v":80,"d":"80.0"},{"v":64,"d":"64.0"},{"v":80,"d":"80.0"},{"v":80,"d":"80.0"},{"v":80,"d":"80.0"},{"v":70,"d":"70.0"},{"v":96,"d":"96.0"},{"v":64,"d":"64.0"},{"v":100,"d":"100.0"},{"v":56,"d":"56.0"},{"v":40,"d":"40.0"},{"v":120,"d":"120.0"},{"v":72,"d":"72.0"},{"v":32,"d":"32.0"},null,{"v":80,"d":"80.0"},{"v":24,"d":"24.0"},{"v":80,"d":"80.0"},{"v":64,"d":"64.0"},{"v":80,"d":"80.0"},{"v":80,"d":"80.0"},{"v":60,"d":"60.0"},{"v":80,"d":"80.0"},{"v":48,"d":"48.0"},{"v":64,"d":"64.0"},{"v":70,"d":"70.0"},{"v":64,"d":"64.0"},{"v":80,"d":"80.0"},{"v":56,"d":"56.0"},{"v":24,"d":"24.0"},{"v":80,"d":"80.0"},{"v":32,"d":"32.0"},{"v":80,"d":"80.0"},{"v":64,"d":"64.0"},{"v":100,"d":"100.0"},{"v":24,"d":"24.0"},{"v":80,"d":"80.0"},null,null,{"v":80,"d":"80.0"},{"v":64,"d":"64.0"},{"v":128,"d":"128.0"},{"v":80,"d":"80.0"},{"v":80,"d":"80.0"},{"v":100,"d":"100.0"},{"v":100,"d":"100.0"},{"v":80,"d":"80.0"},null,{"v":32,"d":"32.0"},{"v":80,"d":"80.0"},{"v":32,"d":"32.0"},{"v":32,"d":"32.0"},{"v":60,"d":"60.0"},{"v":90,"d":"90.0"},{"v":150,"d":"150.0"},null,{"v":80,"d":"80.0"},{"v":60,"d":"60.0"},{"v":70,"d":"70.0"},{"v":90,"d":"90.0"},{"v":80,"d":"80.0"},{"v":64,"d":"64.0"},{"v":32,"d":"32.0"},{"v":80,"d":"80.0"},{"v":80,"d":"80.0"},{"v":90,"d":"90.0"},{"v":80,"d":"80.0"},{"v":80,"d":"80.0"},{"v":48,"d":"48.0"},{"v":80,"d":"80.0"},{"v":80,"d":"80.0"},{"v":80,"d":"80.0"},{"v":60,"d":"60.0"},{"v":32,"d":"32.0"},{"v":84,"d":"84.0"},{"v":60,"d":"60.0"},{"v":80,"d":"80.0"},{"v":80,"d":"80.0"},{"v":80,"d":"80.0"},{"v":80,"d":"80.0"},{"v":80,"d":"80.0"},{"v":105,"d":"105.0"},{"v":48,"d":"48.0"},{"v":32,"d":"32.0"},{"v":24,"d":"24.0"},null,{"v":84,"d":"84.0"},{"v":70,"d":"70.0"},{"v":100,"d":"100.0"},{"v":64,"d":"64.0"},{"v":60,"d":"60.0"},{"v":80,"d":"80.0"},{"v":105,"d":"105.0"},{"v":72,"d":"72.0"},{"v":100,"d":"100.0"},null,{"v":60,"d":"60.0"},{"v":32,"d":"32.0"},{"v":80,"d":"80.0"},{"v":80,"d":"80.0"},{"v":14,"d":"14.0"},{"v":80,"d":"80.0"},{"v":70,"d":"70.0"},{"v":72,"d":"72.0"},{"v":36,"d":"36.0"},{"v":72,"d":"72.0"},{"v":72,"d":"72.0"},{"v":64,"d":"64.0"},{"v":72,"d":"72.0"},{"v":48,"d":"48.0"},{"v":90,"d":"90.0"},{"v":128,"d":"128.0"},{"v":80,"d":"80.0"},{"v":60,"d":"60.0"},{"v":60,"d":"60.0"},{"v":36,"d":"36.0"},{"v":60,"d":"60.0"},{"v":64,"d":"64.0"},{"v":120,"d":"120.0"},{"v":80,"d":"80.0"},{"v":30,"d":"30.0"},{"v":70,"d":"70.0"},{"v":64,"d":"64.0"},{"v":80,"d":"80.0"},{"v":60,"d":"60.0"},{"v":64,"d":"64.0"},{"v":80,"d":"80.0"},{"v":40,"d":"40.0"},{"v":96,"d":"96.0"},null,{"v":48,"d":"48.0"},{"v":40,"d":"40.0"},null,null,{"v":70,"d":"70.0"},{"v":80,"d":"80.0"},{"v":48,"d":"48.0"},{"v":80,"d":"80.0"},{"v":60,"d":"60.0"},{"v":40,"d":"40.0"},{"v":105,"d":"105.0"},{"v":64,"d":"64.0"},{"v":64,"d":"64.0"},{"v":64,"d":"64.0"},{"v":90,"d":"90.0"},{"v":80,"d":"80.0"},null,{"v":100,"d":"100.0"},{"v":64,"d":"64.0"},{"v":72,"d":"72.0"},{"v":40,"d":"40.0"},{"v":90,"d":"90.0"},{"v":80,"d":"80.0"},{"v":70,"d":"70.0"},{"v":60,"d":"60.0"},{"v":64,"d":"64.0"},{"v":64,"d":"64.0"},{"v":48,"d":"48.0"},{"v":32,"d":"32.0"},{"v":60,"d":"60.0"},{"v":64,"d":"64.0"},{"v":64,"d":"64.0"},{"v":60,"d":"60.0"},{"v":48,"d":"48.0"},{"v":100,"d":"100.0"},{"v":64,"d":"64.0"},{"v":90,"d":"90.0"},{"v":100,"d":"100.0"},{"v":90,"d":"90.0"},{"v":72,"d":"72.0"},{"v":96,"d":"96.0"},{"v":64,"d":"64.0"},{"v":60,"d":"60.0"},{"v":80,"d":"80.0"},null,{"v":60,"d":"60.0"},{"v":64,"d":"64.0"},{"v":64,"d":"64.0"},{"v":70,"d":"70.0"},{"v":80,"d":"80.0"},null,{"v":48,"d":"48.0"},{"v":32,"d":"32.0"},{"v":48,"d":"48.0"},{"v":28,"d":"28.0"},{"v":80,"d":"80.0"},{"v":100,"d":"100.0"},{"v":80,"d":"80.0"},{"v":64,"d":"64.0"},{"v":80,"d":"80.0"},{"v":70,"d":"70.0"},{"v":48,"d":"48.0"},{"v":80,"d":"80.0"},{"v":32,"d":"32.0"},{"v":80,"d":"80.0"},{"v":80,"d":"80.0"},{"v":80,"d":"80.0"},{"v":80,"d":"80.0"},{"v":80,"d":"80.0"},{"v":72,"d":"72.0"},{"v":72,"d":"72.0"},{"v":72,"d":"72.0"},{"v":80,"d":"80.0"},{"v":90,"d":"90.0"},{"v":72,"d":"72.0"},{"v":90,"d":"90.0"},null,{"v":64,"d":"64.0"},{"v":80,"d":"80.0"},{"v":80,"d":"80.0"},{"v":90,"d":"90.0"},{"v":80,"d":"80.0"},{"v":56,"d":"56.0"},{"v":100,"d":"100.0"},{"v":80,"d":"80.0"},{"v":48,"d":"48.0"},{"v":60,"d":"60.0"},{"v":64,"d":"64.0"},{"v":60,"d":"60.0"},{"v":60,"d":"60.0"},{"v":32,"d":"32.0"},{"v":64,"d":"64.0"},{"v":72,"d":"72.0"},{"v":80,"d":"80.0"},{"v":40,"d":"40.0"},{"v":48,"d":"48.0"},{"v":80,"d":"80.0"},{"v":64,"d":"64.0"},{"v":60,"d":"60.0"},{"v":105,"d":"105.0"},{"v":105,"d":"105.0"},{"v":48,"d":"48.0"},{"v":32,"d":"32.0"},{"v":14,"d":"14.0"},{"v":64,"d":"64.0"},{"v":80,"d":"80.0"},{"v":40,"d":"40.0"},{"v":32,"d":"32.0"},{"v":60,"d":"60.0"},{"v":90,"d":"90.0"},{"v":80,"d":"80.0"},{"v":90,"d":"90.0"},{"v":56,"d":"56.0"},{"v":250,"d":"250.0"},{"v":60,"d":"60.0"},{"v":64,"d":"64.0"},{"v":64,"d":"64.0"},{"v":48,"d":"48.0"},{"v":64,"d":"64.0"},{"v":72,"d":"72.0"},{"v":32,"d":"32.0"},{"v":64,"d":"64.0"},{"v":48,"d":"48.0"},{"v":100,"d":"100.0"},{"v":56,"d":"56.0"},{"v":80,"d":"80.0"},{"v":30,"d":"30.0"},{"v":32,"d":"32.0"},{"v":80,"d":"80.0"},{"v":60,"d":"60.0"},{"v":64,"d":"64.0"},{"v":150,"d":"150.0"},{"v":64,"d":"64.0"},{"v":48,"d":"48.0"},{"v":80,"d":"80.0"},{"v":60,"d":"60.0"},{"v":80,"d":"80.0"},{"v":100,"d":"100.0"},{"v":32,"d":"32.0"},{"v":64,"d":"64.0"},{"v":72,"d":"72.0"},{"v":64,"d":"64.0"},{"v":120,"d":"120.0"},{"v":80,"d":"80.0"},{"v":105,"d":"105.0"},null,{"v":80,"d":"80.0"},{"v":48,"d":"48.0"},{"v":80,"d":"80.0"},null,{"v":64,"d":"64.0"},{"v":80,"d":"80.0"},null,{"v":36,"d":"36.0"},{"v":56,"d":"56.0"},{"v":60,"d":"60.0"},{"v":135,"d":"135.0"},{"v":135,"d":"135.0"},{"v":90,"d":"90.0"},{"v":90,"d":"90.0"},{"v":135,"d":"135.0"},{"v":80,"d":"80.0"},{"v":100,"d":"100.0"},{"v":120,"d":"120.0"},{"v":60,"d":"60.0"},{"v":80,"d":"80.0"},{"v":80,"d":"80.0"},{"v":80,"d":"80.0"},{"v":80,"d":"80.0"},{"v":60,"d":"60.0"},{"v":150,"d":"150.0"},{"v":70,"d":"70.0"},{"v":70,"d":"70.0"},{"v":40,"d":"40.0"},{"v":64,"d":"64.0"},{"v":80,"d":"80.0"},{"v":80,"d":"80.0"},{"v":48,"d":"48.0"},{"v":80,"d":"80.0"},{"v":80,"d":"80.0"},{"v":200,"d":"200.0"},{"v":64,"d":"64.0"},{"v":64,"d":"64.0"},null,{"v":64,"d":"64.0"},{"v":80,"d":"80.0"},{"v":80,"d":"80.0"},{"v":64,"d":"64.0"},{"v":90,"d":"90.0"},{"v":28,"d":"28.0"},{"v":100,"d":"100.0"},{"v":80,"d":"80.0"},{"v":80,"d":"80.0"},{"v":100,"d":"100.0"},{"v":100,"d":"100.0"},{"v":64,"d":"64.0"},{"v":64,"d":"64.0"},null,{"v":32,"d":"32.0"},{"v":48,"d":"48.0"},{"v":100,"d":"100.0"},{"v":80,"d":"80.0"},{"v":150,"d":"150.0"},{"v":80,"d":"80.0"},{"v":80,"d":"80.0"},{"v":60,"d":"60.0"},{"v":100,"d":"100.0"},{"v":40,"d":"40.0"},{"v":90,"d":"90.0"},{"v":72,"d":"72.0"},null,{"v":80,"d":"80.0"},{"v":32,"d":"32.0"},null,{"v":80,"d":"80.0"},{"v":70,"d":"70.0"},{"v":100,"d":"100.0"},{"v":24,"d":"24.0"},{"v":80,"d":"80.0"},{"v":24,"d":"24.0"},{"v":80,"d":"80.0"},{"v":72,"d":"72.0"},{"v":60,"d":"60.0"},{"v":64,"d":"64.0"},{"v":80,"d":"80.0"},{"v":72,"d":"72.0"},{"v":72,"d":"72.0"},{"v":100,"d":"100.0"},{"v":24,"d":"24.0"},{"v":40,"d":"40.0"},{"v":60,"d":"60.0"},{"v":48,"d":"48.0"},{"v":150,"d":"150.0"},{"v":105,"d":"105.0"},{"v":64,"d":"64.0"},{"v":64,"d":"64.0"},null,{"v":32,"d":"32.0"},{"v":80,"d":"80.0"},{"v":64,"d":"64.0"},{"v":48,"d":"48.0"},{"v":72,"d":"72.0"},{"v":64,"d":"64.0"},{"v":32,"d":"32.0"},{"v":64,"d":"64.0"},{"v":80,"d":"80.0"},{"v":80,"d":"80.0"},{"v":80,"d":"80.0"},{"v":150,"d":"150.0"},{"v":64,"d":"64.0"},{"v":32,"d":"32.0"}]
["EIQ Impacto consumidor (< 20,5; 20,5 - 36,25; > 36,25)",null,{"v":9,"d":"9.0"},{"v":77,"d":"77.0"},19.5,{"v":10,"d":"10.0"},{"v":11,"d":"11.0"},{"v":33,"d":"33.0"},{"v":33,"d":"33.0"},{"v":33,"d":"33.0"},{"v":15,"d":"15.0"},{"v":8,"d":"8.0"},{"v":32,"d":"32.0"},{"v":11,"d":"11.0"},{"v":9,"d":"9.0"},{"v":47,"d":"47.0"},{"v":19,"d":"19.0"},{"v":20,"d":"20.0"},{"v":18,"d":"18.0"},{"v":11,"d":"11.0"},{"v":20,"d":"20.0"},{"v":45,"d":"45.0"},15.5,{"v":12,"d":"12.0"},{"v":7,"d":"7.0"},{"v":7,"d":"7.0"},{"v":50,"d":"50.0"},13.5,{"v":29,"d":"29.0"},15.5,{"v":10,"d":"10.0"},{"v":39,"d":"39.0"},70.5,13.5,13.5,{"v":10,"d":"10.0"},{"v":6,"d":"6.0"},{"v":6,"d":"6.0"},null,{"v":9,"d":"9.0"},{"v":18,"d":"18.0"},{"v":45,"d":"45.0"},{"v":13,"d":"13.0"},19.5,{"v":64,"d":"64.0"},{"v":11,"d":"11.0"},{"v":9,"d":"9.0"},{"v":55,"d":"55.0"},{"v":16,"d":"16.0"},70.5,{"v":39,"d":"39.0"},{"v":14,"d":"14.0"},16.5,{"v":14,"d":"14.0"},70.5,{"v":13,"d":"13.0"},{"v":13,"d":"13.0"},{"v":8,"d":"8.0"},null,{"v":19,"d":"19.0"},{"v":19,"d":"19.0"},{"v":13,"d":"13.0"},{"v":19,"d":"19.0"},{"v":18,"d":"18.0"},null,{"v":11,"d":"11.0"},{"v":20,"d":"20.0"},{"v":33,"d":"33.0"},{"v":17,"d":"17.0"},{"v":21,"d":"21.0"},{"v":21,"d":"21.0"},{"v":16,"d":"16.0"},{"v":45,"d":"45.0"},{"v":45,"d":"45.0"},{"v":9,"d":"9.0"},{"v":8,"d":"8.0"},{"v":78,"d":"78.0"},26.5,19.5,{"v":56,"d":"56.0"},{"v":26,"d":"26.0"},39.5,{"v":24,"d":"24.0"},{"v":32,"d":"32.0"},{"v":32,"d":"32.0"},{"v":9,"d":"9.0"},{"v":13,"d":"13.0"},{"v":13,"d":"13.0"},{"v":50,"d":"50.0"},8.5,{"v":9,"d":"9.0"},13.5,13.5,{"v":33,"d":"33.0"},{"v":32,"d":"32.0"},{"v":7,"d":"7.0"},13.5,{"v":13,"d":"13.0"},{"v":37,"d":"37.0"},{"v":11,"d":"11.0"},{"v":7,"d":"7.0"},{"v":24,"d":"24.0"},{"v":56,"d":"56.0"},{"v":56,"d":"56.0"},26.5,{"v":12,"d":"12.0"},10.4,{"v":63,"d":"63.0"},8.5,{"v":9,"d":"9.0"},{"v":16,"d":"16.0"},{"v":20,"d":"20.0"},20.5,{"v":13,"d":"13.0"},14.5,{"v":19,"d":"19.0"},{"v":56,"d":"56.0"},15.5,15.5,{"v":17,"d":"17.0"},13.5,{"v":13,"d":"13.0"},39.5,39.5,{"v":23,"d":"23.0"},39.5,{"v":32,"d":"32.0"},{"v":28,"d":"28.0"},{"v":11,"d":"11.0"},null,null,{"v":21,"d":"21.0"},{"v":16,"d":"16.0"},19.5,{"v":33,"d":"33.0"},{"v":78,"d":"78.0"},{"v":21,"d":"21.0"},{"v":10,"d":"10.0"},{"v":48,"d":"48.0"},{"v":12,"d":"12.0"},{"v":16,"d":"16.0"},{"v":18,"d":"18.0"},{"v":5,"d":"5.0"},{"v":19,"d":"19.0"},{"v":24,"d":"24.0"},{"v":14,"d":"14.0"},{"v":63,"d":"63.0"},{"v":6,"d":"6.0"},{"v":18,"d":"18.0"},{"v":9,"d":"9.0"},{"v":18,"d":"18.0"},13.5,70.5,{"v":38,"d":"38.0"},25.5,{"v":13,"d":"13.0"},{"v":10,"d":"10.0"},{"v":6,"d":"6.0"},10.5,{"v":8,"d":"8.0"},{"v":39,"d":"39.0"},null,{"v":8,"d":"8.0"},{"v":48,"d":"48.0"},{"v":13,"d":"13.0"},{"v":13,"d":"13.0"},{"v":13,"d":"13.0"},{"v":12,"d":"12.0"},19.5,{"v":78,"d":"78.0"},{"v":47,"d":"47.0"},13.5,{"v":15,"d":"15.0"},{"v":63,"d":"63.0"},{"v":48,"d":"48.0"},{"v":25,"d":"25.0"},{"v":9,"d":"9.0"},{"v":37,"d":"37.0"},{"v":33,"d":"33.0"},{"v":19,"d":"19.0"},39.5,{"v":48,"d":"48.0"},{"v":19,"d":"19.0"},{"v":12,"d":"12.0"},{"v":31,"d":"31.0"},{"v":7,"d":"7.0"},{"v":12,"d":"12.0"},{"v":12,"d":"12.0"},{"v":12,"d":"12.0"},{"v":7,"d":"7.0"},{"v":8,"d":"8.0"},{"v":16,"d":"16.0"},{"v":14,"d":"14.0"},{"v":16,"d":"16.0"},{"v":39,"d":"39.0"},39.5,39.5,{"v":4,"d":"4.0"},{"v":9,"d":"9.0"},{"v":14,"d":"14.0"},{"v":17,"d":"17.0"},{"v":10,"d":"10.0"},{"v":50,"d":"50.0"},{"v":17,"d":"17.0"},{"v":17,"d":"17.0"},26.5,{"v":38,"d":"38.0"},26.5,{"v":17,"d":"17.0"},null,{"v":52,"d":"52.0"},{"v":9,"d":"9.0"},15.5,{"v":13,"d":"13.0"},{"v":14,"d":"14.0"},15.5,{"v":9,"d":"9.0"},{"v":9,"d":"9.0"},{"v":19,"d":"19.0"},{"v":19,"d":"19.0"},null,15.5,39.5,{"v":45,"d":"45.0"},{"v":6,"d":"6.0"},{"v":38,"d":"38.0"},{"v":19,"d":"19.0"},{"v":11,"d":"11.0"},{"v":9,"d":"9.0"},{"v":7,"d":"7.0"},{"v":77,"d":"77.0"},{"v":18,"d":"18.0"},{"v":50,"d":"50.0"},{"v":9,"d":"9.0"},{"v":39,"d":"39.0"},{"v":11,"d":"11.0"},8.5,{"v":13,"d":"13.0"},{"v":11,"d":"11.0"},{"v":9,"d":"9.0"},{"v":6,"d":"6.0"},{"v":10,"d":"10.0"},{"v":11,"d":"11.0"},null,{"v":33,"d":"33.0"},8.5,{"v":22,"d":"22.0"},{"v":19,"d":"19.0"},{"v":19,"d":"19.0"},{"v":20,"d":"20.0"},{"v":50,"d":"50.0"},{"v":8,"d":"8.0"},13.5,{"v":21,"d":"21.0"},14.5,{"v":5,"d":"5.0"},{"v":17,"d":"17.0"},{"v":16,"d":"16.0"},{"v":7,"d":"7.0"},{"v":20,"d":"20.0"},13.5,13.5,{"v":8,"d":"8.0"},{"v":17,"d":"17.0"},{"v":50,"d":"50.0"},{"v":19,"d":"19.0"},{"v":18,"d":"18.0"},{"v":32,"d":"32.0"},{"v":23,"d":"23.0"},{"v":8,"d":"8.0"},{"v":10,"d":"10.0"},{"v":15,"d":"15.0"},19.5,{"v":19,"d":"19.0"},{"v":21,"d":"21.0"},{"v":10,"d":"10.0"},{"v":8,"d":"8.0"},15.5,15.5,{"v":51,"d":"51.0"},{"v":57,"d":"57.0"},{"v":40,"d":"40.0"},null,{"v":14,"d":"14.0"},{"v":33,"d":"33.0"},{"v":78,"d":"78.0"},{"v":57,"d":"57.0"},39.5,15.5,15.5,{"v":18,"d":"18.0"},{"v":9,"d":"9.0"},{"v":24,"d":"24.0"},{"v":38,"d":"38.0"},{"v":29,"d":"29.0"},null,{"v":7,"d":"7.0"},{"v":18,"d":"18.0"},{"v":32,"d":"32.0"},{"v":15,"d":"15.0"},39.5,{"v":12,"d":"12.0"},13.5,39.5,{"v":18,"d":"18.0"},{"v":10,"d":"10.0"},{"v":17,"d":"17.0"},{"v":26,"d":"26.0"},{"v":10,"d":"10.0"},13.5,{"v":31,"d":"31.0"},{"v":8,"d":"8.0"},null,{"v":18,"d":"18.0"},{"v":6,"d":"6.0"},{"v":19,"d":"19.0"},{"v":11,"d":"11.0"},{"v":12,"d":"12.0"},{"v":12,"d":"12.0"},{"v":8,"d":"8.0"},{"v":12,"d":"12.0"},{"v":8,"d":"8.0"},{"v":17,"d":"17.0"},{"v":12,"d":"12.0"},{"v":16,"d":"16.0"},{"v":12,"d":"12.0"},{"v":11,"d":"11.0"},{"v":6,"d":"6.0"},{"v":14,"d":"14.0"},{"v":13,"d":"13.0"},{"v":63,"d":"63.0"},{"v":15,"d":"15.0"},{"v":26,"d":"26.0"},{"v":6,"d":"6.0"},13.5,null,null,{"v":16,"d":"16.0"},{"v":25,"d":"25.0"},{"v":12,"d":"12.0"},{"v":14,"d":"14.0"},{"v":12,"d":"12.0"},{"v":62,"d":"62.0"},{"v":62,"d":"62.0"},{"v":64,"d":"64.0"},null,{"v":9,"d":"9.0"},{"v":20,"d":"20.0"},{"v":11,"d":"11.0"},{"v":13,"d":"13.0"},{"v":48,"d":"48.0"},{"v":7,"d":"7.0"},{"v":78,"d":"78.0"},null,{"v":55,"d":"55.0"},15.5,{"v":17,"d":"17.0"},{"v":48,"d":"48.0"},13.5,{"v":19,"d":"19.0"},{"v":6,"d":"6.0"},{"v":14,"d":"14.0"},{"v":47,"d":"47.0"},{"v":18,"d":"18.0"},{"v":12,"d":"12.0"},14.5,{"v":7,"d":"7.0"},{"v":47,"d":"47.0"},{"v":16,"d":"16.0"},{"v":16,"d":"16.0"},{"v":8,"d":"8.0"},{"v":9,"d":"9.0"},{"v":15,"d":"15.0"},15.5,{"v":16,"d":"16.0"},{"v":19,"d":"19.0"},{"v":13,"d":"13.0"},14.5,{"v":24,"d":"24.0"},19.5,{"v":12,"d":"12.0"},{"v":7,"d":"7.0"},{"v":7,"d":"7.0"},null,{"v":15,"d":"15.0"},26.5,{"v":17,"d":"17.0"},{"v":20,"d":"20.0"},{"v":8,"d":"8.0"},{"v":18,"d":"18.0"},19.5,{"v":31,"d":"31.0"},{"v":62,"d":"62.0"},null,{"v":7,"d":"7.0"},{"v":13,"d":"13.0"},{"v":13,"d":"13.0"},{"v":13,"d":"13.0"},{"v":8,"d":"8.0"},{"v":13,"d":"13.0"},{"v":32,"d":"32.0"},{"v":31,"d":"31.0"},{"v":18,"d":"18.0"},{"v":19,"d":"19.0"},{"v":52,"d":"52.0"},{"v":12,"d":"12.0"},{"v":56,"d":"56.0"},{"v":7,"d":"7.0"},15.5,{"v":12,"d":"12.0"},{"v":13,"d":"13.0"},13.5,13.5,{"v":18,"d":"18.0"},{"v":9,"d":"9.0"},{"v":44,"d":"44.0"},{"v":13,"d":"13.0"},{"v":13,"d":"13.0"},15.5,26.5,{"v":19,"d":"19.0"},{"v":14,"d":"14.0"},15.5,{"v":11,"d":"11.0"},{"v":63,"d":"63.0"},{"v":31,"d":"31.0"},{"v":53,"d":"53.0"},null,{"v":12,"d":"12.0"},{"v":33,"d":"33.0"},null,null,39.5,{"v":13,"d":"13.0"},{"v":10,"d":"10.0"},{"v":55,"d":"55.0"},{"v":7,"d":"7.0"},{"v":10,"d":"10.0"},19.5,{"v":11,"d":"11.0"},{"v":9,"d":"9.0"},{"v":9,"d":"9.0"},18.5,{"v":20,"d":"20.0"},null,{"v":77,"d":"77.0"},{"v":44,"d":"44.0"},{"v":57,"d":"57.0"},{"v":33,"d":"33.0"},15.5,{"v":13,"d":"13.0"},{"v":16,"d":"16.0"},{"v":17,"d":"17.0"},{"v":44,"d":"44.0"},{"v":27,"d":"27.0"},{"v":8,"d":"8.0"},{"v":8,"d":"8.0"},{"v":8,"d":"8.0"},{"v":13,"d":"13.0"},{"v":17,"d":"17.0"},{"v":8,"d":"8.0"},{"v":12,"d":"12.0"},{"v":26,"d":"26.0"},{"v":14,"d":"14.0"},13.5,{"v":78,"d":"78.0"},{"v":19,"d":"19.0"},{"v":39,"d":"39.0"},{"v":53,"d":"53.0"},{"v":10,"d":"10.0"},{"v":19,"d":"19.0"},{"v":47,"d":"47.0"},null,{"v":11,"d":"11.0"},{"v":13,"d":"13.0"},{"v":39,"d":"39.0"},{"v":12,"d":"12.0"},{"v":37,"d":"37.0"},null,{"v":9,"d":"9.0"},{"v":8,"d":"8.0"},{"v":5,"d":"5.0"},{"v":4,"d":"4.0"},{"v":13,"d":"13.0"},{"v":78,"d":"78.0"},{"v":24,"d":"24.0"},{"v":10,"d":"10.0"},{"v":32,"d":"32.0"},{"v":16,"d":"16.0"},{"v":39,"d":"39.0"},{"v":63,"d":"63.0"},{"v":10,"d":"10.0"},{"v":19,"d":"19.0"},{"v":19,"d":"19.0"},{"v":19,"d":"19.0"},{"v":19,"d":"19.0"},{"v":19,"d":"19.0"},{"v":45,"d":"45.0"},{"v":45,"d":"45.0"},{"v":50,"d":"50.0"},{"v":37,"d":"37.0"},40.5,{"v":13,"d":"13.0"},{"v":7,"d":"7.0"},null,{"v":17,"d":"17.0"},{"v":18,"d":"18.0"},{"v":13,"d":"13.0"},18.5,{"v":47,"d":"47.0"},{"v":9,"d":"9.0"},{"v":77,"d":"77.0"},{"v":32,"d":"32.0"},{"v":7,"d":"7.0"},15.5,{"v":20,"d":"20.0"},{"v":13,"d":"13.0"},{"v":8,"d":"8.0"},{"v":8,"d":"8.0"},{"v":11,"d":"11.0"},{"v":14,"d":"14.0"},{"v":47,"d":"47.0"},{"v":33,"d":"33.0"},{"v":5,"d":"5.0"},{"v":64,"d":"64.0"},{"v":14,"d":"14.0"},10.5,19.5,{"v":17,"d":"17.0"},{"v":9,"d":"9.0"},{"v":8,"d":"8.0"},{"v":8,"d":"8.0"},{"v":11,"d":"11.0"},{"v":13,"d":"13.0"},{"v":10,"d":"10.0"},{"v":7,"d":"7.0"},{"v":17,"d":"17.0"},40.5,{"v":12,"d":"12.0"},{"v":18,"d":"18.0"},{"v":9,"d":"9.0"},20.5,{"v":6,"d":"6.0"},{"v":15,"d":"15.0"},{"v":13,"d":"13.0"},{"v":10,"d":"10.0"},{"v":11,"d":"11.0"},{"v":50,"d":"50.0"},{"v":10,"d":"10.0"},{"v":10,"d":"10.0"},{"v":5,"d":"5.0"},{"v":17,"d":"17.0"},{"v":11,"d":"11.0"},{"v":14,"d":"14.0"},15.5,{"v":8,"d":"8.0"},{"v":13,"d":"13.0"},{"v":13,"d":"13.0"},{"v":40,"d":"40.0"},{"v":78,"d":"78.0"},{"v":10,"d":"10.0"},{"v":8,"d":"8.0"},{"v":24,"d":"24.0"},{"v":48,"d":"48.0"},13.5,70.5,{"v":10,"d":"10.0"},{"v":20,"d":"20.0"},{"v":56,"d":"56.0"},{"v":11,"d":"11.0"},13.5,{"v":13,"d":"13.0"},{"v":17,"d":"17.0"},null,13.5,{"v":10,"d":"10.0"},{"v":47,"d":"47.0"},null,{"v":10,"d":"10.0"},{"v":24,"d":"24.0"},null,{"v":10,"d":"10.0"},{"v":22,"d":"22.0"},{"v":11,"d":"11.0"},14.5,14.5,40.5,40.5,14.5,15.5,{"v":48,"d":"48.0"},{"v":13,"d":"13.0"},{"v":8,"d":"8.0"},{"v":63,"d":"63.0"},{"v":16,"d":"16.0"},13.5,13.5,{"v":13,"d":"13.0"},{"v":78,"d":"78.0"},39.5,39.5,{"v":31,"d":"31.0"},{"v":20,"d":"20.0"},39.5,{"v":55,"d":"55.0"},{"v":8,"d":"8.0"},{"v":14,"d":"14.0"},{"v":14,"d":"14.0"},{"v":33,"d":"33.0"},{"v":15,"d":"15.0"},{"v":15,"d":"15.0"},null,{"v":38,"d":"38.0"},{"v":12,"d":"12.0"},{"v":16,"d":"16.0"},{"v":50,"d":"50.0"},14.5,{"v":19,"d":"19.0"},{"v":20,"d":"20.0"},{"v":37,"d":"37.0"},{"v":47,"d":"47.0"},{"v":17,"d":"17.0"},{"v":48,"d":"48.0"},{"v":11,"d":"11.0"},{"v":17,"d":"17.0"},null,{"v":5,"d":"5.0"},{"v":6,"d":"6.0"},{"v":48,"d":"48.0"},{"v":18,"d":"18.0"},{"v":78,"d":"78.0"},{"v":13,"d":"13.0"},{"v":12,"d":"12.0"},{"v":6,"d":"6.0"},{"v":78,"d":"78.0"},{"v":33,"d":"33.0"},16.5,{"v":45,"d":"45.0"},null,{"v":32,"d":"32.0"},{"v":9,"d":"9.0"},null,{"v":16,"d":"16.0"},{"v":16,"d":"16.0"},25.5,{"v":5,"d":"5.0"},{"v":63,"d":"63.0"},{"v":5,"d":"5.0"},{"v":12,"d":"12.0"},{"v":38,"d":"38.0"},8.5,{"v":13,"d":"13.0"},{"v":14,"d":"14.0"},{"v":45,"d":"45.0"},{"v":57,"d":"57.0"},70.5,{"v":6,"d":"6.0"},{"v":24,"d":"24.0"},13.5,{"v":20,"d":"20.0"},19.5,19.5,{"v":11,"d":"11.0"},{"v":28,"d":"28.0"},null,{"v":9,"d":"9.0"},{"v":16,"d":"16.0"},{"v":51,"d":"51.0"},{"v":9,"d":"9.0"},{"v":45,"d":"45.0"},{"v":10,"d":"10.0"},{"v":11,"d":"11.0"},{"v":11,"d":"11.0"},{"v":12,"d":"12.0"},{"v":12,"d":"12.0"},15.5,{"v":78,"d":"78.0"},{"v":44,"d":"44.0"},{"v":6,"d":"6.0"}]
["EIQ Impacto ambiental (< 75; 75 - 136,5; > 136,5)",null,{"v":17,"d":"17.0"},{"v":106,"d":"106.0"},{"v":155,"d":"155.0"},{"v":28,"d":"28.0"},{"v":21,"d":"21.0"},{"v":69,"d":"69.0"},{"v":69,"d":"69.0"},{"v":69,"d":"69.0"},{"v":66,"d":"66.0"},{"v":30,"d":"30.0"},{"v":46,"d":"46.0"},{"v":36,"d":"36.0"},{"v":85,"d":"85.0"},{"v":74,"d":"74.0"},{"v":56,"d":"56.0"},{"v":37,"d":"37.0"},{"v":72,"d":"72.0"},{"v":33,"d":"33.0"},{"v":26,"d":"26.0"},{"v":72,"d":"72.0"},40.5,{"v":40,"d":"40.0"},{"v":27,"d":"27.0"},{"v":27,"d":"27.0"},{"v":98,"d":"98.0"},95.5,{"v":20,"d":"20.0"},{"v":42,"d":"42.0"},{"v":31,"d":"31.0"},{"v":39,"d":"39.0"},97.5,78.5,95.5,{"v":44,"d":"44.0"},34.5,34.5,null,{"v":17,"d":"17.0"},65.5,{"v":72,"d":"72.0"},{"v":36,"d":"36.0"},{"v":155,"d":"155.0"},{"v":82,"d":"82.0"},{"v":42,"d":"42.0"},31.5,89.5,{"v":76,"d":"76.0"},97.5,{"v":66,"d":"66.0"},{"v":28,"d":"28.0"},{"v":38,"d":"38.0"},{"v":34,"d":"34.0"},97.5,{"v":30,"d":"30.0"},{"v":30,"d":"30.0"},36.5,null,{"v":51,"d":"51.0"},{"v":51,"d":"51.0"},{"v":24,"d":"24.0"},{"v":51,"d":"51.0"},{"v":57,"d":"57.0"},null,{"v":33,"d":"33.0"},{"v":70,"d":"70.0"},{"v":69,"d":"69.0"},{"v":109,"d":"109.0"},{"v":39,"d":"39.0"},{"v":29,"d":"29.0"},{"v":29,"d":"29.0"},{"v":72,"d":"72.0"},{"v":72,"d":"72.0"},{"v":34,"d":"34.0"},{"v":41,"d":"41.0"},{"v":96,"d":"96.0"},{"v":65,"d":"65.0"},{"v":92,"d":"92.0"},{"v":130,"d":"130.0"},{"v":42,"d":"42.0"},62.5,109.5,{"v":98,"d":"98.0"},{"v":98,"d":"98.0"},{"v":34,"d":"34.0"},{"v":36,"d":"36.0"},{"v":107,"d":"107.0"},{"v":98,"d":"98.0"},83.5,{"v":25,"d":"25.0"},{"v":115,"d":"115.0"},{"v":115,"d":"115.0"},{"v":69,"d":"69.0"},{"v":46,"d":"46.0"},{"v":30,"d":"30.0"},{"v":115,"d":"115.0"},{"v":47,"d":"47.0"},{"v":62,"d":"62.0"},{"v":36,"d":"36.0"},{"v":98,"d":"98.0"},{"v":49,"d":"49.0"},{"v":96,"d":"96.0"},{"v":96,"d":"96.0"},{"v":65,"d":"65.0"},{"v":40,"d":"40.0"},76.3,{"v":84,"d":"84.0"},83.5,{"v":35,"d":"35.0"},{"v":76,"d":"76.0"},{"v":70,"d":"70.0"},{"v":159,"d":"159.0"},{"v":39,"d":"39.0"},{"v":59,"d":"59.0"},{"v":42,"d":"42.0"},{"v":96,"d":"96.0"},{"v":48,"d":"48.0"},{"v":48,"d":"48.0"},{"v":105,"d":"105.0"},{"v":115,"d":"115.0"},{"v":81,"d":"81.0"},62.5,62.5,{"v":20,"d":"20.0"},62.5,{"v":104,"d":"104.0"},{"v":30,"d":"30.0"},{"v":33,"d":"33.0"},null,null,{"v":91,"d":"91.0"},{"v":33,"d":"33.0"},{"v":137,"d":"137.0"},{"v":69,"d":"69.0"},{"v":126,"d":"126.0"},{"v":36,"d":"36.0"},{"v":38,"d":"38.0"},{"v":39,"d":"39.0"},{"v":50,"d":"50.0"},{"v":74,"d":"74.0"},{"v":57,"d":"57.0"},{"v":91,"d":"91.0"},{"v":16,"d":"16.0"},109.5,{"v":58,"d":"58.0"},{"v":162,"d":"162.0"},{"v":42,"d":"42.0"},{"v":39,"d":"39.0"},{"v":44,"d":"44.0"},{"v":21,"d":"21.0"},95.5,97.5,{"v":60,"d":"60.0"},{"v":60,"d":"60.0"},31.5,{"v":38,"d":"38.0"},{"v":34,"d":"34.0"},31.5,{"v":28,"d":"28.0"},{"v":39,"d":"39.0"},null,36.5,{"v":54,"d":"54.0"},31.5,31.5,31.5,{"v":50,"d":"50.0"},{"v":137,"d":"137.0"},{"v":168,"d":"168.0"},{"v":74,"d":"74.0"},95.5,{"v":91,"d":"91.0"},{"v":84,"d":"84.0"},{"v":102,"d":"102.0"},{"v":61,"d":"61.0"},{"v":26,"d":"26.0"},{"v":62,"d":"62.0"},{"v":75,"d":"75.0"},{"v":51,"d":"51.0"},{"v":42,"d":"42.0"},{"v":102,"d":"102.0"},{"v":56,"d":"56.0"},{"v":50,"d":"50.0"},{"v":46,"d":"46.0"},{"v":53,"d":"53.0"},{"v":50,"d":"50.0"},{"v":50,"d":"50.0"},{"v":50,"d":"50.0"},{"v":98,"d":"98.0"},{"v":41,"d":"41.0"},{"v":106,"d":"106.0"},{"v":71,"d":"71.0"},{"v":106,"d":"106.0"},{"v":39,"d":"39.0"},62.5,62.5,{"v":67,"d":"67.0"},{"v":100,"d":"100.0"},41.5,{"v":82,"d":"82.0"},{"v":47,"d":"47.0"},{"v":72,"d":"72.0"},{"v":79,"d":"79.0"},{"v":79,"d":"79.0"},{"v":61,"d":"61.0"},{"v":66,"d":"66.0"},{"v":61,"d":"61.0"},{"v":79,"d":"79.0"},null,{"v":148,"d":"148.0"},{"v":100,"d":"100.0"},{"v":63,"d":"63.0"},{"v":45,"d":"45.0"},{"v":71,"d":"71.0"},{"v":63,"d":"63.0"},{"v":17,"d":"17.0"},{"v":34,"d":"34.0"},{"v":44,"d":"44.0"},{"v":44,"d":"44.0"},null,{"v":63,"d":"63.0"},{"v":42,"d":"42.0"},{"v":72,"d":"72.0"},{"v":55,"d":"55.0"},{"v":75,"d":"75.0"},{"v":56,"d":"56.0"},{"v":55,"d":"55.0"},{"v":57,"d":"57.0"},{"v":50,"d":"50.0"},{"v":106,"d":"106.0"},{"v":21,"d":"21.0"},{"v":134,"d":"134.0"},{"v":46,"d":"46.0"},{"v":60,"d":"60.0"},{"v":97,"d":"97.0"},58.5,{"v":112,"d":"112.0"},{"v":55,"d":"55.0"},{"v":49,"d":"49.0"},{"v":55,"d":"55.0"},{"v":36,"d":"36.0"},{"v":30,"d":"30.0"},null,{"v":69,"d":"69.0"},58.5,{"v":56,"d":"56.0"},{"v":51,"d":"51.0"},{"v":51,"d":"51.0"},{"v":52,"d":"52.0"},{"v":134,"d":"134.0"},{"v":15,"d":"15.0"},95.5,{"v":36,"d":"36.0"},118.5,{"v":38,"d":"38.0"},{"v":75,"d":"75.0"},{"v":85,"d":"85.0"},{"v":98,"d":"98.0"},{"v":42,"d":"42.0"},{"v":103,"d":"103.0"},95.5,{"v":15,"d":"15.0"},{"v":118,"d":"118.0"},{"v":72,"d":"72.0"},{"v":58,"d":"58.0"},33.5,{"v":50,"d":"50.0"},{"v":20,"d":"20.0"},56.5,{"v":36,"d":"36.0"},{"v":91,"d":"91.0"},{"v":92,"d":"92.0"},{"v":74,"d":"74.0"},{"v":91,"d":"91.0"},{"v":29,"d":"29.0"},{"v":30,"d":"30.0"},43.5,43.5,{"v":78,"d":"78.0"},{"v":66,"d":"66.0"},{"v":103,"d":"103.0"},null,{"v":34,"d":"34.0"},{"v":99,"d":"99.0"},{"v":126,"d":"126.0"},{"v":66,"d":"66.0"},{"v":42,"d":"42.0"},40.5,40.5,33.5,{"v":46,"d":"46.0"},109.5,{"v":66,"d":"66.0"},{"v":20,"d":"20.0"},null,{"v":46,"d":"46.0"},{"v":39,"d":"39.0"},{"v":36,"d":"36.0"},{"v":91,"d":"91.0"},62.5,{"v":50,"d":"50.0"},95.5,{"v":42,"d":"42.0"},33.5,{"v":36,"d":"36.0"},{"v":105,"d":"105.0"},{"v":42,"d":"42.0"},{"v":60,"d":"60.0"},{"v":103,"d":"103.0"},{"v":46,"d":"46.0"},56.5,null,{"v":54,"d":"54.0"},34.5,{"v":51,"d":"51.0"},{"v":30,"d":"30.0"},{"v":50,"d":"50.0"},{"v":32,"d":"32.0"},{"v":15,"d":"15.0"},{"v":32,"d":"32.0"},{"v":46,"d":"46.0"},{"v":82,"d":"82.0"},{"v":76,"d":"76.0"},{"v":29,"d":"29.0"},{"v":36,"d":"36.0"},{"v":21,"d":"21.0"},{"v":28,"d":"28.0"},{"v":58,"d":"58.0"},{"v":47,"d":"47.0"},{"v":162,"d":"162.0"},{"v":32,"d":"32.0"},{"v":80,"d":"80.0"},34.5,95.5,null,null,{"v":66,"d":"66.0"},{"v":61,"d":"61.0"},69.5,{"v":28,"d":"28.0"},{"v":50,"d":"50.0"},{"v":78,"d":"78.0"},{"v":78,"d":"78.0"},{"v":82,"d":"82.0"},null,{"v":26,"d":"26.0"},{"v":88,"d":"88.0"},33.5,{"v":38,"d":"38.0"},{"v":102,"d":"102.0"},{"v":46,"d":"46.0"},{"v":126,"d":"126.0"},null,89.5,{"v":42,"d":"42.0"},{"v":109,"d":"109.0"},{"v":54,"d":"54.0"},{"v":115,"d":"115.0"},{"v":75,"d":"75.0"},{"v":42,"d":"42.0"},{"v":28,"d":"28.0"},{"v":66,"d":"66.0"},{"v":57,"d":"57.0"},{"v":50,"d":"50.0"},{"v":54,"d":"54.0"},{"v":24,"d":"24.0"},{"v":57,"d":"57.0"},{"v":106,"d":"106.0"},{"v":106,"d":"106.0"},{"v":30,"d":"30.0"},{"v":25,"d":"25.0"},110.5,{"v":63,"d":"63.0"},{"v":33,"d":"33.0"},{"v":58,"d":"58.0"},{"v":30,"d":"30.0"},{"v":54,"d":"54.0"},{"v":49,"d":"49.0"},{"v":137,"d":"137.0"},{"v":40,"d":"40.0"},{"v":50,"d":"50.0"},{"v":27,"d":"27.0"},null,110.5,{"v":65,"d":"65.0"},{"v":105,"d":"105.0"},{"v":70,"d":"70.0"},{"v":15,"d":"15.0"},{"v":72,"d":"72.0"},{"v":137,"d":"137.0"},{"v":46,"d":"46.0"},{"v":78,"d":"78.0"},null,{"v":53,"d":"53.0"},{"v":38,"d":"38.0"},{"v":45,"d":"45.0"},{"v":45,"d":"45.0"},{"v":57,"d":"57.0"},{"v":45,"d":"45.0"},{"v":104,"d":"104.0"},{"v":46,"d":"46.0"},{"v":42,"d":"42.0"},{"v":74,"d":"74.0"},{"v":148,"d":"148.0"},{"v":40,"d":"40.0"},{"v":130,"d":"130.0"},{"v":98,"d":"98.0"},{"v":48,"d":"48.0"},69.5,{"v":39,"d":"39.0"},78.5,78.5,{"v":42,"d":"42.0"},{"v":35,"d":"35.0"},{"v":78,"d":"78.0"},{"v":99,"d":"99.0"},{"v":47,"d":"47.0"},{"v":63,"d":"63.0"},{"v":65,"d":"65.0"},{"v":75,"d":"75.0"},{"v":40,"d":"40.0"},{"v":42,"d":"42.0"},{"v":21,"d":"21.0"},{"v":87,"d":"87.0"},{"v":60,"d":"60.0"},{"v":40,"d":"40.0"},null,{"v":46,"d":"46.0"},{"v":99,"d":"99.0"},null,null,{"v":42,"d":"42.0"},{"v":112,"d":"112.0"},{"v":28,"d":"28.0"},89.5,{"v":53,"d":"53.0"},{"v":60,"d":"60.0"},{"v":137,"d":"137.0"},{"v":21,"d":"21.0"},{"v":49,"d":"49.0"},{"v":44,"d":"44.0"},74.5,{"v":88,"d":"88.0"},null,{"v":106,"d":"106.0"},{"v":78,"d":"78.0"},{"v":66,"d":"66.0"},{"v":69,"d":"69.0"},{"v":48,"d":"48.0"},{"v":30,"d":"30.0"},{"v":85,"d":"85.0"},{"v":69,"d":"69.0"},47.5,{"v":42,"d":"42.0"},{"v":46,"d":"46.0"},{"v":28,"d":"28.0"},{"v":27,"d":"27.0"},31.5,{"v":82,"d":"82.0"},{"v":15,"d":"15.0"},{"v":46,"d":"46.0"},{"v":80,"d":"80.0"},{"v":34,"d":"34.0"},95.5,{"v":96,"d":"96.0"},{"v":42,"d":"42.0"},{"v":66,"d":"66.0"},{"v":40,"d":"40.0"},{"v":36,"d":"36.0"},{"v":16,"d":"16.0"},{"v":74,"d":"74.0"},null,{"v":97,"d":"97.0"},{"v":106,"d":"106.0"},{"v":60,"d":"60.0"},{"v":76,"d":"76.0"},{"v":62,"d":"62.0"},null,34.5,{"v":44,"d":"44.0"},{"v":38,"d":"38.0"},{"v":67,"d":"67.0"},{"v":47,"d":"47.0"},{"v":168,"d":"168.0"},{"v":49,"d":"49.0"},{"v":38,"d":"38.0"},{"v":98,"d":"98.0"},{"v":76,"d":"76.0"},{"v":39,"d":"39.0"},{"v":99,"d":"99.0"},{"v":29,"d":"29.0"},{"v":51,"d":"51.0"},{"v":51,"d":"51.0"},{"v":51,"d":"51.0"},{"v":51,"d":"51.0"},{"v":51,"d":"51.0"},{"v":72,"d":"72.0"},{"v":72,"d":"72.0"},{"v":72,"d":"72.0"},{"v":62,"d":"62.0"},31.5,{"v":107,"d":"107.0"},{"v":53,"d":"53.0"},null,{"v":75,"d":"75.0"},{"v":54,"d":"54.0"},{"v":45,"d":"45.0"},74.5,{"v":57,"d":"57.0"},31.5,{"v":106,"d":"106.0"},{"v":36,"d":"36.0"},{"v":24,"d":"24.0"},{"v":42,"d":"42.0"},{"v":52,"d":"52.0"},{"v":39,"d":"39.0"},{"v":27,"d":"27.0"},{"v":30,"d":"30.0"},{"v":33,"d":"33.0"},41.5,{"v":66,"d":"66.0"},{"v":69,"d":"69.0"},{"v":38,"d":"38.0"},{"v":82,"d":"82.0"},{"v":34,"d":"34.0"},31.5,{"v":137,"d":"137.0"},{"v":118,"d":"118.0"},{"v":100,"d":"100.0"},{"v":30,"d":"30.0"},{"v":57,"d":"57.0"},{"v":42,"d":"42.0"},{"v":45,"d":"45.0"},{"v":60,"d":"60.0"},{"v":30,"d":"30.0"},{"v":69,"d":"69.0"},31.5,{"v":32,"d":"32.0"},{"v":57,"d":"57.0"},{"v":85,"d":"85.0"},{"v":159,"d":"159.0"},{"v":55,"d":"55.0"},{"v":32,"d":"32.0"},{"v":106,"d":"106.0"},{"v":28,"d":"28.0"},{"v":33,"d":"33.0"},{"v":72,"d":"72.0"},{"v":29,"d":"29.0"},{"v":38,"d":"38.0"},{"v":38,"d":"38.0"},{"v":105,"d":"105.0"},{"v":21,"d":"21.0"},{"v":40,"d":"40.0"},{"v":63,"d":"63.0"},{"v":44,"d":"44.0"},{"v":81,"d":"81.0"},{"v":24,"d":"24.0"},{"v":103,"d":"103.0"},{"v":126,"d":"126.0"},{"v":36,"d":"36.0"},{"v":13,"d":"13.0"},{"v":49,"d":"49.0"},{"v":102,"d":"102.0"},{"v":115,"d":"115.0"},97.5,{"v":47,"d":"47.0"},{"v":70,"d":"70.0"},{"v":96,"d":"96.0"},{"v":33,"d":"33.0"},{"v":103,"d":"103.0"},{"v":45,"d":"45.0"},{"v":118,"d":"118.0"},null,{"v":115,"d":"115.0"},{"v":28,"d":"28.0"},{"v":57,"d":"57.0"},null,{"v":44,"d":"44.0"},{"v":49,"d":"49.0"},null,{"v":31,"d":"31.0"},{"v":56,"d":"56.0"},{"v":97,"d":"97.0"},118.5,118.5,31.5,31.5,118.5,43.5,{"v":39,"d":"39.0"},{"v":99,"d":"99.0"},{"v":30,"d":"30.0"},{"v":87,"d":"87.0"},{"v":66,"d":"66.0"},{"v":115,"d":"115.0"},{"v":115,"d":"115.0"},{"v":39,"d":"39.0"},{"v":126,"d":"126.0"},{"v":42,"d":"42.0"},{"v":42,"d":"42.0"},{"v":60,"d":"60.0"},{"v":70,"d":"70.0"},62.5,89.5,{"v":13,"d":"13.0"},{"v":40,"d":"40.0"},{"v":28,"d":"28.0"},{"v":75,"d":"75.0"},{"v":63,"d":"63.0"},{"v":63,"d":"63.0"},null,{"v":75,"d":"75.0"},{"v":36,"d":"36.0"},{"v":74,"d":"74.0"},{"v":100,"d":"100.0"},{"v":59,"d":"59.0"},{"v":56,"d":"56.0"},{"v":37,"d":"37.0"},{"v":62,"d":"62.0"},{"v":57,"d":"57.0"},{"v":105,"d":"105.0"},{"v":39,"d":"39.0"},{"v":42,"d":"42.0"},{"v":82,"d":"82.0"},null,{"v":91,"d":"91.0"},{"v":34,"d":"34.0"},{"v":39,"d":"39.0"},65.5,{"v":126,"d":"126.0"},{"v":36,"d":"36.0"},{"v":50,"d":"50.0"},{"v":55,"d":"55.0"},{"v":96,"d":"96.0"},{"v":69,"d":"69.0"},{"v":38,"d":"38.0"},{"v":72,"d":"72.0"},null,{"v":50,"d":"50.0"},{"v":57,"d":"57.0"},null,{"v":74,"d":"74.0"},{"v":76,"d":"76.0"},{"v":60,"d":"60.0"},{"v":24,"d":"24.0"},{"v":99,"d":"99.0"},{"v":24,"d":"24.0"},{"v":32,"d":"32.0"},{"v":60,"d":"60.0"},83.5,31.5,{"v":40,"d":"40.0"},{"v":72,"d":"72.0"},{"v":66,"d":"66.0"},97.5,{"v":28,"d":"28.0"},109.5,78.5,{"v":42,"d":"42.0"},{"v":155,"d":"155.0"},{"v":137,"d":"137.0"},{"v":42,"d":"42.0"},{"v":30,"d":"30.0"},null,{"v":34,"d":"34.0"},{"v":74,"d":"74.0"},{"v":78,"d":"78.0"},34.5,{"v":72,"d":"72.0"},{"v":44,"d":"44.0"},33.5,{"v":21,"d":"21.0"},{"v":50,"d":"50.0"},{"v":50,"d":"50.0"},43.5,{"v":126,"d":"126.0"},47.5,{"v":40,"d":"40.0"}]
["Produto banido na União Européia (X)",null,null,"x",{"$nulls":3},"x","x","x",null,"x",null,"x","x",null,"x",null,"x",{"$nulls":5},"x","x",null,"x",null,"x",null,null,"x",null,"x",null,"x","x","x",{"$nulls":3},"x",null,null,"x","x",null,null,"x","x","x",null,null,"x","x","x","x",null,"x","x","x","x","x","x",null,"x","x",{"$nulls":8},"x","x",null,null,"x","x",null,"x","x",{"$nulls":4},"x",null,"x","x","x",null,null,"x",null,null,"x","x",{"$nulls":3},"x","x","x",null,"x",null,null,"x","x",null,"x",{"$nulls":4},"x","x","x","x","x",null,"x","x",null,null,"x","x","x","x","x","x",null,"x",null,"x","x","x","x","x","x",null,null,"x","x",{"$nulls":3},"x","x",{"$nulls":8},"x","x",{"$nulls":4},"x","x","x",null,"x",null,null,"x",null,"x",null,"x","x",null,"x","x","x","x","x","x","x","x","x",{"$nulls":5},"x","x","x","x",null,"x",{"$nulls":4},"x",null,"x",null,"x","x","x","x","x",null,"x",{"$nulls":4},"x","x",{"$nulls":4},"x",{"$nulls":3},"x",null,"x",{"$nulls":9},"x",null,"x",null,null,"x","x",null,"x","x","x","x","x",{"$nulls":3},"x","x",null,"x","x","x",null,null,"x",{"$nulls":7},"x","x",{"$nulls":14},"x",{"$nulls":5},"x",{"$nulls":3},"x","x","x",null,"x",null,"x","x","x",null,"x",null,null,"x","x","x","x","x",null,"x",null,null,"x",{"$nulls":4},"x",null,null,"x",null,null,"x","x","x","x",{"$nulls":4},"x",{"$nulls":3},"x","x","x","x",null,"x","x",{"$nulls":3},"x",null,null,"x",null,"x",null,null,"x","x",null,null,"x",null,null,"x",null,null,"x","x",null,"x",null,null,"x","x",null,"x","x",null,"x","x","x","x","x","x","x",null,"x","x",null,"x","x",null,"x","x","x",null,null,"x",null,null,"x",{"$nulls":8},"x",null,"x","x",null,null,"x",{"$nulls":4},"x",{"$nulls":3},"x",{"$nulls":4},"x","x","x",{"$nulls":3},"x","x","x","x",null,null,"x",null,"x",null,"x",{"$nulls":6},"x","x",{"$nulls":3},"x","x",null,"x",null,null,"x",null,"x",{"$nulls":5},"x",null,"x",null,"x",null,"x",null,null,"x","x",null,null,"x","x","x","x","x","x",{"$nulls":4},"x",null,"x","x",null,"x","x","x","x","x","x",null,null,"x",null,"x",{"$nulls":5},"x",{"$nulls":4},"x","x","x",null,null,"x","x","x",null,"x","x",null,"x","x","x",{"$nulls":6},"x",null,null,"x",null,null,"x","x","x","x",{"$nulls":5},"x","x","x",null,"x",{"$nulls":3},"x","x","x","x",null,"x",{"$nulls":3},"x",{"$nulls":3},"x","x","x","x","x",null,"x","x","x",null,null,"x","x","x",{"$nulls":4},"x","x",{"$nulls":3},"x","x",{"$nulls":5},"x",null,"x","x",null,null,"x","x","x","x","x","x","x",null,"x",{"$nulls":3},"x",null,"x","x",null,null,"x",null,null,"x","x","x",{"$nulls":6},"x",{"$nulls":4},"x","x",null,null,"x",null,"x","x",{"$nulls":3},"x",{"$nulls":4},"x",null,"x","x"]
["Número de princípios ativos registrados no Brasil (2019-2022)",null,49,8,14,12,6,11,11,11,25,{"$nulls":4},24,13,2,null,3,null,66,1,{"$nulls":3},5,6,1,null,3,4,44,null,3,4,31,31,10,49,null,66,null,14,2,2,null,null,2,44,13,null,22,26,44,null,null,2,1,52,52,14,52,1,null,3,17,11,23,{"$nulls":3},66,66,{"$nulls":3},19,4,5,null,17,11,{"$nulls":4},1,5,1,1,41,41,2,null,6,41,2,17,null,null,33,5,5,19,{"$nulls":3},1,null,2,17,null,22,1,27,5,3,3,13,41,null,17,17,null,17,null,null,3,1,1,1,1,null,11,10,null,24,17,28,3,1,5,7,11,null,6,{"$nulls":3},8,3,44,3,null,15,24,null,24,1,4,14,2,null,15,15,15,28,null,1,24,3,16,null,25,4,9,17,null,52,35,25,13,28,10,5,28,28,28,null,null,3,null,3,4,17,17,13,22,31,null,2,38,13,13,null,10,null,13,10,9,4,24,33,null,24,49,{"$nulls":3},2,29,35,66,null,2,13,20,2,2,8,8,1,null,1,1,null,null,20,1,{"$nulls":4},11,null,12,52,52,null,1,64,6,null,1,null,3,null,null,3,null,1,64,49,38,1,12,11,null,4,2,16,4,10,1,null,null,26,26,null,4,1,1,26,1,10,13,35,1,1,12,null,11,10,1,2,null,null,27,16,17,28,3,35,12,2,13,null,10,null,10,4,2,null,31,52,null,28,44,64,44,1,{"$nulls":3},3,null,6,null,2,6,2,2,31,3,30,30,1,4,null,null,28,1,1,2,10,9,null,19,null,25,null,10,4,null,null,23,null,41,11,null,null,1,1,28,4,22,3,3,3,null,1,19,24,1,1,null,4,33,null,null,2,null,2,19,19,13,17,64,null,null,10,1,30,9,null,33,33,5,33,null,10,8,10,9,null,5,null,3,null,22,null,null,8,{"$nulls":4},29,19,11,6,null,6,null,null,5,null,null,1,null,2,35,null,12,null,9,10,null,6,1,{"$nulls":3},10,8,null,13,11,3,{"$nulls":3},6,6,1,1,null,15,null,64,null,2,2,1,null,27,13,5,2,7,24,14,1,null,1,null,17,null,5,null,null,13,null,1,33,24,null,null,4,null,null,52,52,52,52,52,66,66,38,17,3,1,5,null,3,null,3,null,3,null,8,27,22,null,null,3,null,null,3,31,1,11,null,2,2,24,27,49,4,null,5,2,33,10,6,null,3,44,1,{"$nulls":3},2,null,12,3,38,null,24,null,13,null,6,29,null,null,14,1,10,null,null,33,25,41,44,2,17,5,3,null,3,49,null,41,12,3,4,null,33,null,3,12,1,1,1,3,3,1,26,17,{"$nulls":3},1,41,41,3,10,35,35,null,17,17,null,null,6,null,null,6,6,null,2,3,3,8,1,13,2,17,3,13,17,2,null,30,5,null,17,null,10,null,28,null,null,2,22,66,null,11,2,null,3,null,null,16,null,16,44,3,1,15,6,66,4,44,6,11,null,3,14,27,2,{"$nulls":3},3,null,5,66,4,19,6,28,28,26,10,6]
[]
["DATABASE (QUESTIONNAIRE; INDICATORS; REPORT)",null,"Q2DATA","Q3ENTREVISTADOR_NOME","Q3ENTREVISTADOR_CPF","Q4PRODUTOR_NOME","Q4PRODUTOR_CPF","Q4PRODUTOR_IDADE","Q5IMOVEL_GEOLOCALIZACAO","Q5MUNICIPIO","Q5ESTADO","Q5CURSO_DAGUA_PRINCIPAL","Q6POSSE","Q6PROCESSO_SUCESSORIO","Q6PARTICIPACAO_DA_MULHER","Q7IMOVEL_NOME","Q7IMOVEL_AREA","Q7ENQUADRAMENTO_AGRICULTURA_FAMILIAR","Q7AREA_NAO_CONTIGUA_DESCRICAO","Q7AREA_NAO_CONTIGUA_HECTARES","Q8LAVOURAS_PERMANENTES","Q8LAVOURAS_TEMPORARIAS","Q8PASTAGENS","Q8SILVICULTURA","Q8AREA_NAO_AGRICOLA","Q8POUSIO","Q8CORPOS_DAGUA","Q8VEGETACAO_NATIVA","Q8AREAS_NAO_APROVEITAVEIS","Q8AREA_TOTAL","Q9CAR_APP_AREA_TOTAL","Q9CAR_APP_RECUPERAR","Q10RESERVA_LEGAL_AREA","Q10RESERVA_LEGAL_AREA_VEGETACAO_NATIVA_EXCEDENTE","Q11CURSOS_DAGUA","Q11NASCENTES","Q11LAGOS_LAGOAS_NATURAIS","Q11REPRESAS","Q11USO_AGUA_SUPERFICIAL","Q11USO_AGUA_SUBTERRANEA","Q11AGUA_DISPONIBILIDADE_PROBLEMAS","Q11AGUA_DISPONIBILIDADE_PROBLEMAS_ESPECIFICACAO","Q12OUTORGA_USO_AGUA","Q12LICENCIAMENTO_AMBIENTAL","Q12REGULARIZACAO_APP_RL","Q13PONTOS_CRITICOS_DESCRICAO1","Q13PONTOS_CRITICOS_DESCRICAO2","Q13PONTOS_CRITICOS_DESCRICAO3","I1RECEITA_BRUTA_ATIVIDADE_DESCRICAO1","I1RECEITA_BRUTA_VALOR_ESTIMADO1","I1RECEITA_BRUTA_ATIVIDADE_DESCRICAO2","I1RECEITA_BRUTA_VALOR_ESTIMADO2","I1RECEITA_BRUTA_ATIVIDADE_DESCRICAO3","I1RECEITA_BRUTA_VALOR_ESTIMADO3","I1ATIVIDADE1_DESCRICAO","I1ATIVIDADE1_UNID","I1ATIVIDADE1_PRODUTIVIDADE","I1ATIVIDADE1_PRECO","I1ATIVIDADE1_PRODUTIVIDE_REGIONAL","I1ATIVIDADE1_PRECO_REGIONAL","I1ATIVIDADE2_DESCRICAO","I1ATIVIDADE2_UNID","I1ATIVIDADE2_PRODUTIVIDADE","I1ATIVIDADE2_PRECO","I1ATIVIDADE2_PRODUTIVIDE_REGIONAL","I1ATIVIDADE2_PRECO_REGIONAL","I1ATIVIDADE3_DESCRICAO","I1ATIVIDADE3_UNID","I1ATIVIDADE3_PRODUTIVIDADE","I1ATIVIDADE3_PRECO","I1ATIVIDADE3_PRODUTIVIDE_REGIONAL","I1ATIVIDADE3_PRECO_REGIONAL","I1RESULTADO","I2ATIVIDADE_DESCRICAO1","I2ATIVIDADE_VALOR1","I2ATIVIDADE_DESCRICAO2","I2ATIVIDADE.VALOR2","I2ATIVIDADE_DESCRICAO3","I2ATIVIDADE_VALOR3","I2PENSAO_APOSENTADORIA_BOLSAS","I2OUTRAS_ATIVIDADES_PRESTACAO_SERVICOS","I2ATIVIDADES_AGRICOLAS_IMOVEL","I2OUTRAS_ATIVIDADES_IMOVEL","I2ATIVIDADES_FORA_DO_IMOVEL","I2PENSAO_APOSENTADORIA_BOLSAS","I2CONCENTRACAO_DE_RENDA_ATIVIDADE","I2RESULTADO","I3PERIODO_DE_AVALIACAO","I3BENFEITORIAS_RECENTES","I3BENFEITORIAS_RECENTES_VALOR","I3BENFEITORIAS_EXISTENTES","I3BENFEITORIAS_EXISTENTES_VALOR","I3BENFEITORIAS_TOTAL","I3EQUIPAMENTOS_RECENTES","I3EQUIPAMENTOS_RECENTES_VALOR","I3EQUIPAMENTOS_EXISTENTES","I3EQUIPAMENTOS_EXISTENTES_VALOR","I3EQUIPAMENTOS_TOTAL","I3SEMOVENTES_ESTOQUE_TOTAL","I3SEMOVENTES_ESTOQUE_TOTAL_HIST","I3IRRIGACAO_TIPO","I3IRRIGACAO_AREA","I3IRRIGACAO_HISTORICO_AREA","I3USO_DO_SOLO_AREA_TOTAL","I3USO_DO_SOLO_AREA_TOTAL_HIST","I3VALOR_DA_TERRA","I3VALOR_DA_TERRA_HIST","I3ESTIMATIVA_PATRIMONIAL","I3ESTIMATIVA_PATRIMONIAL_HIST","I3VALORIZACAO_DA_TERRA","I3EVOLUCAO_BENFEITORIAS","I3EVOLUCAO_EQUIPAMENTOS","I3EVOLUCAO_SEMOVENTES","I3EVOLUCAO_AREAS_AGRICOLAS_IRRIGACAO","I3EVOLUCAO_PATRIMONIAL_TOTAL","I3EVOLUCAO_PATRIMONIAL_TOTAL_SEM_VALORIZACAO_DA_TERRA","I3RESULTADOPARCIAL1","I3FINANCIAMENTOS_COMPROMISSOS_FINANCEIROS","I3FINANCIAMENTOS_COMPROMISSOS_FINANCEIROS_PROPORCAO_ESTIMATIVA_PATRIMONIAL","I3RESULTADOPARCIAL2","I3RESULTADO","I4RESIDENCIAS","I4DISPONIBILIDADE_DE_AGUA","I4ENERGIA_ELETRICA","I4ESTRADA_DE_ACESSO","I4SERVICO_DE_SAUDE","I4TRANSPORTE_ESCOLAR","I4SEGURANCA","I4INTERNET","I4COLETADELIXO","I4RESULTADOPARCIAL1","I4HORTALICAS","I4POMAR","I4ANIMAIS","I4RESULTADOPARCIAL2","I4RESULTADO","I5FAMILIA","I5FAMILIA_ESCOLARIDADE_MENOR_9ANOS","I5FAMILIA_FUNDAMENTAL","I5FAMILIA_ENSINO_MEDIO","I5FAMILIA_CURSO_SUPERIOR","I5COLABORADORES","I5COLABORADORES_ESCOLARIDADE_MENOR_9ANOS","I5COLABORADORES_FUNDAMENTAL","I5COLABORADORES_ENSINO_MEDIO","I5COLABORADORES_CURSO_SUPERIOR","I5FAMILIA_CAPACITACAO_CURTA","I5FAMILIA_CAPACITACAO_LONGA","I5COLABORADORES_CAPACITACAO_CURTA","I5COLABORADORES_CAPACITACAO_LONGA","I5FAMILIA_6A18ANOS","I5FAMILIA_6A18ANOS_FREQ_ESCOLA","I5COLABORADORES_6A18ANOS","I5COLABORADORES_6A18ANOS_FREQ_ESCOLA","I5RESULTADO","I6FUNCIONARIOS","I6FUNCIONARIOS_REGISTRADOS","I6PGTO_HORA_EXTRA_AUSENCIA_HORA_EXTRA","I6SM>1","I6AUXILIO_ALIMENTACAO","I6AUXILIO_MORADIA","I6AUXILIO_EDUCACAO","I6PARTICIPACAO_LUCROS","I6SEGURO_ACIDENTES","I6ACESSO_LAZER","I6ESPACO_CULTIVOS","I6_FUNCIONARIOS_TEMPORARIOS_PROPORCAO","I6RESULTADO","I7FLUXO_DE_CAIXA","I7CUSTO_DE_PRODUCAO","I7ASSITENCIA_TECNICA","I7PARTICIPACAO_ASSOCIATIVA","I7REGUULARIZACAO_AMBIENTAL","I7CREDITO_INVESTIMENTOS","I7CREDITO_CUSTEIO","I7CREDITO_COMERCIALIZACAO","I7RESULTADO","I8INFORMACAO_COMPRADORES_DIVERSIFICADOS","I8PRODUTOS_CERTIFICADOS_MERCADO_INSTITUCIONAL","I8INOVACAO_ADOCAO","I8INOVACAO_ADOCAO_DESCRICAO","I8INOVACAO_CAPACIDADE_LIDERANCA","I8INOVACAO_CAPACIDADE_LIDERANCA_DESCRICAO","I8USO_DE_BIOINSUMOS","I8USO_DE_BIOINSUMOS_PROPORCAO","I8PLANTAS_DE_COBERTURA_OU_ESPECIES_ARBÓREAS","I8PLANTAS_DE_COBERTURA_OU_ESPECIES_ARBÓREAS_PROPORCAO","I8RESULTADO","I9ESGOTO1","I9ESGOTO2","I9LIXO1","I9LIXO2","I9COLETA_DESTINACAO_ADEQUADA_RESIDUOS_SOLIDOS","I9COLETA_DESTINACAO_ADEQUADA_EFLUENTES_LIQUIDOS","I9COLETA_DESTINACAO_ADEQUADA_EFLUENTES_GASOSOS","I9PONTO_CRITICO","I9PONTO_CRITICO_DESCRICAO","I9RESULTADO","I10DESCRICAO","I10ARGILA","I10MOS_DAGKG-1","I10MOS","I10P_MGDM-3","I10P","I10CALCIO_CMOLDM-3","I10CALCIO","I10MAGNESIO_CMOLDM-3","I10MAGNESIO","I10POTASSIO_MGDM-3","I10POTASSIO","I10PH_UNIDADE","I10PH","I10ALUMINIO_CMOLDM-3","I10ALUMINIO","I10CTC_EFETIVA_CMOLDM-3","I10CTC_EFETIVA","I10SATURACAO_POR_BASES_%","I10SATURACAO_POR_BASES","I10RESULTADOPARCIAL1","I10ARILSULFATASE_MGPNITROFENOLKG-1H-1","I10BETAGLICOSIDASE_MGPNITROFENOLKG-1H-1","I10MOS_PROF010_DAGKG-1","I10IQS_BIOLOGICO","I10IQS_QUIMICO","I10SUPRIMENTO_NUTRIENTES","I10.2.7.IQS Químico ","I10.2.8.IQS FertBio","I10.2..IQS BIOLOGICO.RESULTADO PARCIAL","I10RESULTADO","I11ESTAGIO","I11AREA","I11PROPORCAO_AREA_TOTAL","I11TENDENCIA_COMPORTAMENTO","I11RESULTADOPARCIAL1","I11ESTRADAS_DRENAGEM\n","I11ESTRADAS_LOMBADAS\n","I11ESTRADAS_CAIXAS_INFILTRACAO\n","I11ESTRADAS_BURACOS\n","I11ESTRADAS_SULCOS_DE_EROSAO\n","I11PONTO_CRITICO\n","I11PONTO_CRITICO_DESCRICAO\n","I11RESULTADOPARCIAL2","I11RESULTADO","I12MONTANTE_MARGENS\n","I12JUSANTE_MARGENS\n","I12MONTANTE_ALTERACOES_ANTROPICAS\n","I12JUSANTE_ALTERACOES_ANTROPICAS\n","I12MONTANTE_SOMBREAMENTO\n","I12JUSANTE_SOMBREAMENTO\n","I12MONTANTE_EROSAO\n","I12JUSANTE_EROSAO\n","I12MONTANTE_TRANSPARENCIA\n","I12JUSANTE_TRANSPARENCIA\n","I12MONTANTE_ODOR\n","I12JUSANTE_ODOR\n","I12MONTANTE_FUNDO\n","I12JUSANTE_FUNDO\n","I12MONTANTE_ECOSSISTEMA_AQUÁTICO\n","I12JUSANTE_ECOSSISTEMA_AQUATICO\n","I12AGUA_SUPERFICIAL_MONTANTE","I12AGUA_SUPERFICIAL_JUSANTE","I12AGUA_SUBTERRANEA","I12RESULTADO","I13PRODUTO1","I13CULTURA1","I13AREA1","I13VOLUME_POR_HECTARE1 ","I13VOLUME_TOTAL1","I13PRINCIPIO_ATIVO1","I13POTENCIAL_CONTAMINACAO1","I13TALHAO_VULNERABILIDADE1","I13RISCO_DE_CONTAMINACAO1","I13PRODUTO2","I13CULTURA2","I13AREA2","I13VOLUME_POR_HECTARE2","I13VOLUME_TOTAL2","I13PRINCIPIO_ATIVO2","I13POTENCIAL_CONTAMINACAO2","I13TALHAO_VULNERABILIDADE2","I13RISCO_DE_CONTAMINACAO2","I13PRODUTO3","I13CULTURA3","I13AREA3","I13VOLUME_POR_HECTARE3","I13VOLUME_TOTAL3","I13PRINCIPIO_ATIVO3","I13POTENCIAL_CONTAMINACAO3","I13TALHAO_VULNERABILIDADE3","I13RISCO_DE_CONTAMINACAO3","I13CULTURA_DESCRICAO1","I13CULTURA_AREA1","I13CULTURA_RISCO_MAXIMO1","I13CULTURA_DESCRICAO2","I13CULTURA_AREA2","I13CULTURA_RISCO_MAXIMO2","I13CULTURA_DESCRICAO3","I13CULTURA_AREA3","I13CULTURA_RISCO_MAXIMO3","I13RESULTADOPARCIAL1","I13AGROTOXICOS_MANUSEIO_PESSOAS","I13AGROTOXICOS_EPI_PESSOAS","I13AGROTOXICOS_ARMAZENAMENTO_ADEQUADO","I13AGROTOXICOS_DEVOLUCAO_EMBALAGENS","I13RESULTADOPARCIAL2","I13RESULTADO","I14PRATICAS_CONSERVACIONISTAS_SUFICIENTE\n\n\n","I14PRATICAS_CONSERVACIONISTAS_INSUFICIENTE\n\n\n","I14PRATICAS_CONSERVACIONISTAS_SITUACAO_CRITICA\n\n\n","I14SITUACAO_CRITICA_ESPECIFICACAO\n\n\n","I14AGUA_PRATICAS_CONSERVACIONISTAS_RESERVACAO\n\n\n","I14RESULTADO","I15PRATICAS_INDUCAO_AGROBIODIVERSIDADE_SUFICIENTE\n\n\n","I15PRATICAS_INDUCAO_AGROBIODIVERSIDADE_INSUFICIENTE\n\n\n","I15PRATICAS_INDUCAO_AGROBIODIVERSIDADE_SITUACAO_CRITICA\n\n\n","I15SITUACAO_CRITICA_ESPECIFICACAO\n\n\n","I15INDUCAO_AGROBIODIVERSIDADE_RESULTADO\n\n\n","I15INDICE_SHANON","I15INDICE_SHANON_RESULTADO","I15AREAS_LIMITROFES_PRESSAO_DE_MONOCULTIVOS","I15RESULTADO","I16FITOFISIONOMIA1\n","I16FITOFISIONOMIA_ESTAGIO_SUCESSIONAL_AVANCADO1\n","I16FITOFISIONOMIA_ESTAGIO_SUCESSIONAL_MEDIO1\n","I16FITOFISIONOMIA_ESTAGIO_SUCESSIONAL_INICIAL1\n","I16FITOFISIONOMIA2\n","I16FITOFISIONOMIA_ESTAGIO_SUCESSIONAL_AVANCADO2\n","I16FITOFISIONOMIA_ESTAGIO_SUCESSIONAL_MEDIO2\n","I16FITOFISIONOMIA_ESTAGIO_SUCESSIONAL_INICIAL2\n","I16FITOFISIONOMIA3\n","I16FITOFISIONOMIA_ESTAGIO_SUCESSIONAL_AVANCADO3\n","I16FITOFISIONOMIA_ESTAGIO_SUCESSIONAL_MEDIO3\n","I16FITOFISIONOMIA_ESTAGIO_SUCESSIONAL_INICIAL3\n","I16FITOFISIONOMIA4\n","I16FITOFISIONOMIA_ESTAGIO_SUCESSIONAL_AVANCADO4\n","I16FITOFISIONOMIA_ESTAGIO_SUCESSIONAL_MEDIO4\n","I16FITOFISIONOMIA_ESTAGIO_SUCESSIONAL_INICIAL4\n","I16FRAGMENTOS_VEGETACAO_NATIVA\n","I16CONEXAO_FRAGMENTOS\n","I16PROTECAO_INCENDIO_PASTOREIO\n","I16RESULTADO","I17APP_USO_CONSOLIDADO_VEGETACAO_NATIVA","I17APP_RECOMPOSICAO","I17APP_PROTECAO_CONSERVACAO","I17RESULTADOPARCIAL1","I17RL","I17VEGETACAO_NATIVA_EXCEDENTE","I17RL_FORA_DO_IMOVEL_RURAL","I17RL_NAO_PASSIVEL_DE_RECOMPOSICAO","I17RL_NECESSITA_RECOMPOSICAO","I17RESULTADOPARCIAL2","I17RESULTADO","INDICE_SUSTENTABILIDADE","DESVIO_PADRAO","I1PRODUTIVIDADE","I2DIVERSIFICACAO_DA_RENDA","I3EVOLUCAO_PATRIMONIAL_GRAU_DE_ENDIVIDAMENTO","I4SERVICOS_BASICOS_SEGURANCA_ALIMENTAR","I5ESCOLARIDADE_CAPACITACAO","I6QUALIDADE_DO_EMPREGO","I7GESTAO","I8COMERCIALIZACAO_INOVACAO","I9GERENCIAMENTO_RESIDUOS","I10SAUDE_DO_SOLO","I11EROSAO_MANUTENCAO_ESTRADAS","I12QUALIDADE_DA_AGUA","I13RISCO_DE_CONTAMINACAO_DA_AGUA_PESTICIDAS","I14CONSERVACAO_SOLO_AGUA","I15CONSERVACAO_BIODIVERSIDADE","I16HABITATS_NATURAIS","I17APP_RL","R1RENDA_BRUTA_ANUAL","R1RENDA_BRUTA_ANUAL_R$HA-1 ","R1RENDA_BRUTA_ANUAL_ESTIMATIVA_PATRIMONIAL-1 ","R1TERRA_VALOR_DE_REFERENCIA","R1ESTIMATIVA_PATRIMONIAL","R1EVOLUCAO_PATRIMONIAL_SEM_VALORIZACAO_DA_TERRA","R1QTE_AGROTOXICOS_AREA_CULTIVADA-1","R1IEQ_CUMULATIVO","R1NUMERO_DE_PRODUTOS_COMERCIAIS","R1IEQ_MEDIO","R1IEQ_MAX","R1IEQ_TRABALHADOR_RURAL_MEDIO","R1IEQ_TRABALHADOR_RURAL_MAX","R1IEQ_CONSUMIDOR_MEDIO","R1IEQ_CONSUMIDOR_MAX","R1IEQ_MEIO_AMBIENTE_MEDIO","R1IEQ_MEIO_AMBIENTE_MAX","R1PROPORCAO_PRODUTOS_UTILIZADOS_BANIDOS_UNIAO_EUROPEIA"]
[{"$f":"COUNTA(C22:NY22)","v":387},null,{"$f":"'1 Questionário'!C34","v":"00:00:00"},{"$f":"'1 Questionário'!C38","v":0},{"$f":"'1 Questionário'!C40","v":0},{"$f":"'1 Questionário'!C44","v":0},{"$f":"'1 Questionário'!C46","v":0},{"$f":"'1 Questionário'!C48","v":0},{"$f":"'1 Questionário'!C52","v":0},{"$f":"'1 Questionário'!C54","v":0},{"$f":"'1 Questionário'!C56","v":0},{"$f":"'1 Questionário'!C58","v":0},{"$f":"'1 Questionário'!D62","v":0},{"$f":"'1 Questionário'!D64","v":0},{"$f":"'1 Questionário'!D66","v":0},{"$f":"'1 Questionário'!D70","v":0},{"$f":"'1 Questionário'!D72","v":0},{"$f":"'1 Questionário'!D76","v":0},{"$f":"'1 Questionário'!D79","v":0},{"$f":"'1 Questionário'!D81","v":0},{"$f":"'1 Questionário'!D86","v":0},{"$f":"'1 Questionário'!D87","v":0},{"$f":"'1 Questionário'!D88","v":0},{"$f":"'1 Questionário'!D89","v":0},{"$f":"'1 Questionário'!D90","v":0},{"$f":"'1 Questionário'!D91","v":0},{"$f":"'1 Questionário'!D92","v":0},{"$f":"'1 Questionário'!D93","v":0},{"$f":"'1 Questionário'!D94","v":0},{"$f":"'1 Questionário'!H94","v":{"v":0,"d":"0.00"}},{"$f":"'1 Questionário'!D99","v":{"v":0,"d":"0.00"}},{"$f":"'1 Questionário'!D101","v":{"v":0,"d":"0.00"}},{"$f":"'1 Questionário'!D72*'1 Questionário'!E105","v":{"v":0,"d":"0.00"}},{"$f":"'1 Questionário'!E106","v":{"v":0,"d":"0.00"}},{"$f":"'1 Questionário'!E110","v":0},{"$f":"'1 Questionário'!E111","v":0},{"$f":"'1 Questionário'!E112","v":0},{"$f":"'1 Questionário'!E113","v":0},{"$f":"'1 Questionário'!E117","v":0},{"$f":"'1 Questionário'!E118","v":0},{"$f":"'1 Questionário'!E121","v":0},{"$f":"'1 Questionário'!E123","v":0},{"$f":"'1 Questionário'!E127","v":0},{"$f":"'1 Questionário'!E129","v":0},{"$f":"'1 Questionário'!E131","v":0},{"$f":"'1 Questionário'!C136","v":0},{"$f":"'1 Questionário'!C138","v":0},{"$f":"'1 Questionário'!C140","v":0},{"$f":"'2 Indicadores'!C9","v":0},{"$f":"'2 Indicadores'!D9","v":0},{"$f":"'2 Indicadores'!C10","v":0},{"$f":"'2 Indicadores'!D10","v":0},{"$f":"'2 Indicadores'!C11","v":0},{"$f":"'2 Indicadores'!D11","v":0},{"$f":"'2 Indicadores'!D15","v":0},{"$f":"'2 Indicadores'!D16","v":0},{"$f":"'2 Indicadores'!D17","v":0},{"$f":"'2 Indicadores'!D18","v":0},{"$f":"'2 Indicadores'!D19","v":0},{"$f":"'2 Indicadores'!D20","v":0},{"$f":"'2 Indicadores'!E15","v":0},{"$f":"'2 Indicadores'!E16","v":0},{"$f":"'2 Indicadores'!E17","v":0},{"$f":"'2 Indicadores'!E18","v":0},{"$f":"'2 Indicadores'!E19","v":0},{"$f":"'2 Indicadores'!E20","v":0},{"$f":"'2 Indicadores'!F15","v":0},{"$f":"'2 Indicadores'!F16","v":0},{"$f":"'2 Indicadores'!F17","v":0},{"$f":"'2 Indicadores'!F18","v":0},{"$f":"'2 Indicadores'!F19","v":0},{"$f":"'2 Indicadores'!F20","v":0},{"$f":"'2 Indicadores'!C22","v":{"v":0,"d":"0.00"}},{"$f":"'2 Indicadores'!C28","v":0},{"$f":"'2 Indicadores'!D28","v":0},{"$f":"'2 Indicadores'!C29","v":0},{"$f":"'2 Indicadores'!D29","v":0},{"$f":"'2 Indicadores'!C30","v":0},{"$f":"'2 Indicadores'!D30","v":0},{"$f":"'2 Indicadores'!D34","v":0},{"$f":"'2 Indicadores'!D35","v":0},{"$f":"'2 Indicadores'!F39","v":{"$error":"#DIV/0!"}},{"$f":"'2 Indicadores'!F40","v":{"$error":"#DIV/0!"}},{"$f":"'2 Indicadores'!F41","v":{"$error":"#DIV/0!"}},{"$f":"'2 Indicadores'!F42","v":{"$error":"#DIV/0!"}},{"$f":"'2 Indicadores'!F43:F43","v":{"$error":"#DIV/0!"}},{"$f":"'2 Indicadores'!C45","v":{"$error":"#DIV/0!"}},{"$f":"'2 Indicadores'!D49","v":0},{"$f":"'2 Indicadores'!B54","v":0},{"$f":"'2 Indicadores'!C54","v":{"v":1E-3,"d":"R$ 0.00"}},{"$f":"'2 Indicadores'!B58","v":0},{"$f":"'2 Indicadores'!C58","v":{"v":1E-3,"d":"R$ 0.00"}},{"$f":"'2 Indicadores'!D59","v":{"v":2E-3,"d":"R$ 0.00"}},{"$f":"'2 Indicadores'!B62","v":0},{"$f":"'2 Indicadores'!C62","v":{"v":1E-3,"d":"R$ 0.00"}},{"$f":"'2 Indicadores'!B66","v":0},{"$f":"'2 Indicadores'!C66","v":{"v":1E-3,"d":"R$ 0.00"}},{"$f":"'2 Indicadores'!D67","v":{"v":2E-3,"d":"R$ 0.00"}},{"$f":"'2 Indicadores'!D73","v":0},{"$f":"'2 Indicadores'!F73","v":{"v":1E-3,"d":"R$ 0.00"}},{"$f":"'2 Indicadores'!B77","v":0},{"$f":"'2 Indicadores'!C77","v":{"v":0,"d":"0.0"}},{"$f":"'2 Indicadores'!D77","v":{"v":0,"d":"0.0"}},{"$f":"'2 Indicadores'!C89","v":0},{"$f":"'2 Indicadores'!D89","v":0},{"$f":"'2 Indicadores'!C92","v":0},{"$f":"'2 Indicadores'!D92","v":0},{"$f":"'2 Indicadores'!C95","v":{"$error":"#DIV/0!"}},{"$f":"'2 Indicadores'!D95","v":{"$error":"#DIV/0!"}},{"$f":"'2 Indicadores'!F100","v":""},{"$f":"'2 Indicadores'!F101","v":{"v":1,"d":"100.0%"}},{"$f":"'2 Indicadores'!F102","v":{"v":1,"d":"100.0%"}},{"$f":"'2 Indicadores'!F103","v":""},{"$f":"'2 Indicadores'!F104","v":{"$error":"#DIV/0!"}},{"$f":"'2 Indicadores'!F105","v":{"$error":"#DIV/0!"}},{"$f":"'2 Indicadores'!F106","v":{"$error":"#DIV/0!"}},{"$f":"'2 Indicadores'!C107","v":{"$error":"#DIV/0!"}},{"$f":"'2 Indicadores'!E110","v":0},{"$f":"'2 Indicadores'!E111","v":{"$error":"#DIV/0!"}},{"$f":"'2 Indicadores'!C113","v":{"$error":"#DIV/0!"}},{"$f":"'2 Indicadores'!C115","v":{"$error":"#DIV/0!"}},{"$f":"'2 Indicadores'!D120","v":0},{"$f":"IF(SUM('2 Indicadores'!$E$124:$E$131)=0,'2 Indicadores'!D124,('2 Indicadores'!D124+'2 Indicadores'!E124)/2)","v":0},{"$f":"IF(SUM('2 Indicadores'!$E$124:$E$131)=0,'2 Indicadores'!D125,('2 Indicadores'!D125+'2 Indicadores'!E125)/2)","v":0},{"$f":"IF(SUM('2 Indicadores'!$E$124:$E$131)=0,'2 Indicadores'!D126,('2 Indicadores'!D126+'2 Indicadores'!E126)/2)","v":0},{"$f":"IF(SUM('2 Indicadores'!$E$124:$E$131)=0,'2 Indicadores'!D127,('2 Indicadores'!D127+'2 Indicadores'!E127)/2)","v":0},{"$f":"IF(SUM('2 Indicadores'!$E$124:$E$131)=0,'2 Indicadores'!D128,('2 Indicadores'!D128+'2 Indicadores'!E128)/2)","v":0},{"$f":"IF(SUM('2 Indicadores'!$E$124:$E$131)=0,'2 Indicadores'!D129,('2 Indicadores'!D129+'2 Indicadores'!E129)/2)","v":0},{"$f":"IF(SUM('2 Indicadores'!$E$124:$E$131)=0,'2 Indicadores'!D130,('2 Indicadores'!D130+'2 Indicadores'!E130)/2)","v":0},{"$f":"IF(SUM('2 Indicadores'!$E$124:$E$131)=0,'2 Indicadores'!D131,('2 Indicadores'!D131+'2 Indicadores'!E131)/2)","v":0},{"$f":"'2 Indicadores'!C133","v":{"v":0,"d":"0.00"}},{"$f":"IF(SUM('2 Indicadores'!$E$137:$E$139)=0,'2 Indicadores'!D137,('2 Indicadores'!D137+'2 Indicadores'!E137)/2)","v":0},{"$f":"IF(SUM('2 Indicadores'!$E$137:$E$139)=0,'2 Indicadores'!D138,('2 Indicadores'!D138+'2 Indicadores'!E138)/2)","v":0},{"$f":"IF(SUM('2 Indicadores'!$E$137:$E$139)=0,'2 Indicadores'!D139,('2 Indicadores'!D139+'2 Indicadores'!E139)/2)","v":0},{"$f":"'2 Indicadores'!C140","v":{"v":0,"d":"0.00"}},{"$f":"'2 Indicadores'!C142","v":{"v":0,"d":"0.00"}},{"$f":"'2 Indicadores'!D147","v":0},{"$f":"'2 Indicadores'!D148","v":0},{"$f":"'2 Indicadores'!D149","v":0},{"$f":"'2 Indicadores'!D150","v":0},{"$f":"'2 Indicadores'!D151","v":0},{"$f":"'2 Indicadores'!E147","v":0},{"$f":"'2 Indicadores'!E148","v":0},{"$f":"'2 Indicadores'!E149","v":0},{"$f":"'2 Indicadores'!E150","v":0},{"$f":"'2 Indicadores'!E151","v":0},{"$f":"'2 Indicadores'!D155","v":0},{"$f":"'2 Indicadores'!D156","v":0},{"$f":"'2 Indicadores'!E155","v":0},{"$f":"'2 Indicadores'!E156","v":0},{"$f":"'2 Indicadores'!D161","v":0},{"$f":"'2 Indicadores'!D162","v":0},{"$f":"'2 Indicadores'!E161","v":0},{"$f":"'2 Indicadores'!E162","v":0},{"$f":"'2 Indicadores'!C164","v":{"$error":"#DIV/0!"}},{"$f":"'2 Indicadores'!D170+'2 Indicadores'!E170","v":0},{"$f":"'2 Indicadores'!D171+'2 Indicadores'!E171","v":0},{"$f":"'2 Indicadores'!D172+'2 Indicadores'!E172","v":0},{"$f":"'2 Indicadores'!D177","v":0},{"$f":"'2 Indicadores'!D178","v":0},{"$f":"'2 Indicadores'!D179","v":0},{"$f":"'2 Indicadores'!D180","v":0},{"$f":"'2 Indicadores'!D181","v":0},{"$f":"'2 Indicadores'!D182","v":0},{"$f":"'2 Indicadores'!D183","v":0},{"$f":"'2 Indicadores'!D184","v":0},{"$f":"IF('2 Indicadores'!E170>0,'2 Indicadores'!E170/('2 Indicadores'!E170+'2 Indicadores'!D170),\"\")","v":""},{"$f":"'2 Indicadores'!C186","v":{"v":0.7,"d":"0.70"}},{"$f":"'2 Indicadores'!E191","v":0},{"$f":"'2 Indicadores'!E192","v":0},{"$f":"'2 Indicadores'!E193","v":0},{"$f":"'2 Indicadores'!E194","v":0},{"$f":"'2 Indicadores'!E195","v":0},{"$f":"'2 Indicadores'!E196","v":0},{"$f":"'2 Indicadores'!E197","v":0},{"$f":"'2 Indicadores'!E198","v":0},{"$f":"'2 Indicadores'!C200","v":{"v":0,"d":"0.00"}},{"$f":"'2 Indicadores'!E205","v":0},{"$f":"'2 Indicadores'!E206","v":0},{"$f":"'2 Indicadores'!E209","v":0},{"$f":"'2 Indicadores'!E210","v":0},{"$f":"'2 Indicadores'!E211","v":0},{"$f":"'2 Indicadores'!E212","v":0},{"$f":"'2 Indicadores'!D215","v":0},{"$f":"'2 Indicadores'!E215","v":{"v":0,"d":"0%"}},{"$f":"'2 Indicadores'!D216","v":0},{"$f":"'2 Indicadores'!E216","v":{"v":0,"d":"0%"}},{"$f":"'2 Indicadores'!C218","v":{"v":0,"d":"0.00"}},{"$f":"'2 Indicadores'!D223","v":0},{"$f":"'2 Indicadores'!E223","v":0},{"$f":"'2 Indicadores'!D224","v":0},{"$f":"'2 Indicadores'!E224","v":0},{"$f":"'2 Indicadores'!E227","v":{"v":0,"d":"0%"}},{"$f":"IF('2 Indicadores'!E230=\"\",\"sem efluente\",'2 Indicadores'!E230)","v":"sem efluente"},{"$f":"IF('2 Indicadores'!E231=\"\",\"sem efluente\",'2 Indicadores'!E231)","v":"sem efluente"},{"$f":"'2 Indicadores'!E234","v":0},{"$f":"'2 Indicadores'!E235","v":0},{"$f":"'2 Indicadores'!C236","v":{"v":0.7,"d":"0.70"}},{"$f":"'2 Indicadores'!C240","v":0},{"$f":"'2 Indicadores'!C242/100","v":{"v":0,"d":"0%"}},{"$f":"'2 Indicadores'!C243","v":{"v":0,"d":"0.00"}},{"$f":"'2 Indicadores'!E243","v":{"v":0,"d":"0.00"}},{"$f":"'2 Indicadores'!C244","v":{"v":0,"d":"0.00"}},{"$f":"'2 Indicadores'!E244","v":{"v":0,"d":"0.00"}},{"$f":"'2 Indicadores'!C245","v":0},{"$f":"'2 Indicadores'!E245","v":{"v":0,"d":"0.00"}},{"$f":"'2 Indicadores'!C246","v":0},{"$f":"'2 Indicadores'!E246","v":{"v":0,"d":"0.00"}},{"$f":"'2 Indicadores'!C247","v":0},{"$f":"'2 Indicadores'!E247","v":{"v":0,"d":"0.00"}},{"$f":"'2 Indicadores'!C248","v":0},{"$f":"'2 Indicadores'!E248","v":{"v":0,"d":"0.00"}},{"$f":"'2 Indicadores'!C249","v":0},{"$f":"'2 Indicadores'!E249","v":{"v":0,"d":"0.00"}},{"$f":"'2 Indicadores'!C250","v":0},{"$f":"'2 Indicadores'!E250","v":{"v":0,"d":"0.00"}},{"$f":"'2 Indicadores'!C251","v":0},{"$f":"'2 Indicadores'!E251","v":{"v":0,"d":"0.00"}},{"$f":"'2 Indicadores'!C265","v":{"v":0,"d":"0.00"}},{"$f":"'2 Indicadores'!C255","v":0},{"$f":"'2 Indicadores'!C256","v":0},{"$f":"'2 Indicadores'!C257","v":{"v":0,"d":"0.00"}},{"$f":"'2 Indicadores'!C258","v":{"v":0,"d":"0.00"}},{"$f":"'2 Indicadores'!C259","v":{"v":0,"d":"0.00"}},{"$f":"'2 Indicadores'!C260","v":{"v":0,"d":"0.00"}},{"$f":"'2 Indicadores'!C261","v":{"v":0,"d":"0.00"}},{"$f":"'2 Indicadores'!C262","v":{"v":0,"d":"0.00"}},{"$f":"'2 Indicadores'!C263","v":{"v":0,"d":"0.00"}},{"$f":"'2 Indicadores'!C265","v":{"v":0,"d":"0.00"}},{"$f":"'2 Indicadores'!D270","v":{"v":0,"d":"0.00"}},{"$f":"'2 Indicadores'!E270","v":{"v":0,"d":"0.00"}},{"$f":"'2 Indicadores'!F270","v":" "},{"$f":"'2 Indicadores'!D273","v":0},{"$f":"'2 Indicadores'!C275","v":{"v":0.7,"d":"0.70"}},{"$f":"'2 Indicadores'!E278","v":{"v":0,"d":"0%"}},{"$f":"'2 Indicadores'!E279","v":{"v":0,"d":"0%"}},{"$f":"'2 Indicadores'!E280","v":{"v":0,"d":"0%"}},{"$f":"'2 Indicadores'!E282","v":{"v":0,"d":"0%"}},{"$f":"'2 Indicadores'!E283","v":{"v":0,"d":"0%"}},{"$f":"IF('2 Indicadores'!E285=\"x\",1,0)","v":0},{"$f":"'2 Indicadores'!E286","v":0},{"$f":"'2 Indicadores'!C287","v":{"v":0,"d":"0.00"}},{"$f":"'2 Indicadores'!C289","v":0.35},{"$f":"'2 Indicadores'!D295","v":0},{"$f":"'2 Indicadores'!D296","v":0},{"$f":"'2 Indicadores'!D297","v":0},{"$f":"'2 Indicadores'!D298","v":0},{"$f":"'2 Indicadores'!D299","v":0},{"$f":"'2 Indicadores'!D300","v":0},{"$f":"'2 Indicadores'!D301","v":0},{"$f":"'2 Indicadores'!D302","v":0},{"$f":"'2 Indicadores'!D303","v":0},{"$f":"'2 Indicadores'!D304","v":0},{"$f":"'2 Indicadores'!D305","v":0},{"$f":"'2 Indicadores'!D306","v":0},{"$f":"'2 Indicadores'!D307","v":0},{"$f":"'2 Indicadores'!D308","v":0},{"$f":"'2 Indicadores'!D322","v":{"v":0,"d":"0.00"}},{"$f":"'2 Indicadores'!D323","v":{"v":0,"d":"0.00"}},{"$f":"'2 Indicadores'!D325","v":{"v":0,"d":"0.00"}},{"$f":"'2 Indicadores'!D326","v":{"v":0,"d":"0.00"}},{"$f":"'2 Indicadores'!D334","v":""},{"$f":"'2 Indicadores'!C336","v":{"v":0,"d":"0.00"}},{"$f":"'2 Indicadores'!D340","v":0},{"$f":"'2 Indicadores'!D342","v":0},{"$f":"'2 Indicadores'!D343","v":0},{"$f":"'2 Indicadores'!D344","v":0},{"$f":"'2 Indicadores'!D345","v":0},{"$f":"'2 Indicadores'!D346","v":""},{"$f":"'2 Indicadores'!D353","v":""},{"$f":"'2 Indicadores'!D364","v":""},{"$f":"'2 Indicadores'!D365","v":""},{"$f":"'2 Indicadores'!E340","v":0},{"$f":"'2 Indicadores'!E342","v":0},{"$f":"'2 Indicadores'!E343","v":0},{"$f":"'2 Indicadores'!E344","v":0},{"$f":"'2 Indicadores'!E345","v":0},{"$f":"'2 Indicadores'!E346","v":""},{"$f":"'2 Indicadores'!E353","v":""},{"$f":"'2 Indicadores'!E364","v":""},{"$f":"'2 Indicadores'!E365","v":""},{"$f":"'2 Indicadores'!F340","v":0},{"$f":"'2 Indicadores'!F342","v":0},{"$f":"'2 Indicadores'!F343","v":0},{"$f":"'2 Indicadores'!F344","v":0},{"$f":"'2 Indicadores'!F345","v":0},{"$f":"'2 Indicadores'!F346","v":""},{"$f":"'2 Indicadores'!F353","v":""},{"$f":"'2 Indicadores'!F364","v":""},{"$f":"'2 Indicadores'!F365","v":""},{"$f":"'2 Indicadores'!D368","v":0},{"$f":"'2 Indicadores'!D369","v":0},{"$f":"'2 Indicadores'!D370","v":0},{"$f":"'2 Indicadores'!E368","v":0},{"$f":"'2 Indicadores'!E369","v":0},{"$f":"'2 Indicadores'!E370","v":0},{"$f":"'2 Indicadores'!F368","v":0},{"$f":"'2 Indicadores'!F369","v":0},{"$f":"'2 Indicadores'!F370","v":0},{"$f":"'2 Indicadores'!C371","v":{"v":1,"d":"1.00"}},{"$f":"'2 Indicadores'!E374","v":0},{"$f":"'2 Indicadores'!E375","v":0},{"$f":"'2 Indicadores'!E377","v":0},{"$f":"'2 Indicadores'!E378","v":0},{"$f":"'2 Indicadores'!C380","v":{"v":0.7,"d":"0.70"}},{"$f":"'2 Indicadores'!C382","v":0.85},{"$f":"SUM('2 Indicadores'!D388:G388)","v":{"v":0,"d":"0.00"}},{"$f":"SUM('2 Indicadores'!D390:G390)","v":{"v":0,"d":"0.00"}},{"$f":"SUM('2 Indicadores'!D391:G391)","v":{"v":0,"d":"0.00"}},{"$f":"'2 Indicadores'!D392","v":0},{"$f":"'2 Indicadores'!D395","v":0},{"$f":"'2 Indicadores'!C398","v":""},{"$f":"SUM('2 Indicadores'!D404:G404)","v":{"v":0,"d":"0.00"}},{"$f":"SUM('2 Indicadores'!D406:G406)","v":{"v":0,"d":"0.00"}},{"$f":"SUM('2 Indicadores'!D407:G407)","v":{"v":0,"d":"0.00"}},{"$f":"'2 Indicadores'!D408","v":0},{"$f":"'2 Indicadores'!C411","v":{"$error":"#DIV/0!"}},{"$f":"'2 Indicadores'!E413","v":{"$error":"#DIV/0!"}},{"$f":"'2 Indicadores'!C414","v":{"$error":"#DIV/0!"}},{"$f":"IF('2 Indicadores'!F416=\"x\",1,0)","v":0},{"$f":"'2 Indicadores'!C418","v":{"$error":"#DIV/0!"}},{"$f":"'2 Indicadores'!D422","v":0},{"$f":"'2 Indicadores'!D423","v":0},{"$f":"'2 Indicadores'!D424","v":0},{"$f":"'2 Indicadores'!D425","v":0},{"$f":"'2 Indicadores'!E422","v":0},{"$f":"'2 Indicadores'!E423","v":0},{"$f":"'2 Indicadores'!E424","v":0},{"$f":"'2 Indicadores'!E425","v":0},{"$f":"'2 Indicadores'!F422","v":0},{"$f":"'2 Indicadores'!F423","v":0},{"$f":"'2 Indicadores'!F424","v":0},{"$f":"'2 Indicadores'!F425","v":0},{"$f":"'2 Indicadores'!G422","v":0},{"$f":"'2 Indicadores'!G423","v":0},{"$f":"'2 Indicadores'!G424","v":0},{"$f":"'2 Indicadores'!G425","v":0},{"$f":"'2 Indicadores'!F429","v":0},{"$f":"'2 Indicadores'!F432","v":0},{"$f":"'2 Indicadores'!F434","v":0},{"$f":"'2 Indicadores'!C436","v":{"v":0,"d":"0.00"}},{"$f":"'2 Indicadores'!G441","v":{"v":0,"d":"0.00"}},{"$f":"'2 Indicadores'!G442","v":{"v":0,"d":"0.00"}},{"$f":"'2 Indicadores'!G445","v":{"v":0,"d":"0.0%"}},{"$f":"'2 Indicadores'!C447","v":{"v":0,"d":"0.00"}},{"$f":"'1 Questionário'!D72*'1 Questionário'!E105","v":{"v":0,"d":"0.00"}},{"$f":"'2 Indicadores'!F453","v":{"v":0,"d":"0.00"}},{"$f":"'2 Indicadores'!F454","v":{"v":0,"d":"0.00"}},{"$f":"'2 Indicadores'!F455","v":{"v":0,"d":"0.00"}},{"$f":"'2 Indicadores'!F456","v":{"v":0,"d":"0.00"}},{"$f":"'2 Indicadores'!C458","v":{"$error":"#DIV/0!"}},{"$f":"'2 Indicadores'!C460","v":{"$error":"#DIV/0!"}},{"$f":"'3 Relatório'!Q68","v":""},{"$f":"'3 Relatório'!P67","v":{"$error":"#DIV/0!"}},{"$f":"'2 Indicadores'!C22","v":{"v":0,"d":"0.00"}},{"$f":"'2 Indicadores'!C45","v":{"$error":"#DIV/0!"}},{"$f":"'2 Indicadores'!C115","v":{"$error":"#DIV/0!"}},{"$f":"'2 Indicadores'!C142","v":{"v":0,"d":"0.00"}},{"$f":"'2 Indicadores'!C164","v":{"$error":"#DIV/0!"}},{"$f":"'2 Indicadores'!C186","v":{"v":0.7,"d":"0.70"}},{"$f":"'2 Indicadores'!C200","v":{"v":0,"d":"0.00"}},{"$f":"'2 Indicadores'!C218","v":{"v":0,"d":"0.00"}},{"$f":"'2 Indicadores'!C236","v":{"v":0.7,"d":"0.70"}},{"$f":"'2 Indicadores'!C265","v":{"v":0,"d":"0.00"}},{"$f":"'2 Indicadores'!C289","v":0.35},{"$f":"'2 Indicadores'!C336","v":{"v":0,"d":"0.00"}},{"$f":"'2 Indicadores'!C382","v":0.85},{"$f":"'2 Indicadores'!C398","v":""},{"$f":"'2 Indicadores'!C418","v":{"$error":"#DIV/0!"}},{"$f":"'2 Indicadores'!C436","v":{"v":0,"d":"0.00"}},{"$f":"'2 Indicadores'!C460","v":{"$error":"#DIV/0!"}},{"$f":"'3 Relatório'!K42","v":{"$error":"#DIV/0!"}},{"$f":"'3 Relatório'!K39","v":{"$error":"#DIV/0!"}},{"$f":"'3 Relatório'!K41","v":{"$error":"#DIV/0!"}},{"$f":"'3 Relatório'!J91","v":0},{"$f":"'3 Relatório'!J92","v":0},{"$f":"'3 Relatório'!K46","v":{"$error":"#DIV/0!"}},{"$f":"'3 Relatório'!K51","v":""},{"$f":"'3 Relatório'!K53","v":0},{"$f":"COUNTA('2 Indicadores'!D340:F340,Fórmulas!D411:L411,Fórmulas!D440:L440,Fórmulas!D468:I468)","v":0},{"$f":"NO23/NP23","v":{"$error":"#DIV/0!"}},{"$f":"MAX('2 Indicadores'!D357:F357,Fórmulas!D429:L429,Fórmulas!D458:L458,Fórmulas!D486:I486)","v":{"v":0,"d":"0.0"}},{"$f":"AVERAGE('2 Indicadores'!D354:F354,Fórmulas!D426:L426,Fórmulas!D455:L455,Fórmulas!D483:I483)","v":{"$error":"#DIV/0!"}},{"$f":"MAX('2 Indicadores'!D354:F354,Fórmulas!D426:L426,Fórmulas!D455:L455,Fórmulas!D483:I483)","v":{"v":0,"d":"0.0"}},{"$f":"AVERAGE('2 Indicadores'!D355:F355,Fórmulas!D427:L427,Fórmulas!D456:L456,Fórmulas!D484:I484)","v":{"$error":"#DIV/0!"}},{"$f":"MAX('2 Indicadores'!D355:F355,Fórmulas!D427:L427,Fórmulas!D456:L456,Fórmulas!D484:I484)","v":{"v":0,"d":"0.0"}},{"$f":"AVERAGE('2 Indicadores'!D356:F356,Fórmulas!D428:L428,Fórmulas!D457:L457,Fórmulas!D485:I485)","v":{"$error":"#DIV/0!"}},{"$f":"MAX('2 Indicadores'!D356:F356,Fórmulas!D428:L428,Fórmulas!D457:L457,Fórmulas!D485:I485)","v":{"v":0,"d":"0.0"}},{"$f":"Fórmulas!N488/'Base de dados'!NP23","v":{"$error":"#DIV/0!"}}]
[]
[{"$nulls":20},"Áreas não aproveitáveis",{"$f":"AC23/AD23","v":{"$error":"#DIV/0!"}},{"$nulls":284},{"$f":"KU23","v":{"v":0,"d":"0.0"}},{"$f":"KV23","v":{"v":0,"d":"0.0"}},{"$f":"KW23","v":{"v":0,"d":"0.0"}},{"$nulls":3},{"$f":"LA23","v":{"v":0,"d":"0.0"}},{"$f":"LB23","v":{"v":0,"d":"0.0"}},{"v":0,"d":"0.0"}]
[null,null,"REFERÊNCIAS",{"$nulls":17},"Pousio",{"$f":"Z23/AD23","v":{"$error":"#DIV/0!"}},{"$nulls":100},"Coleta de Lixo",{"$f":"DZ23","v":{"v":0,"d":"0.0%"}},{"$nulls":22},"Integrantes da Família (curta duração)","Família (longa duração)","Colaboradores (curta duração)","Colaboradores (longa duração)",{"$nulls":156},{"$f":"KU25","v":{"v":0,"d":"0.0"}},{"$f":"KV25","v":{"v":0,"d":"0.0"}},{"$f":"KW25","v":{"v":0,"d":"0.0"}},{"$nulls":3},{"$f":"LA25","v":{"v":0,"d":"0.0"}},{"$f":"LB25","v":{"v":0,"d":"0.0"}},{"$f":"LC25","v":{"v":0,"d":"0.0"}}]
[{"$nulls":20},"Área não agrícola",{"$f":"Y23/AD23","v":{"$error":"#DIV/0!"}},{"$nulls":87},"Valorização da terra",{"$f":"DF23","v":""},{"$nulls":11},"Segurança Zona Rural",{"$f":"DX23","v":{"v":0,"d":"0.0%"}},{"$nulls":44},"Crédito Comercialização",{"$f":"FT23","v":{"v":0,"d":"0.0%"}},{"$nulls":7},"Comercialização Informação Diversificação venda",{"$f":"FV23","v":0},{"$nulls":55},"Drenagem Abaulamento (%)",{"$f":"IA23","v":{"v":0,"d":"0%"}},{"$nulls":7},"Montante",{"$nulls":62},{"$f":"KU26/$KU$28","v":{"$error":"#DIV/0!"}},{"$f":"KV26/$KU$28","v":{"$error":"#DIV/0!"}},{"$f":"KW26/$KU$28","v":{"$error":"#DIV/0!"}},{"$nulls":3},{"$f":"LA26/$KU$28","v":{"$error":"#DIV/0!"}},{"$f":"LB26/$KU$28","v":{"$error":"#DIV/0!"}},{"$f":"LC26/$KU$28","v":{"$error":"#DIV/0!"}}]
[null,null,"Astier, M., García-Barrios, L., Galván-Miyoshi, Y., González-Esquivel, C. E., & Masera, O. R. (2012). Assessing the sustainability of small farmer natural resource management systems. A critical analysis of the MESMIS program (1995-2010). Ecology and society, 17(3). http://dx.doi.org/10.5751/ES-04910-170325 ",{"$nulls":17},"Corpos d'água",{"$f":"AA23/AD23","v":{"$error":"#DIV/0!"}},{"$nulls":61},"Pensão; aposent; outras fontes",null,{"$f":"CG23","v":{"$error":"#DIV/0!"}},null,null,"Benfeitorias",{"$f":"CO23","v":{"v":2E-3,"d":"R$ 0.00"}},{"$f":"CL28/$CL$32","v":{"$error":"#DIV/0!"}},{"$nulls":18},"Benfeitorias",{"$f":"DG23","v":{"v":1,"d":"100.0%"}},{"$nulls":11},"Internet",{"$f":"DY23","v":{"v":0,"d":"0.0%"}},{"$nulls":22},{"$f":"IF(EG23=0,\"\",EQ23/EG23)","v":""},{"$f":"IF(EG23=0,\"\",ER23/EG23)","v":""},{"$f":"IF(EL23=0,\"\",ES23/EL23)","v":""},{"$f":"IF(EL23=0,\"\",ET23/EL23)","v":""},{"$nulls":18},"Crédito Custeio",{"$f":"FS23","v":{"v":0,"d":"0.0%"}},{"$nulls":7},"Inovação Adoção",{"$f":"FX23","v":0},{"$nulls":15},"Coleta/Destinação adequada Ef. Gasosos",{"$f":"IF('2 Indicadores'!E231=\"\",\"\",'2 Indicadores'!E231)","v":""},{"$nulls":38},"Lombadas (%)",{"$f":"IB23","v":{"v":0,"d":"0%"}},{"$nulls":7},"Tipo de ocupação das margens ",{"$f":"IJ23","v":{"v":0,"d":"0.00"}},{"$nulls":61},{"$f":"SUM(KU25:KW25)","v":{"v":0,"d":"0.00"}},{"$nulls":5},{"$f":"SUM(LA26:LC26)","v":{"v":0,"d":"0.00"}}]
[null,null,"Callisto, M., Ferreira, W. R., Moreno, P., Goulart, M., & Petrucio, M. (2002). Aplicação de um protocolo de avaliação rápida da diversidade de habitats em atividade de ensino e pesquisa (MG-RJ). Acta Limnologica Brasiliensia.",{"$nulls":17},"Vegetação Nativa",{"$f":"AB23/AD23","v":{"$error":"#DIV/0!"}},{"$nulls":61},"Atividades fora do imóvel",null,{"$f":"CF23","v":{"$error":"#DIV/0!"}},null,null,"Equipamentos",{"$f":"CT23","v":{"v":2E-3,"d":"R$ 0.00"}},{"$f":"CL29/$CL$32","v":{"$error":"#DIV/0!"}},{"$nulls":18},"Equipamentos",{"$f":"DH23","v":{"v":1,"d":"100.0%"}},{"$nulls":11},"Serviço de saúde",{"$f":"DV23","v":{"v":0,"d":"0.0%"}},{"$nulls":44},"Crédito Investimentos",{"$f":"FR23","v":{"v":0,"d":"0.0%"}},{"$nulls":7},"Inovação/Capacidade de liderança",{"$f":"FZ23","v":0},{"$nulls":15},"Coleta/Destinação adequada Ef. Líquidos",{"$f":"IF('2 Indicadores'!E230=\"\",\"\",'2 Indicadores'!E230)","v":""},{"$nulls":38},"Caixas infiltração (%)",{"$f":"IC23","v":{"v":0,"d":"0%"}},{"$nulls":7},"Alterações antrópicas",{"$f":"IL23","v":{"v":0,"d":"0.00"}}]
[null,null,"Chaves, H. M. L., & Souza, M. A. (2015). Índice para a avaliação do risco de contaminação da água por pesticidas: desenvolvimento e validação. Revista Brasileira de Recursos Hídricos, 20(2), 286-297.",{"$nulls":17},"Silvicultura",{"$f":"X23/AD23","v":{"$error":"#DIV/0!"}},{"$nulls":61},"Outras atividades no imóvel",null,{"$f":"CE23","v":{"$error":"#DIV/0!"}},null,null,"Semoventes",{"$f":"CU23","v":0},{"$f":"CL30/$CL$32","v":{"$error":"#DIV/0!"}},{"$nulls":18},"Semoventes",{"$f":"DI23","v":""},{"$nulls":11},"Estradas de acesso",{"$f":"DU23","v":{"v":0,"d":"0.0%"}},{"$nulls":44},"Custo de Produção",{"$f":"FN23","v":{"v":0,"d":"0.0%"}},{"$nulls":7},"Comercialização Certificação Mercados Institucionais",{"$f":"FW23","v":0},{"$nulls":15},"Coleta/Destinação adequada Esgoto",{"$f":"'2 Indicadores'!F223","v":{"$error":"#DIV/0!"}},{"$nulls":47},"Cobertura vegetal no leito",{"$f":"IN23","v":{"v":0,"d":"0.00"}},{"$nulls":61},"Suficiente","Insuficiente","Situação Crítica",{"$nulls":3},"Suficiente","Insuficiente","Situação Crítica"]
[null,null,"Deponti, C.M.; Eckert, C.; Azambuja, J.L.B (2002). Strategy for building indicators for assessing sustainability and monitoring systems. Agroecology and Sustainable Rural Development, Porto Alegre, v.3, n.4, p.44-52.",{"$nulls":17},"Lavouras Permanentes",{"$f":"U23/AD23","v":{"$error":"#DIV/0!"}},{"$nulls":61},"Atividades agrícolas no imóvel",null,{"$f":"CD23","v":{"$error":"#DIV/0!"}},null,null,"Valor da terra",{"$f":"CZ23*DB23","v":0},{"$f":"CL31/$CL$32","v":{"$error":"#DIV/0!"}},{"$nulls":18},"Área com irrigação",{"$f":"DJ23","v":{"$error":"#DIV/0!"}},{"$nulls":11},"Energia Elétrica",{"$f":"DT23","v":{"v":0,"d":"0.0%"}},{"$nulls":44},"Fluxo de Caixa",{"$f":"FM23","v":{"v":0,"d":"0.0%"}},{"$nulls":24},"Destinação adequada Lixo",{"$f":"'2 Indicadores'!F224","v":{"$error":"#DIV/0!"}},{"$nulls":38},"Buracos (%)",{"$f":"ID23","v":{"v":0,"d":"0%"}},{"$nulls":7},"Erosão próxima e/ou nas margens",{"$f":"IP23","v":{"v":0,"d":"0.00"}},{"$nulls":61},{"$f":"KU27","v":{"$error":"#DIV/0!"}},{"$f":"KV27","v":{"$error":"#DIV/0!"}},{"$f":"KW27","v":{"$error":"#DIV/0!"}},{"$nulls":3},{"$f":"LA27","v":{"$error":"#DIV/0!"}},{"$f":"LB27","v":{"$error":"#DIV/0!"}},{"$f":"LC27","v":{"$error":"#DIV/0!"}}]
[null,null,"Corrêa, I. V. (2007). Indicadores de sustentabilidade para agroecossistemas em transição agroecológica na região sul do Rio Grande do Sul. Pelotas-RS: UFPel-Universidade Federal de Pelotas.",{"$nulls":17},"Lavouras temporárias",{"$f":"V23/AD23","v":{"$error":"#DIV/0!"}},{"$nulls":66},"Estimativa Patrimonial",{"$f":"DD23","v":{"$error":"#DIV/0!"}},{"$nulls":32},"Transporte Escolar",{"$f":"DW23","v":{"v":0,"d":"0.0%"}},{"$nulls":44},"Grau de organização (Associação etc.)",{"$f":"FP23","v":{"v":0,"d":"0.0%"}},{"$nulls":24},"Coleta/Destinação adequada Res. Sólidos",{"$f":"'2 Indicadores'!E227","v":{"v":0,"d":"0.0%"}},{"$nulls":38},"Sulcos de erosão (%)",{"$f":"IE23","v":{"v":0,"d":"0%"}},{"$nulls":7},"Transparência da água",{"$f":"IR23","v":{"v":0,"d":"0.00"}}]
[null,null,"Fidalski, J. (1997). Diagnóstico de manejo e conservação do solo e da água na região noroeste do Paraná. R. Unimar, 19, 845-851.",{"$nulls":17},"Pastagens",{"$f":"W23/AD23","v":{"$error":"#DIV/0!"}},{"$nulls":87},"Evolução Patrimonial Anual Total",{"$f":"DK23","v":{"$error":"#DIV/0!"}},{"$nulls":11},"Disponibilidade Água",{"$f":"DS23","v":{"v":0,"d":"0.0%"}},{"$nulls":44},"Assistência Técnica",{"$f":"FO23","v":{"v":0,"d":"0.0%"}},{"$nulls":73},"Odor da água",{"$f":"IT23","v":{"v":0,"d":"0.00"}}]
[null,null,"Gitman, L. J., & Zutter, C. J. (2012). Principles of managerial finance 13th edition. Massachusetts: Addison-Wesley Publishing Company.",{"$nulls":106},"Evolução Patrimonial Anual Total s/valorização da terra",{"$f":"DL23","v":{"$error":"#DIV/0!"}},{"$nulls":57},"Regularização Ambiental",{"$f":"FQ23","v":{"v":0,"d":"0.0%"}},{"$nulls":73},"Tipo de fundo",{"$f":"IV23","v":{"v":0,"d":"0.00"}}]
[null,null,"Gómez-Limón, J. A., & Sanchez-Fernandez, G. (2010). Empirical evaluation of agricultural sustainability using composite indicators. Ecological economics, 69(5), 1062-1075. https://10.1016/j.ecolecon.2009.11.027 "]
[null,null,"Kovach, J., Petzoldt, C., Degni, J., & Tette, J. (1992). A method to measure the environmental impact of pesticides.",{"$nulls":240},"Jusante"]
[null,null,"López-Ridaura, S., Masera, O., & Astier, M. (2002). Evaluating the sustainability of complex socio-environmental systems. The MESMIS framework. Ecological indicators, 2(1-2), 135-148.",{"$nulls":240},"Tipo de ocupação das margens ",{"$f":"IK23","v":{"v":0,"d":"0.00"}}]
[null,null,"Matos Filho, A. M. (2004). Agricultura orgânica sob a perspectiva da sustentabilidade: uma análise da região de Florianópolis/SC, Brasil.",{"$nulls":240},"Alterações antrópicas",{"$f":"IM23","v":{"v":0,"d":"0.00"}}]
[null,null,"Mendes, I. C., Souza, L. M., Sousa, D. M. G., Lopes, A. A. C., Reis-Junior, F. B., Lacerda, M. P. C., & Malaquias, J. V. (2019). Critical limits for microbial indicators in tropical Oxisols at post-harvest: The FERTBIO soil sample concept. Applied Soil Ecology, 139, 85–93. https://doi.org/10.1016/j.apsoil.2019.02.025.",{"$nulls":240},"Cobertura vegetal no leito",{"$f":"IO23","v":{"v":0,"d":"0.00"}}]
[null,null,"Pesticide Property Database https://sitem.herts.ac.uk/aeru/ppdb/",{"$nulls":240},"Erosão próxima e/ou nas margens",{"$f":"IQ23","v":{"v":0,"d":"0.00"}}]
[null,null,"Qiu, H. J., Zhu, W. B., Wang, H. B., & Cheng, X. (2007). Analysis and design of agricultural sustainability indicators system. Agricultural Sciences in China, 6(4), 475-486.",{"$nulls":240},"Transparência da água",{"$f":"IS23","v":{"v":0,"d":"0.00"}}]
[null,null,"Rao, N. H., & Rogers, P. P. (2006). Assessment of agricultural sustainability. Current science, 439-448.",{"$nulls":240},"Odor da água",{"$f":"IU23","v":{"v":0,"d":"0.00"}}]
[null,null,"Ribeiro, A. C. (1999). Recomendações para o uso de corretivos e fertilizantes em Minas Gerais: 5. Aproximação. Comissão de fertilidade do solo do Estado de Minas Gerais.",{"$nulls":240},"Tipo de fundo",{"$f":"IW23","v":{"v":0,"d":"0.00"}}]
[null,null,"Rodrigues, G. S., Campanhola, C., & Kitamura, P. C. (2003). An environmental impact assessment system for agricultural R&D. Environmental Impact Assessment Review, 23(2), 219-244."]
[null,null,"Rodrigues, G. S., Rodrigues, I. A., Buschinelli, C. C. de A., & de Barros, I. (2010). Integrated farm sustainability assessment for the environmental management of rural activities. Environmental Impact Assessment Review, 30(4), 229–239. https://doi.org/10.1016/j.eiar.2009.10.002"]
[null,null,"Sala, S., Ciuffo, B., & Nijkamp, P. (2015). A systemic framework for sustainability assessment. Ecological economics, 119, 314-325. http://dx.doi.org/10.1016/j.ecolecon.2015.09.015"]
[null,null,"Sousa, D.M.G.; Lobato, E. (2004). Soil acidity correction. In: Sousa, D.M.G. de; Lobato, E. (Ed.). Cerrado: soil correction and fertilization. 2nd ed. Brasília: Embrapa Technological Information; Planaltina: Embrapa Cerrados, p.81-96."]

{"sheet":"IQS 1","index":13,"n_rows":590,"n_cols":10,"rows_kept":590,"merged":[[0,1,1,1],[9,6,9,7],[10,1,10,5],[11,1,11,2],[11,6,12,6],[11,7,12,7],[12,1,12,2],[13,1,13,2],[14,1,14,2],[16,1,16,2],[17,1,17,2],[19,1,19,2],[20,1,20,2],[21,1,21,2],[22,1,22,2],[23,1,23,2],[24,1,24,2],[25,1,25,2],[26,1,26,2],[27,1,27,2],[29,1,29,2],[43,1,43,2],[44,1,44,2],[46,1,46,2],[47,1,47,2],[48,1,48,2],[49,1,49,2],[50,1,50,2],[55,1,55,2],[70,1,70,2],[83,17,83,18],[83,19,83,20],[86,1,86,2],[87,1,87,5],[89,1,89,2],[90,1,90,5],[97,1,100,1],[101,1,101,2],[103,1,103,2],[105,1,105,2],[113,1,116,1],[117,1,117,2],[119,1,119,2],[120,1,120,2],[121,1,121,2],[122,1,122,2],[123,1,123,2],[124,1,124,2],[128,1,129,1],[128,2,129,2],[146,1,146,2],[147,1,147,2],[148,1,148,2],[175,1,176,2],[178,1,178,3],[178,5,178,7],[179,1,179,2],[179,5,180,7],[180,1,181,2],[180,3,181,3],[182,1,182,2],[183,1,183,2],[190,7,191,7],[191,2,191,3],[219,1,219,5],[219,7,220,8],[220,1,220,4],[220,5,221,5],[221,7,221,8],[222,7,222,8],[223,7,223,8],[224,7,224,8],[228,1,232,1],[228,2,228,3],[228,4,228,5],[233,1,237,1],[233,4,233,5],[238,1,242,1],[238,2,238,3],[238,4,238,5],[243,1,247,1],[243,2,243,3],[243,4,243,5],[250,1,250,5],[251,1,251,4],[251,5,252,5],[260,1,263,1],[260,2,260,3],[260,4,260,5],[260,6,260,7],[264,1,267,1],[264,2,264,3],[264,4,264,5],[264,6,264,7],[268,1,271,1],[268,2,268,3],[268,4,268,5],[268,6,268,7],[272,1,275,1],[272,2,272,3],[272,4,272,5],[272,6,272,7],[279,27,279,28],[282,1,282,2],[291,1,291,7],[292,4,292,5],[292,6,292,7],[299,1,299,2],[308,1,308,7],[309,4,309,5],[309,6,309,7],[315,1,315,2],[324,1,324,7],[325,4,325,5],[325,6,325,7],[331,1,331,2],[339,1,339,5],[346,1,346,2],[354,1,354,5],[361,1,361,2],[369,1,369,5],[376,1,376,2],[384,1,384,5],[385,1,385,2],[385,3,385,5],[391,1,391,3],[392,1,394,3],[396,1,396,2],[410,1,410,2],[435,1,437,8],[439,1,439,2],[443,1,444,1],[443,2,444,2],[466,1,466,2],[482,1,482,2],[501,1,502,1],[505,1,506,1],[509,1,510,1],[513,1,514,1],[517,1,518,1],[521,1,522,1],[525,1,526,1],[529,1,530,1],[533,1,534,1],[537,1,538,1],[541,1,542,1],[547,1,548,1],[551,1,552,1],[555,1,556,1],[559,1,560,1],[563,1,564,1],[567,1,568,1],[571,1,572,1],[575,1,576,1],[579,1,580,1],[583,1,584,1],[587,1,588,1]]}
[null,"ISA"]
[null,null,"ÍNDICE QUALIDADE DO SOLO (IQS)"]
[]
[null,"DATA "]
[null,"Identificação do Talhão"]
[null,"Área"]
[null,"Atividade",null,"Escolha uma opção"]
[]
[1,"PRODUTIVIDADE"]
[{"$nulls":6},"Fator de ponderação \t"]
[null,"1.1 Descrição das atividades agrícolas, pecuárias e florestais no talhão",{"$nulls":4},"> 20%",0.9]
[null,"Atividades",null,{"$f":"C7","v":0},null,null,"produção = local ou referência",0.7]
[null,"Unidades de medida (selecione a unidade)"]
[null,"Produtividade média atual",{"$nulls":4},"< 20%",0.5]
[null,"Produtividade média na região ou do imóvel rural",{"$nulls":4},"< 40%",0.3]
[]
[null,"1.2 Insumos (opcional)"]
[null,"Atividade (selecionar)",null,null,"Escolha uma opção"]
[null,"Calcário (Kg/ha)"]
[null,"Fertilizantes solúveis (desccrição da formulação)"]
[null,"Fertilizantes solúveis (Kg/ha)"]
[null,"Remineralizadores / pós de rocha (descrição)"]
[null,"Remineralizadores / pós de rocha (Kg/ha)"]
[null,"Fertilizantes orgânicos (descrição)"]
[null,"Fertilizantes orgânicos (Kg/ha)"]
[null,"N (Kg) / ha "]
[null,"P (Kg) / ha"]
[null,"K (Kg) / ha "]
[]
[null,"1.3 Análise foliar (opcional)"]
[null,"Atividade (selecionar)",null,"Escolha uma opção","Resultado"]
[null,"P (g/kg)",null,null,{"$f":"IF(ISBLANK(C32),\"\",E486)","v":""}]
[null,"K (g/kg)",null,null,""]
[null,"N (g/kg)",null,null,""]
[null,"S (g/kg)",null,null,""]
[null,"Ca (g/kg)",null,null,""]
[null,"Mg (g/kg)",null,null,""]
[null,"B (mg/kg)",null,null,""]
[null,"Zn (mg/kg)",null,null,""]
[null,"Fe (mg/kg)",null,null,""]
[null,"Mn (mg/kg)",null,null,""]
[null,"Cu (mg/kg)",null,null,""]
[]
[null,"1.4 Análise financeira (opcional)"]
[null,"Fertilizantes (R$/ha)"]
[]
[null,"Total de insumos (R$/ha)",null,null,"Fertilizantes + sementes + pesticidas"]
[null,"Custos Fixos (R$/ha)"]
[null,"Total costs (R$/ha)",null,{"$f":"IF(D47>0,D48+D47,\"\")","v":""},{"$f":"IF(D50>0,(D49/D50),\"\")","v":""}]
[null,"Receita Bruta (R$/ha)"]
[null,"Resultado - Receita Líquida (R$/ha)",null,{"$f":"IF(D50>0,D50-D49,\"\")","v":""},{"$f":"IF(D50>0,D51/D50,\"\")","v":""}]
[]
[null,"RESULTADO",{"$f":"IF(D14>0,F187,0)","v":{"v":0,"d":"0.00"}}]
[]
[2,"ANÁLISES QUÍMICAS E BIOLÓGICAS"]
[]
[null,"Identificação do Talhão",{"$f":"C5","v":0}]
[{"$nulls":4},"Resultado"]
[null,"Teor de argila",null,"dag kg-1 (%) Argila",{"$f":"IF(ISBLANK(C59),0,IF(C59<=15,H222,IF(AND(C59>15,C59<35),H223,IF(AND(C59>=35,C59<=60),H224,IF(C59>60,H225)))))","v":{"v":0,"d":"0.00"}}]
[null,"Matéria Orgânica",null,"(dag kg-1)",{"$f":"IF(H233>1,1,IF(H233<0,0,H233))","v":{"v":0,"d":"0.00"}}]
[null,"P disponível",null,"(mg dm-3) (Mehlich-1)",{"$f":"IF(F279>1,1,IF(F279<0,0,F279))","v":{"v":0,"d":"0.00"}}]
[null,"Ca trocável",null,"(cmolc dm-3)",{"$f":"IF(ISBLANK(C62),0,IF(F298>1,1,IF(F298<0,0,F298)))","v":{"v":0,"d":"0.00"}}]
[null,"Mg trocável",null,"(cmolc dm-3)",{"$f":"IF(ISBLANK(C63),0,IF(F314>1,1,IF(F314<0,0,F314)))","v":{"v":0,"d":"0.00"}}]
[null,"K trocável",null,"(mg dm-3)",{"$f":"IF(ISBLANK(C64),0,IF(F330>1,1,IF(F330<0,0,F330)))","v":{"v":0,"d":"0.00"}}]
[null,"pH em água",null,"Índice",{"$f":"IF(ISBLANK(C65),0,IF(E345>1,1,IF(E345<0,0,E345)))","v":{"v":0,"d":"0.00"}}]
[null,"Al trocável",null,"(cmolc dm-3)",{"$f":"IF(C66>2,0,IF(ISBLANK(C66),0,IF(E360>1,1,IF(E360<0,0,E360))))","v":{"v":0,"d":"0.00"}}]
[null,"CTC",null,"(cmolc dm-3)",{"$f":"IF(ISBLANK(C67),0,E375)","v":{"v":0,"d":"0.00"}}]
[null,"Saturação por bases",null,"(%)",{"$f":"IF(ISBLANK(C68),0,IF(E390>0.83,1,IF(E390<0,0,E390)))","v":{"v":0,"d":"0.00"}}]
[null,"Resultado Parcial",{"$f":"AVERAGE(E60,E61,E68)","v":{"v":0,"d":"0.00"}}]
[]
[null,"Avaliação da biologia do solo/BioAS (opcional)"]
[null,"Arilsulfatase",null,"(mg p-nitrofenol kg-1 h-1)"]
[null,"Betaglicosidase",null,"(mg p-nitrofenol kg-1 h-1)"]
[null,"Matéria Orgânica (0-10cm)",null,"(dag kg-1)","Resultado"]
[null,"IQS Biológico ",null,"Índice",{"$f":"IF(C75>0,C75,\"\")","v":""}]
[null,"Índice Armaz. nutrientes",null,"Índice"]
[null,"Índice Sup. nutrientes",null,"Índice"]
[null,"IQS Químico",null,"Índice"]
[null,"IQS FertBio",null,"Índice"]
[null,"Resultado Parcial",{"$f":"C75","v":{"v":0,"d":"0.00"}}]
[]
[null,"RESULTADO",{"$f":"IF(C80>0,(2*C69+C80)/3,C69)","v":{"v":0,"d":"0.00"}}]
[]
[3,"EROSÃO DO SOLO"]
[]
[{"$nulls":3},"Escolha uma opção  ","Área (ha)","Proporção (%) área total","Fator de ponderação"]
[null,"3.1 Intensidade do estágio de degradação*",{"$nulls":3},{"$f":"IF(E87>0,E87/C457,\" \")","v":" "},{"v":1,"d":"1.0"},"Inicial"]
[null,"* Evidências de erosão: Inicial - redução de infiltração de água, raízes expostas; Intermediário - remoção do horizonte superficial, presença de sulcos rasos localizados; Avançado - sulcos profundos e disseminados na área, voçorocas, movimento de massa (deslocamento de um volume de solo).\t",{"$nulls":4},0.8,"Intermediário"]
[{"$nulls":3},"Escolha uma opção  "]
[null,"3.2 Tendência de comportamento do processo",{"$nulls":4},0.5,"Avançado"]
[null,"** Adoção de medidas de recuperação ou mitigação como terraceamentos, barreiras físicas, barramentos, revegetação, etc."]
[null,"RESULTADO",{"$f":"IF(B421>0,(B421*B422*1.2)+(B421*C422)+(B421*D422*0.8),0.7)","v":{"v":0.7,"d":"0.70"}}]
[]
[4,"GRAU DE ADOÇÃO DE PRÁTICAS CONSERVACIONISTAS - SOLO E ÁGUA"]
[]
[{"$nulls":3},{"$f":"C7","v":0}]
[null,null,"Área  (ha)",{"$f":"C6","v":0},"Fator de ponderação"]
[null,"4.1 Grau de adoção de práticas para a conservação dos solos\n","Alto",null,{"v":1,"d":"1.0"}]
[null,null,"Moderado",null,0.6]
[null,null,"Incipiente",null,0.3]
[null,null,"Situação crítica*",null,0.1]
[null,"*Situação crítica (solo/água) - ESPECIFICAR"]
[{"$nulls":3},"Escolha uma opção  ","Fator de ponderação","Verificação área talhão =>",{"$f":"SUM(D98:D101)/C6","v":{"$error":"#DIV/0!"}}]
[null,"4.2  Estratégias infiltração/retenção - água no solo \n",null,null,{"v":1,"d":"1.0"},"Suficiente"]
[{"$nulls":3},"Escolha uma opção  ",0.4,"Insuficiente","Sim"]
[null,"4.3 Preparo/manejo do solo sem revolvimento*\n",null,null,0.1,"Situação crítica","Não"]
[null,"* Sistema Plantio Direto, Cultivo Mínimo"]
[null,"RESULTADO",{"$f":"IF(C460=0,\"\",(((B460*2)+C460)/3))","v":""}]
[]
[5,"GRAU DE ADOÇÃO DE PRÁTICAS CONSERVACIONISTAS - BIODIVERSIDADE"]
[]
[{"$nulls":3},{"$f":"C7","v":0}]
[null,null,"Área  (ha)",{"$f":"C6","v":0},"Fator de ponderação"]
[null,"5.1 Grau de adoção de práticas que auxiliam na agrobiodiversidade\n","Alto",null,{"v":1,"d":"1.0"}]
[null,null,"Moderado",null,0.6]
[null,null,"Incipiente",null,0.3]
[null,null,"Situação crítica*",null,0.1]
[null,"*Situação crítica - ESPECIFICAR"]
[{"$nulls":5},"Verificação área talhão =>",{"$f":"SUM(D114:D117)/C6","v":{"$error":"#DIV/0!"}},{"$f":"SUM(D114:D117)","v":0}]
[null,"5.2 Uso de insumos biológicos\n",null,null,"Escolha uma opção  "]
[null,"5.3 Uso de rotação de culturas/cultivos consorciados\n",null,null,"Escolha uma opção  "]
[null,"5.4 Uso de plantas de cobertura/espécies arbóreas\n",null,null,"Escolha uma opção  "]
[null,"5.5 Nº de espécies - plantas de cobertura/2ª safra\n"]
[null,"5.6 Data do plantio das plantas de cobertura\n"]
[null,"5.7 Pesticidas (L/ha)\n"]
[]
[null,"RESULTADO",{"$f":"IF(AND(D120=\"Sim\",D121=\"Sim\",D122=\"Sim\"),(C474*C468)+(C475*C469)+(C476*C470)+(C477*C471),((C474*C468)+(C475*C469)+(C476*C470)+(C477*C471))*0.8)","v":{"$error":"#DIV/0!"}}]
[]
[null,"IQS",{"$f":"H172","v":{"v":0.09999999999999999,"d":"0.10"}},null,null,"Identificação ",{"$f":"C5","v":0}]
[{"$nulls":5},"Data",{"$f":"C4","v":"00:00:00"}]
[{"$nulls":5},"Área (ha)",{"$f":"C6","v":0}]
[null,"Fertilidade do Solo"]
[null,"Matéria Orgânica do Solo (MOS) (dag kg-1)",null,{"$f":"C60","v":{"v":0,"d":"0.0"}}]
[null,"P disponível (mg dm-3)",null,{"v":0,"d":"0.0"}]
[null,"Ca trocável (cmolc dm-3)",null,{"v":0,"d":"0.0"}]
[null,"Mg trocável (cmolc dm-3)",null,{"v":0,"d":"0.0"}]
[null,"K trocável (mg dm-3)",null,{"v":0,"d":"0.0"}]
[null,"pH",null,{"v":0,"d":"0.0"}]
[null,"Al trocável (cmolc dm-3)",null,{"v":0,"d":"0.0"}]
[null,"CTC (cmolc dm-3)",null,{"v":0,"d":"0.0"}]
[null,"Saturação por bases (%)",null,{"v":0,"d":"0.0"}]
[null,"K/CTC (%) (referência 3 - 5%)",null,{"$f":"IF(D137>0,((D137/1000*2.5577)/D140*100),\"\")","v":""}]
[null,"Ca/CTC (%) (referância 40 - 60%)",null,{"$f":"IF(D135>0,D135/D140*100,\"\")","v":""}]
[null,"Mg/CTC (%) (referência 15 - 20%)",null,{"$f":"IF(D136>0,D136/D140*100,\"\")","v":""}]
[]
[null,"Aporte de Nutrientes ",{"$nulls":3},"Erosão do Solo "]
[null,"N (Kg/ha) ",null,{"$f":"IF(D26=\"\",\"\",D26)","v":""},null,"Área (ha)",null,{"$f":"E87","v":0}]
[null,"P (Kg/ha)",null,{"$f":"IF(D27=\"\",\"\",D27)","v":""},null,"Estágio - degradação",null,{"$f":"D87","v":0}]
[null,"K (Kg/ha) ",null,{"$f":"IF(D28=\"\",\"\",D28)","v":""},null,"Tendência - comportamento",null,{"$f":"D90","v":0}]
[]
[null,"Produtividade",{"$nulls":3},"Cobertura do solo / pesticidas"]
[null,"Atividade",null,{"$f":"D12","v":{"v":0,"d":"0.0%"}},null,"Nº espécies plantas de cobertura",null,{"$f":"IF(D123>0,D123,\"\")","v":""}]
[null,"Unidade",null,{"$f":"D13","v":0},null,"Data plantio plantas de cobertura",null,{"$f":"IF(D124>0,D124,\"\")","v":""}]
[null,"Produtividade",null,{"$f":"D14","v":0},null,"Pesticidas (L/ha) (safra)",null,{"$f":"IF(D125>0,D125,\"\")","v":""}]
[]
[null,"Resultado Econômico ",{"$nulls":3},"Atividade enzimática no solo"]
[null,"Insumos (R$/ha)",null,{"$f":"D47","v":{"v":0,"d":"R$ 0"}},null,"Arilsulfatase (mg p-nitrofenol kg-1 h-1)",null,{"$f":"IF(C72=\"\",\"\",C72)","v":""}]
[null,"Custo Total (R$/ha)",null,{"$f":"D49","v":""},null,"ß-glucosidase (mg p-nitrofenol kg-1 h-1)",null,{"$f":"IF(C73=\"\",\"\",C73)","v":""}]
[null,"Receita Líquida (R$/ha)",null,{"$f":"D51","v":""},null,"IQS Biológico ",null,{"$f":"IF(C75=\"\",\"\",C75)","v":""}]
[]
[null,"Análise Foliar",{"$nulls":3},"Qualidade do Solo",null,{"$f":"G129","v":0}]
[null,"P (g/kg)",{"$f":"IF(C32>0,C32,\"\")","v":""},{"$f":"IF(C32>0,E32,\"\")","v":""},null,"MOS",null,{"$f":"E60","v":{"v":0,"d":"0.00"}},0.7]
[null,"K (g/kg)","","",null,"P disponível",null,{"$f":"E61","v":{"v":0,"d":"0.00"}},0.7]
[null,"N (g/kg)","","",null,"Saturação por bases",null,{"$f":"E68","v":{"v":0,"d":"0.00"}},0.7]
[null,"S (g/kg)","","",null,"CTC",null,{"$f":"E67","v":{"v":0,"d":"0.00"}},0.7]
[null,"Ca (g/kg)","","",null,"pH",null,{"$f":"E65","v":{"v":0,"d":"0.00"}},0.7]
[null,"Mg (g/kg)","","",null,"Erosão do Solo ",null,{"$f":"C92","v":{"v":0.7,"d":"0.70"}},0.7]
[null,"B (mg/kg)","","",null,"Conservação solo e água",null,{"$f":"C108","v":""},0.7]
[null,"Zn (mg/kg)","","",null,"Conservação biodiversidade",null,{"$f":"IF(H119>0,C127,\"\")","v":""},0.7]
[null,"Fe (mg/kg)","","",null,"Produtividade",null,{"$f":"C53","v":{"v":0,"d":"0.00"}},0.7]
[null,"Mn (mg/kg)","","",null,"IQS Biológico (enzimas)",null,{"$f":"IF(ISBLANK(C75),\"\",C75)","v":""},0.7]
[null,"Cu (mg/kg)","","",null,"Índice de Qualidade do Solo",null,{"$f":"AVERAGE(H162:H171)","v":{"v":0.09999999999999999,"d":"0.10"}}]
[]
[]
[]
[null,"FORMULAS"]
[]
[]
[1,"Fator de Ponderação",{"$nulls":3},"Fórmulas\t\t"]
[null,"> 20%",null,0.9,null,"Formula (R parcial) = Yo + ax"]
[null,"produção = local ou referência",null,0.7]
[{"$nulls":5},"yo",{"v":-0.3,"d":"-0.30"}]
[null,"< 20%",null,0.5,null,"a",0.01]
[null,"< 40%",null,0.3,null,{"$f":"IF(ISBLANK(D14),\"\",(G182+G183*(100+(E190*100))))","v":""},{"$f":"IF(ISBLANK(E14),\"\",(G182+G183*(100+(F190*100))))","v":""},{"$f":"IF(ISBLANK(F14),\"\",(G182+G183*(100+(G190*100))))","v":""}]
[]
[]
[{"$nulls":5},{"$f":"AVERAGE(E192:G192)","v":{"$error":"#DIV/0!"}}]
[]
[]
[null,"Variação do item 1.3 em relação ao item 1.5",null,null,{"$f":"IF(D14>0,((D14/D15)-1),\"\")","v":""},{"$f":"IF(E14>0,((E14/E15)-1),\"\")","v":""},{"$f":"IF(F14>0,((F14/F15)-1),\"\")","v":""}]
[{"$nulls":4},{"v":1,"d":"1.0"},{"v":1,"d":"1.0"},{"v":1,"d":"1.0"},"Fator de Ponderação"]
[null,"Resultado Parcial","Produtividade",null,{"$f":"IF(ISBLANK(D14),\"\",IF(F184>1,1,F184))","v":""},{"$f":"IF(ISBLANK(E14),\"\",IF(G184>1,1,G184))","v":""},{"$f":"IF(ISBLANK(F14),\"\",IF(H184>1,1,H184))","v":""}]
[]
[]
[null,"Unidades",null,null,"Unidades"]
[null,"Aquicultura",null,null,"Sc/ha"]
[null,"Pecuária de Leite",null,null,"Ton./ha"]
[null,"Pecuária de Corte",null,null,"Kg/ha"]
[null,"Carne de Frango",null,null," @/ha/ano"]
[null,"Café",null,null,"L de Leite/ha/ano"]
[null,"Algodão",null,null,"L of Leite/vaca/dia"]
[null,"Ovos",null,null,"Kg/dia"]
[null,"Peixes",null,null,"Kg de ração/kg de carne produzida"]
[null,"Silvicultura",null,null,"Leitões comercializados/porca/ano"]
[null,"Fruticultura",null,null,"Ovos/galinha/ano"]
[null,"Grãos",null,null,"Conversão Alimentar/dúzia de ovos"]
[null,"Pecuária  ",null,null,"Conversão Alimentar/Kg"]
[null,"Milho",null,null,"Percentagem de postura de aves"]
[null,"Oleaginosas"]
[null,"Outros"]
[null,"Suínos"]
[null,"Batata"]
[null,"Arroz"]
[null,"Soja"]
[null,"Cana de Açúcar"]
[null,"Hortaliças"]
[null,"Trigo"]
[]
[]
[2,"MO - Fator de Ponderação",{"$nulls":5},"Granulometria do solo (dag kg-1 argila)"]
[null,"Classificação",{"$nulls":3},"Ponderação"]
[null,"Arenosa","Média","Argilosa","Muito Arg.",null,null,"Arenosa",null,"≤ 15"]
[null,{"v":0,"d":"0.00"},{"v":0,"d":"0.00"},{"v":0,"d":"0.00"},{"v":0,"d":"0.00"},{"v":0.1,"d":"0.10"},null,"Média",null,"16 a 34"]
[null,{"v":0.8,"d":"0.80"},{"v":1.6,"d":"1.60"},{"v":2.4,"d":"2.40"},{"v":2.8,"d":"2.80"},{"v":0.5,"d":"0.50"},null,"Argilosa",null,"35 a 60"]
[null,{"v":1.1,"d":"1.10"},{"v":2.1,"d":"2.10"},{"v":3.1,"d":"3.10"},{"v":3.6,"d":"3.60"},{"v":0.7,"d":"0.70"},null,"Muito argilosa",null,"> 60"]
[null,{"v":1.5,"d":"1.50"},{"v":3,"d":"3.00"},{"v":4.5,"d":"4.50"},{"v":5.2,"d":"5.20"},{"v":1,"d":"1.00"}]
[null,{"v":4.5,"d":"4.50"},{"v":9,"d":"9.00"},{"v":13.5,"d":"13.50"},{"v":15.6,"d":"15.60"},{"v":0.7,"d":"0.70"}]
[]
[null,"Arenosa"," Yo + ax + bx2 + cx3 ",null,"Formula2 = Yo + ax ",null,null,{"$f":"IF(AND(E59=\"Arenosa\"),IF(C60<1.5,E232,F232),0)","v":{"v":0,"d":"0.00"}}]
[null,null,"Yo",{"v":0.1,"d":"0.100"},"Yo",1.15,null,{"$f":"IF(AND(E59=\"Média\"),IF(C60<3,E242,F242),0)","v":{"v":0,"d":"0.00"}}]
[null,null,"a",{"v":0.3597,"d":"0.360"},"a",{"v":-0.1,"d":"-0.10"},null,{"$f":"IF(AND(E59=\"Argilosa\"),IF(C60<4.5,E237,F237),0)","v":{"v":0,"d":"0.00"}}]
[null,null,"b",{"v":0.1926,"d":"0.193"},{"$f":"D230+D231*C60+D232*C60^2+D233*C60^3","v":{"v":0.1,"d":"0.10"}},{"$f":"F230+F231*C60","v":1.15},null,{"$f":"IF(AND(E59=\"Muito argilosa\"),IF(C60<5.2,E247,F247),0)","v":{"v":0,"d":"0.00"}}]
[null,null,"c",{"v":-0.0216,"d":"-0.022"},{"$nulls":3},{"$f":"(H229+H230+H231+H232)","v":{"v":0,"d":"0.00"}}]
[null,"Argilosa"," Yo + ax + bx2 + cx3 ",null,"Formula2 = Yo + ax "]
[null,null,"Yo",{"v":0.1,"d":"0.100"},"Yo",1.15]
[null,null,"a",{"v":-0.0452,"d":"-0.045"},"a",{"v":-0.03333,"d":"-0.03"}]
[null,null,"b",{"v":0.1269,"d":"0.127"},{"$f":"D235+D236*C60+D237*C60^2+D238*C60^3","v":{"v":0.1,"d":"0.10"}},{"$f":"F235+F236*C60","v":1.15}]
[null,null,"c",{"v":-0.0161,"d":"-0.016"}]
[null,"Média"," Yo + ax + bx2 + cx3 ",null,"Formula2 = Yo + ax "]
[null,null,"Yo",{"v":0.1,"d":"0.100"},"Yo",1.15]
[null,null,"a",{"v":0.0024,"d":"0.002"},"a",-0.05]
[null,null,"b",{"v":0.2183,"d":"0.218"},{"$f":"D240+D241*C60+D242*C60^2+D243*C60^3","v":{"v":0.1,"d":"0.10"}},{"$f":"F240+F241*C60","v":1.15}]
[null,null,"c",{"v":-0.0397,"d":"-0.040"}]
[null,"Muito Argilosa"," Yo + ax + bx2 + cx3 ",null,"Formula2 = Yo + ax "]
[null,null,"Yo",{"v":0.1,"d":"0.100"},"Yo",1.15]
[null,null,"a",{"v":-0.0486,"d":"-0.049"},"a",{"v":-0.0288,"d":"-0.03"}]
[null,null,"b",{"v":0.0984,"d":"0.098"},{"$f":"D245+D246*C60+D247*C60^2+D248*C60^3","v":{"v":0.1,"d":"0.10"}},{"$f":"F245+F246*C60","v":1.15}]
[null,null,"c",{"v":-0.0107,"d":"-0.011"}]
[]
[]
[null,"P - Fator de Ponderação\t\t\t\t"]
[null,"Classificação",{"$nulls":3},"Ponderação"]
[null,"Arenosa","Média","Argilosa","Muito Arg."]
[null,{"v":0,"d":"0.00"},{"v":0,"d":"0.00"},{"v":0,"d":"0.00"},{"v":0,"d":"0.00"},{"v":0.1,"d":"0.10"}]
[null,{"v":12.1,"d":"12.10"},{"v":10.1,"d":"10.10"},{"v":5.1,"d":"5.10"},{"v":3.1,"d":"3.10"},0.25]
[null,{"v":18.1,"d":"18.10"},{"v":15.1,"d":"15.10"},{"v":8.1,"d":"8.10"},{"v":4.1,"d":"4.10"},{"v":0.5,"d":"0.50"}]
[null,{"v":25.1,"d":"25.10"},{"v":20.1,"d":"20.10"},{"v":12.1,"d":"12.10"},{"v":6.1,"d":"6.10"},{"v":0.7,"d":"0.70"}]
[null,{"v":40,"d":"40.00"},{"v":30,"d":"30.00"},{"v":18,"d":"18.00"},{"v":9,"d":"9.00"},{"v":1,"d":"1.00"}]
[null,{"v":400,"d":"400.00"},{"v":300,"d":"300.00"},{"v":180,"d":"180.00"},{"v":90,"d":"90.00"},{"v":0.7,"d":"0.70"}]
[]
[null,"Arenosa"," Yo + ax ",null,"F2 = Yo + ax + bx2 ",null,"F3 = Yo + ax "]
[null,null,"Yo",{"v":0.1,"d":"0.10"},"Yo",{"v":-0.4748,"d":"-0.47"},"Yo",{"v":1.0233,"d":"1.02"}]
[null,null,"a",{"v":0.0124,"d":"0.01"},"a",{"v":0.0721,"d":"0.07"},"a",{"v":-0.0008,"d":"-0.00"}]
[{"$nulls":4},"b",{"v":-1E-3,"d":"-0.00"}]
[null,"Argilosa","F1 = Yo + ax + bx2 ",null,"F2 = Yo + ax + bx2 ",null,"F3 = Yo + ax "]
[null,null,"Yo",{"v":0.1,"d":"0.10"},"Yo",{"v":0.1034,"d":"0.10"},"Yo",{"v":1.04333,"d":"1.04"}]
[null,null,"a",{"v":-0.0045,"d":"-0.00"},"a",{"v":0.0483,"d":"0.05"},"a",{"v":-1.9E-3,"d":"-0.00"}]
[null,null,"b",{"v":0.0067,"d":"0.01"},"b",{"v":8.56e-05,"d":"0.00"}]
[null,"Média","F1 = Yo + ax + bx2 ",null,"F2 = Yo + ax + bx2 ",null,"F3 = Yo + ax "]
[null,null,"Yo",{"v":0.1,"d":"0.10"},"Yo",{"v":-0.3015,"d":"-0.30"},"Yo",{"v":1.0333,"d":"1.03"}]
[null,null,"a",{"v":-0.0087,"d":"-0.01"},"a",{"v":0.0639,"d":"0.06"},"a",{"v":-0.0011,"d":"-0.00"}]
[null,null,"b",{"v":2.3E-3,"d":"0.00"},"b",{"v":-0.0007,"d":"-0.00"}]
[null,"Muito Argilosa","F1 = Yo + ax + bx2 ",null,"F2 = Yo + ax + bx2 ",null,"F3 = Yo + ax "]
[null,null,"Yo",{"v":0.1,"d":"0.10"},"Yo",{"v":0.1076,"d":"0.11"},"Yo",{"v":1.0333,"d":"1.03"}]
[null,null,"a",{"v":-0.1041,"d":"-0.10"},"a",{"v":0.0928,"d":"0.09"},"a",{"v":-0.0037,"d":"-0.00"}]
[null,null,"b",{"v":0.0492,"d":"0.05"},"b",{"v":0.0007,"d":"0.00"}]
[null,{"$f":"D262+D263*C61","v":{"v":0.1,"d":"0.10"}},{"$f":"F262+F263*C61+F264*C61^2","v":{"v":-0.4748,"d":"-0.47"}},{"$f":"0.1946+0.0201*C61","v":{"v":0.1946,"d":"0.19"}},{"$f":"H262+H263*C61","v":{"v":1.0233,"d":"1.02"}},{"$f":"IF(C61<=12.1,B277,IF(AND(C61>12.1,C61<25.1),C277,IF(C61>40,E277,D277)))","v":{"v":0.1,"d":"0.10"}}]
[null,{"$f":"D266+D267*C61+D268*C61^2","v":{"v":0.1,"d":"0.10"}},{"$f":"F266+F267*C61+F268*C61^2","v":{"v":0.1034,"d":"0.10"}},{"$f":"H266+H267*C61","v":{"v":1.04333,"d":"1.04"}},{"$f":"IF(AND(C61>8.1,C61<18),C278,IF(C61>=18,D278,B278))","v":{"v":0.1,"d":"0.10"}}]
[null,{"$f":"IF(AND(E59=\"Arenosa\"),IF(C61<0,0,IF(F277>1,1,F277)),0)","v":{"v":0,"d":"0.00"}},{"$f":"IF(AND(E59=\"Média\"),IF(C61<0,0,IF(E280>1,1,E280)),0)","v":{"v":0,"d":"0.00"}},{"$f":"IF(AND(E59=\"Argilosa\"),IF(C61<0,0,IF(E278>1,1,E278)),0)","v":{"v":0,"d":"0.00"}},{"$f":"IF(AND(E59=\"Muito argilosa\"),IF(C61<0,0,IF(E281>1,1,E281)),0)","v":{"v":0,"d":"0.00"}},{"$f":"(B279+C279+D279+E279)","v":{"v":0,"d":"0.00"}}]
[null,{"$f":"D270+D271*C61+D272*C61^2","v":{"v":0.1,"d":"0.10"}},{"$f":"F270+F271*C61+F272*C61^2","v":{"v":-0.3015,"d":"-0.30"}},{"$f":"H270+H271*C61","v":{"v":1.0333,"d":"1.03"}},{"$f":"IF(AND(C61>15.1,C61<30),C280,IF(C61>=30,D280,B280))","v":{"v":0.1,"d":"0.10"}}]
[null,{"$f":"D274+D275*C61+D276*C61^2","v":{"v":0.1,"d":"0.10"}},{"$f":"F274+F275*C61+F276*C61^2","v":{"v":0.1076,"d":"0.11"}},{"$f":"H274+H275*C61","v":{"v":1.0333,"d":"1.03"}},{"$f":"IF(AND(C61>4.1,C61<9),C281,IF(C61>=9,D281,B281))","v":{"v":0.1,"d":"0.10"}}]
[]
[null,"Ca - Fator de Ponderação"]
[null,"Classificação","Ponderação"]
[null,{"v":0,"d":"0.00"},{"v":0.1,"d":"0.10"}]
[null,0.41,0.25]
[null,1.21,{"v":0.5,"d":"0.50"}]
[null,2.41,{"v":0.7,"d":"0.70"}]
[null,{"v":4,"d":"4.00"},{"v":1,"d":"1.00"}]
[null,{"v":20,"d":"20.00"},{"v":0.7,"d":"0.70"}]
[]
[null,"Ca - Fórmulas"]
[null,"F1 = Yo + ax + bx2 ",null,null,"F2 = Yo + ax + bx2 ",null,"F3 = Yo + ax "]
[null,"Yo",{"v":0.1,"d":"0.10"},null,"Yo",{"v":0.3213,"d":"0.32"},"Yo",{"v":1.075,"d":"1.08"}]
[null,"a",{"v":0.3839,"d":"0.38"},null,"a",{"v":0.1381,"d":"0.14"},"a",{"v":-0.0188,"d":"-0.02"}]
[null,"b",{"v":-0.0441,"d":"-0.04"},null,"b",{"v":0.0079,"d":"0.01"}]
[]
[null,null,{"$f":"C294+C295*C62+C296*C62^2","v":{"v":0.1,"d":"0.10"}},{"$f":"F294+F295*C62+F296*C62^2","v":{"v":0.3213,"d":"0.32"}},{"$f":"H294+H295*C62","v":{"v":1.075,"d":"1.08"}},{"$f":"IF(AND(C62>1.21,C62<4),D298,IF(C62>=4,E298,C298))","v":{"v":0.1,"d":"0.10"}}]
[]
[null,"Mg - Fator de Ponderação\t"]
[null,"Classificação","Ponderação"]
[null,{"v":0,"d":"0.00"},{"v":0.1,"d":"0.10"}]
[null,0.16,0.25]
[null,0.46,{"v":0.5,"d":"0.50"}]
[null,0.91,{"v":0.7,"d":"0.70"}]
[null,{"v":1.5,"d":"1.50"},{"v":1,"d":"1.00"}]
[null,{"v":7.5,"d":"7.50"},{"v":0.7,"d":"0.70"}]
[]
[null,"Mg - Fórmulas"]
[null,"F1 = Yo + ax + bx2 ",null,null,"F2 = Yo + ax + bx2 ",null,"F3 = Yo + ax "]
[null,"Yo",{"v":0.1,"d":"0.10"},null,"Yo",{"v":0.3213,"d":"0.32"},"Yo",{"v":1.075,"d":"1.08"}]
[null,"a",{"v":0.9737,"d":"0.97"},null,"a",{"v":0.3601,"d":"0.36"},"a",-0.05]
[null,"b",{"v":-0.2264,"d":"-0.23"},null,"b",{"v":0.0616,"d":"0.06"}]
[null,null,{"$f":"C311+C312*C63+C313*C63^2","v":{"v":0.1,"d":"0.10"}},{"$f":"F311+F312*C63+F313*C63^2","v":{"v":0.3213,"d":"0.32"}},{"$f":"H311+H312*C63","v":{"v":1.075,"d":"1.08"}},{"$f":"IF(AND(C63>0.46,C63<1.5),D314,IF(C63>=1.5,E314,C314))","v":{"v":0.1,"d":"0.10"}}]
[]
[null,"K - Fator de Ponderação\t"]
[null,"Classificação","Ponderação"]
[null,{"v":0,"d":"0.00"},{"v":0.1,"d":"0.10"}]
[null,{"v":16,"d":"16.00"},0.25]
[null,{"v":41,"d":"41.00"},{"v":0.5,"d":"0.50"}]
[null,{"v":71,"d":"71.00"},{"v":0.7,"d":"0.70"}]
[null,{"v":120,"d":"120.00"},{"v":1,"d":"1.00"}]
[null,{"v":600,"d":"600.00"},{"v":0.7,"d":"0.70"}]
[]
[null,"K - Fórmulas"]
[null,"F1 = Yo + ax + bx2 ",null,null,"F2 = Yo + ax + bx2 ",null,"F3 = Yo + ax "]
[null,"Yo",{"v":0.1,"d":"0.10"},null,"Yo",{"v":0.2066,"d":"0.21"},"Yo",{"v":1.075,"d":"1.08"}]
[null,"a",{"v":0.0091,"d":"0.01"},null,"a",{"v":0.0074,"d":"0.01"},"a",{"v":-6.2E-4,"d":"-0.00"}]
[null,"b",{"v":1.5244E-5,"d":"0.00"},null,"b",{"v":-6.8888E-6,"d":"-0.00"}]
[null,null,{"$f":"C327+C328*C64+C329*C64^2","v":{"v":0.1,"d":"0.10"}},{"$f":"F327+F328*C64+F329*C64^2","v":{"v":0.2066,"d":"0.21"}},{"$f":"H327+H328*C64","v":{"v":1.075,"d":"1.08"}},{"$f":"IF(AND(C64>41,C64<120),D330,IF(C64>=120,E330,C330))","v":{"v":0.1,"d":"0.10"}}]
[]
[null,"pH - Fator de Ponderação\t"]
[null,"Classificação","Ponderação"]
[null,{"v":5.1,"d":"5.10"},{"v":0.3,"d":"0.30"}]
[null,{"v":5.2,"d":"5.20"},{"v":0.4,"d":"0.40"}]
[null,{"v":5.5,"d":"5.50"},{"v":0.7,"d":"0.70"}]
[null,{"v":6,"d":"6.00"},{"v":1,"d":"1.00"}]
[null,{"v":6.4,"d":"6.40"},{"v":0.7,"d":"0.70"}]
[]
[null,"pH em água - Fórmulas"]
[null,"F1 = Yo + ax + bx2 ",null,null,"F2 = Yo + ax + bx2 "]
[null,"Yo",{"v":-19.1,"d":"-19.10"},null,"Yo",{"v":-42.5,"d":"-42.50"}]
[null,"a",6.35,null,"a",14.75]
[null,"b",{"v":-0.5,"d":"-0.50"},null,"b",-1.25]
[null,{"$f":"-4.8+(1*C65)","v":{"v":-4.8,"d":"-4.80"}},{"$f":"C342+C343*C65+C344*C65^2","v":{"v":-19.1,"d":"-19.10"}},{"$f":"F342+F343*C65+F344*C65^2","v":{"v":-42.5,"d":"-42.50"}},{"$f":"IF(C65>=6.6,F345,IF(AND(C65>=6,C65<6.6),D345,IF(AND(C65>5.2,C65<6),C345,B345)))","v":{"v":-4.8,"d":"-4.80"}}]
[]
[null,"Al - Fator de Ponderação\t"]
[null,"Classificação","Ponderação"]
[null,{"v":0,"d":"0.00"},{"v":0.7,"d":"0.70"}]
[null,0.21,{"v":0.6,"d":"0.60"}]
[null,0.51,{"v":0.5,"d":"0.50"}]
[null,1.01,0.25]
[null,{"v":2,"d":"2.00"},{"v":0,"d":"0.00"}]
[]
[null,"Al - Fórmulas"]
[null,"F1 = Yo + ax + bx2 ",null,null,"F2 = Yo + ax + bx2 "]
[null,"Yo",{"v":0.7,"d":"0.70"},null,"Yo",{"v":0.8406,"d":"0.84"}]
[null,"a",{"v":-0.535,"d":"-0.54"},null,"a",{"v":-0.7525,"d":"-0.75"}]
[null,"b",{"v":0.2801,"d":"0.28"},null,"b",{"v":0.1661,"d":"0.17"}]
[null,null,{"$f":"C357+C358*C66+C359*C66^2","v":{"v":0.7,"d":"0.70"}},{"$f":"F357+F358*C66+F359*C66^2","v":{"v":0.8406,"d":"0.84"}},{"$f":"IF(C66>=0.51,D360,C360)","v":{"v":0.7,"d":"0.70"}}]
[]
[null,"CTC - Fator de Ponderação\t"]
[null,"Classificação","Ponderação"]
[null,{"v":0,"d":"0.00"},{"v":0.1,"d":"0.10"}]
[null,{"v":1.6,"d":"1.60"},0.25]
[null,{"v":4.3,"d":"4.30"},{"v":0.5,"d":"0.50"}]
[null,{"v":8.6,"d":"8.60"},{"v":0.7,"d":"0.70"}]
[null,{"v":15,"d":"15.00"},{"v":1,"d":"1.00"}]
[]
[null,"CTC - Fórmulas"]
[null,"F1 = Yo + ax"]
[null,"Yo",0.1654]
[null,"a",{"v":0.0584,"d":"0.06"}]
[]
[null,null,{"$f":"C372+C373*C67","v":{"v":0.1654,"d":"0.17"}},{"$f":"IF(C375>1,1,C375)","v":{"v":0.1654,"d":"0.17"}},{"$f":"D375","v":{"v":0.1654,"d":"0.17"}}]
[]
[null,"V - Fator de Ponderação\t"]
[null,"Classificação","Ponderação"]
[null,{"v":0,"d":"0.00"},{"v":0.1,"d":"0.10"}]
[null,{"v":15,"d":"15.00"},0.25]
[null,{"v":30,"d":"30.00"},{"v":0.5,"d":"0.50"}]
[null,{"v":60,"d":"60.00"},{"v":0.7,"d":"0.70"}]
[null,{"v":80,"d":"80.00"},{"v":1,"d":"1.00"}]
[]
[null,"V - Fórmulas"]
[null,"Fórmula1 = Yo + ax ",null,"Fórmula2 = Yo + ax+bx2 "]
[null,"Yo",{"v":0.3,"d":"0.30"},null,"Yo",{"v":0.1,"d":"0.10"}]
[null,"a",{"v":0.0067,"d":"0.01"},null,"a",{"v":0.0067,"d":"0.01"}]
[{"$nulls":4},"b",{"v":0.0002,"d":"0.00"}]
[null,null,{"$f":"C387+C388*C68","v":{"v":0.3,"d":"0.30"}},{"$f":"F387+F388*C68+F389*C68^2","v":{"v":0.1,"d":"0.10"}},{"$f":"IF(C68<30,D390,C390)","v":{"v":0.1,"d":"0.10"}}]
[]
[null,"12 - Fórmulas"]
[null,"Fórmula - Média dos resultados parciais da MO, P e V"]
[]
[]
[]
[3,"Fator de Ponderação\t"]
[null,"item 15.1","Ponderação"]
[null,"< 5%",0.55]
[null,"5 - 10%",0.45]
[null,"> 10%",0.35]
[null,"item 15.1","Ponderação"]
[null,"Avançado",{"v":0.5,"d":"0.50"}]
[null,"Intermediário",{"v":0.8,"d":"0.80"}]
[null,"Inicial",1]
[null,"item 15.2","Ponderação"]
[null,"Redução",1.2]
[null,"Inalterado",{"v":1,"d":"1.0"}]
[null,"Intensificação",0.8]
[]
[null,"Fórmulas",null,"< 5%","5% - 10%","> 10%"]
[{"$nulls":3},{"$f":"IF(B420>0,1,\" \")","v":" "},{"$f":"IF(D420>0,1,\" \")","v":" "},{"$f":"IF(F420>0,1,\" \")","v":" "}]
[{"$nulls":3},{"$f":"IF(B418>0,1,\" \")","v":" "},{"$f":"IF(D418>0,1,\" \")","v":" "},{"$f":"IF(F418>0,1,\" \")","v":" "}]
[{"$nulls":3},{"$f":"IF(B416>0,1,\" \")","v":" "},{"$f":"IF(D416>0,1,\" \")","v":" "},{"$f":"IF(F416>0,1,\" \")","v":" "}]
[null,{"$f":"IF(F87<0.05,E87,0)","v":0},null,{"$f":"IF(F87>=0.05,E87,0)","v":0},null,{"$f":"IF(F87>0.1,E87,0)","v":0}]
[null,{"$f":"IF(D87=B425,B415,0)","v":0},null,{"$f":"IF(F415>0.001,0,IF(D87=B425,D415,0))","v":0},null,{"$f":"IF(D87=B425,F415,0)","v":0}]
[null,{"$f":"IF(F87<0.05,E87,0)","v":0},null,{"$f":"IF(F87>=0.05,E87,0)","v":0},null,{"$f":"IF(F87>0.1,E87,0)","v":0}]
[null,{"$f":"IF(D87=B426,B417,0)","v":0},null,{"$f":"IF(F417>0.001,0,IF(D87=B426,D417,0))","v":0},null,{"$f":"IF(D87=B426,F417,0)","v":0}]
[null,{"$f":"IF(F87<0.05,E87,0)","v":0},null,{"$f":"IF(F87>=0.05,E87,0)","v":0},null,{"$f":"IF(F87>0.1,E87,0)","v":0}]
[null,{"$f":"IF(D87=B427,B419,0)","v":0},null,{"$f":"IF(F419>0.001,0,IF(D87=B427,D419,0))","v":0},null,{"$f":"IF(D87=B427,F419,0)","v":0}]
[null,{"$f":"IF(B423>0,B423,0)+IF(C423>0,C423,0)+IF(D423>0,D423,0)","v":{"v":0,"d":"0.00"}}]
[null,{"$f":"IF(D90=D425,1,0)","v":{"v":0,"d":"0.00"}},{"$f":"IF(D90=D426,1,0)","v":{"v":0,"d":"0.00"}},{"$f":"IF(D90=D427,1,0)","v":{"v":0,"d":"0.00"}}]
[null,{"$f":"IF(B416>0,G87*B432,0)+IF(B418>0,G88*B432,0)+IF(B420>0,G90*B432,0)","v":0},{"$f":"IF(D416>0,G87*B433,0)+IF(D418>0,G88*B433,0)+IF(D420>0,G90*B433,0)","v":0},{"$f":"IF(F416>0,G87*B434,0)+IF(F418>0,G88*B434,0)+IF(F420>0,G90*B434,0)","v":0}]
[null,"Unidades",null,"Unidades"]
[null,"Inicial",null,"Redução"]
[null,"Intermediário",null,"Inalterado"]
[null,"Avançado",null,"Intensificação"]
[]
[]
[]
[]
[null,{"$f":"C399","v":0.55}]
[null,{"$f":"C400","v":0.45}]
[null,{"$f":"C401","v":0.35}]
[]
[null,"Fórmula - verifica a proporção da área em processo de degradação em relação à área total e ao grau de intensidade do fenômeno. Após o cálculo, multiplica o valor final pelo fator 1,2, se verificada tendência de redução do estádio de degradação ou pelo fator 0,8, se a tendência é de intensificação do estádio de degradação.\t\t\t\t\t\t\t\n\t\t\t\t\t\t\t\n\t\t\t\t\t\t\t"]
[]
[]
[]
[4,"Fator de Ponderação\t"]
[null,"Alto",{"v":1,"d":"1.0"}]
[null,"Moderado",0.6]
[null,"Incipiente",0.3]
[null,"Situação crítica",0.1]
[]
[]
[null,"Fator de Ponderação"]
[null,{"$f":"E104","v":{"v":1,"d":"1.0"}}]
[null,{"$f":"E105","v":0.4}]
[null,{"$f":"E106","v":0.1}]
[]
[null,"Fórmulas"]
[null,{"$f":"D98/D457","v":{"$error":"#DIV/0!"}},null,{"$f":"B453","v":{"$error":"#DIV/0!"}}]
[null,{"$f":"D99/D457","v":{"$error":"#DIV/0!"}},null,{"$f":"B454","v":{"$error":"#DIV/0!"}}]
[null,{"$f":"D100/D457","v":{"$error":"#DIV/0!"}},null,{"$f":"B455","v":{"$error":"#DIV/0!"}}]
[null,{"$f":"D101/D457","v":{"$error":"#DIV/0!"}},null,{"$f":"B456","v":{"$error":"#DIV/0!"}}]
[null,"Área total do talhão (ha) =>",{"$f":"C6","v":{"v":0,"d":"0.00"}},{"$f":"D98+D99+D100+D101","v":{"v":0,"d":"0.0"}}]
[]
[{"$nulls":3},{"$f":"IF(D104=B463,B448,0)","v":0}]
[null,{"$f":"(D453*C441)+(D454*C442)+(D455*C443)+(D456*C444)","v":{"$error":"#DIV/0!"}},{"$f":"SUM(D459:D461)","v":{"v":0,"d":"0.00"}},{"$f":"IF(D104=B464,B449,0)","v":0}]
[{"$nulls":3},{"$f":"IF(D104=B465,B450,0)","v":0}]
[null,"Unidades"]
[null,"Suficiente"]
[null,"Insuficiente"]
[null,"Situação crítica"]
[]
[5,"Fator de Ponderação\t"]
[null,"Alto",{"v":1,"d":"1.0"}]
[null,"Moderado",0.6]
[null,"Incipiente",0.3]
[null,"Situação crítica",0.1]
[]
[]
[null,{"$f":"D114/C479","v":{"$error":"#DIV/0!"}},{"$f":"B474","v":{"$error":"#DIV/0!"}}]
[null,{"$f":"D115/C479","v":{"$error":"#DIV/0!"}},{"$f":"B475","v":{"$error":"#DIV/0!"}}]
[null,{"$f":"D116/C479","v":{"$error":"#DIV/0!"}},{"$f":"B476","v":{"$error":"#DIV/0!"}}]
[null,{"$f":"D117/C479","v":{"$error":"#DIV/0!"}},{"$f":"B477","v":{"$error":"#DIV/0!"}}]
[]
[null,null,{"$f":"SUM(D114:D117)","v":{"v":0,"d":"0.0"}}]
[]
[]
[]
[null,"Análise Foliar (opcional)"]
[]
[{"$nulls":4},"Resultado"]
[null,"P (g/kg)",{"$f":"C32","v":{"v":0,"d":"0.0"}},null,{"$f":"IF(ISBLANK(C32),\"\",IF(C32<=H548,G487,IF(AND(C32>H548,C32<=H549),G488,IF(C32>H549,G489))))","v":""}]
[null,"K (g/kg)",{"v":0,"d":"0.0"},null,{"$f":"IF(ISBLANK(C33),\"\",IF(C33<=H552,G487,IF(AND(C33>H552,C33<=H553),G488,IF(C33>H553,G489))))","v":""},null,"Baixo"]
[null,"N (g/kg)",{"v":0,"d":"0.0"},null,{"$f":"IF(ISBLANK(C34),\"\",IF(C34<=H556,G487,IF(AND(C34>H556,C34<=H557),G488,IF(C34>H557,G489))))","v":""},null,"Adequado"]
[null,"S (g/kg)",{"v":0,"d":"0.0"},null,{"$f":"IF(ISBLANK(C35),\"\",IF(C35<=H560,G487,IF(AND(C35>H560,C35<=H561),G488,IF(C35>H561,G489))))","v":""},null,"Alto"]
[null,"Ca (g/kg)",{"v":0,"d":"0.0"},null,{"$f":"IF(ISBLANK(C36),\"\",IF(C36<=H564,G487,IF(AND(C36>H564,C36<=H565),G488,IF(C36>H565,G489))))","v":""}]
[null,"Mg (g/kg)",{"v":0,"d":"0.0"},null,{"$f":"IF(ISBLANK(C37),\"\",IF(C37<=H568,G487,IF(AND(C37>H568,C37<=H569),G488,IF(C37>H569,G489))))","v":""}]
[null,"B (mg/kg)",{"v":0,"d":"0.0"},null,{"$f":"IF(ISBLANK(C38),\"\",IF(C38<=H572,G487,IF(AND(C38>H572,C38<=H573),G488,IF(C38>H573,G489))))","v":""}]
[null,"Zn (mg/kg)",{"v":0,"d":"0.0"},null,{"$f":"IF(ISBLANK(C39),\"\",IF(C39<=H576,G487,IF(AND(C39>H576,C39<=H577),G488,IF(C39>H577,G489))))","v":""}]
[null,"Fe (mg/kg)",{"v":0,"d":"0.0"},null,{"$f":"IF(ISBLANK(C40),\"\",IF(C40<=H580,G487,IF(AND(C40>H580,C40<=H581),G488,IF(C40>H581,G489))))","v":""}]
[null,"Mn (mg/kg)",{"v":0,"d":"0.0"},null,{"$f":"IF(ISBLANK(C41),\"\",IF(C41<=H584,G487,IF(AND(C41>H584,C41<=H585),G488,IF(C41>H585,G489))))","v":""}]
[null,"Cu (mg/kg)",{"v":0,"d":"0.0"},null,{"$f":"IF(ISBLANK(C42),\"\",IF(C42<=H588,G487,IF(AND(C42>H588,C42<=H589),G488,IF(C42>H589,G489))))","v":""}]
[]
[]
[null,null,"Unidades","Unidades","Unidades","Unidades","Unidades"]
[null,"Nível","Soja","Milho","Café","Pastagem","Outros"]
["P (g/kg)","Baixo"]
[null,"Adequado",2.8,2.5,1.5,0.8]
[null,null,3.9,3.5,{"v":2,"d":"2.0"},{"v":3,"d":"3.0"}]
[null,"Alto"]
["K (g/kg)","Baixo"]
[null,"Adequado",14.4,17.5,{"v":19,"d":"19.0"},{"v":12,"d":"12.0"}]
[null,null,20.3,22.5,{"v":24,"d":"24.0"},{"v":25,"d":"25.0"}]
[null,"Alto"]
["N (g/kg)","Baixo"]
[null,"Adequado",{"v":50.62,"d":"50.6"},27.5,{"v":23,"d":"23.0"},{"v":12,"d":"12.0"}]
[null,null,62.4,32.5,{"v":32,"d":"32.0"},{"v":20,"d":"20.0"}]
[null,"Alto"]
["S (g/kg)","Baixo"]
[null,"Adequado",2.4,{"v":1,"d":"1.0"},1.5,0.8]
[null,null,3.3,{"v":2,"d":"2.0"},{"v":2,"d":"2.0"},2.5]
[null,"Alto"]
["Ca (g/kg)","Baixo"]
[null,"Adequado",6.2,2.5,{"v":10,"d":"10.0"},{"v":2,"d":"2.0"}]
[null,null,11.6,{"v":4,"d":"4.0"},{"v":14,"d":"14.0"},{"v":6,"d":"6.0"}]
[null,"Alto"]
["Mg (g/kg)","Baixo"]
[null,"Adequado",{"v":3,"d":"3.0"},2.5,3.1,1.5]
[null,null,4.9,{"v":4,"d":"4.0"},3.6,{"v":4,"d":"4.0"}]
[null,"Alto"]
["B (mg/kg)","Baixo"]
[null,"Adequado",{"v":37,"d":"37.0"},{"v":4,"d":"4.0"},{"v":59,"d":"59.0"},{"v":10,"d":"10.0"}]
[null,null,{"v":56,"d":"56.0"},{"v":20,"d":"20.0"},{"v":80,"d":"80.0"},{"v":20,"d":"20.0"}]
[null,"Alto"]
["Zn (mg/kg)","Baixo"]
[null,"Adequado",{"v":41,"d":"41.0"},{"v":20,"d":"20.0"},{"v":8,"d":"8.0"},{"v":20,"d":"20.0"}]
[null,null,{"v":78,"d":"78.0"},{"v":70,"d":"70.0"},{"v":16,"d":"16.0"},{"v":50,"d":"50.0"}]
[null,"Alto"]
["Fe (mg/kg)","Baixo"]
[null,"Adequado",{"v":77,"d":"77.0"},{"v":20,"d":"20.0"},{"v":90,"d":"90.0"},{"v":50,"d":"50.0"}]
[null,null,{"v":155,"d":"155.0"},{"v":250,"d":"250.0"},{"v":180,"d":"180.0"},{"v":250,"d":"250.0"}]
[null,"Alto"]
["Mn (mg/kg)","Baixo"]
[null,"Adequado",{"v":38,"d":"38.0"},{"v":20,"d":"20.0"},{"v":120,"d":"120.0"},{"v":40,"d":"40.0"}]
[null,null,{"v":97,"d":"97.0"},{"v":150,"d":"150.0"},{"v":210,"d":"210.0"},{"v":250,"d":"250.0"}]
[null,"Alto"]
["Cu (mg/kg)","Baixo"]
[null,"Adequado",{"v":7,"d":"7.0"},{"v":6,"d":"6.0"},{"v":8,"d":"8.0"},{"v":4,"d":"4.0"}]
[null,null,{"v":12,"d":"12.0"},{"v":20,"d":"20.0"},{"v":16,"d":"16.0"},{"v":12,"d":"12.0"}]
[null,"Alto"]
[null,null,"Folha sem pecíolo (Fonte Documento 458 - Tecnologias de manejo da fertilidade do solo e avaliação do estado nutricional da soja - Embrapa, 2023)","Fonte: Fertilidade de solos: nutrição e adubação do milho - Embrapa (2007)","Fonte: Documentos 14 - Estado nutricional dos solos e cafeeiros da região das Matas de Minas - Embrapa - 2021","Fonte: Cerrado: correção do solo e adubação - Embrapa - 2004"]
[null,"Nível"]
["P (g/kg)","Baixo",{"$f":"IF($C$31=$C$500,C501,\"\")","v":""},{"$f":"IF($C$31=$D$500,D501,\"\")","v":""},{"$f":"IF($C$31=$E$500,E501,\"\")","v":""},{"$f":"IF($C$31=$F$500,F501,\"\")","v":""},{"$f":"IF($C$31=$G$500,G501,\"\")","v":""},{"$f":"SUM(C547:G547)","v":{"v":0,"d":"0.0"}}]
[null,"Adequado","","","","","",{"$f":"SUM(C548:G548)","v":{"v":0,"d":"0.0"}}]
[null,null,"","","","","",{"v":0,"d":"0.0"}]
[null,"Alto","","","","","",{"v":0,"d":"0.0"}]
["K (g/kg)","Baixo","","","","","",{"v":0,"d":"0.0"}]
[null,"Adequado","","","","","",{"v":0,"d":"0.0"}]
[null,null,"","","","","",{"v":0,"d":"0.0"}]
[null,"Alto","","","","","",{"v":0,"d":"0.0"}]
["N (g/kg)","Baixo","","","","","",{"v":0,"d":"0.0"}]
[null,"Adequado","","","","","",{"v":0,"d":"0.0"}]
[null,null,"","","","","",{"v":0,"d":"0.0"}]
[null,"Alto","","","","","",{"v":0,"d":"0.0"}]
["S (g/kg)","Baixo","","","","","",{"v":0,"d":"0.0"}]
[null,"Adequado","","","","","",{"v":0,"d":"0.0"}]
[null,null,"","","","","",{"v":0,"d":"0.0"}]
[null,"Alto","","","","","",{"v":0,"d":"0.0"}]
["Ca (g/kg)","Baixo","","","","","",{"v":0,"d":"0.0"}]
[null,"Adequado","","","","","",{"v":0,"d":"0.0"}]
[null,null,"","","","","",{"v":0,"d":"0.0"}]
[null,"Alto","","","","","",{"v":0,"d":"0.0"}]
["Mg (g/kg)","Baixo","","","","","",{"v":0,"d":"0.0"}]
[null,"Adequado","","","","","",{"v":0,"d":"0.0"}]
[null,null,"","","","","",{"v":0,"d":"0.0"}]
[null,"Alto","","","","","",{"v":0,"d":"0.0"}]
["B (mg/kg)","Baixo","","","","","",{"v":0,"d":"0.0"}]
[null,"Adequado","","","","","",{"v":0,"d":"0.0"}]
[null,null,"","","","","",{"v":0,"d":"0.0"}]
[null,"Alto","","","","","",{"v":0,"d":"0.0"}]
["Zn (mg/kg)","Baixo","","","","","",{"v":0,"d":"0.0"}]
[null,"Adequado","","","","","",{"v":0,"d":"0.0"}]
[null,null,"","","","","",{"v":0,"d":"0.0"}]
[null,"Alto","","","","","",{"v":0,"d":"0.0"}]
["Fe (mg/kg)","Baixo","","","","","",{"v":0,"d":"0.0"}]
[null,"Adequado","","","","","",{"v":0,"d":"0.0"}]
[null,null,"","","","","",{"v":0,"d":"0.0"}]
[null,"Alto","","","","","",{"v":0,"d":"0.0"}]
["Mn (mg/kg)","Baixo","","","","","",{"v":0,"d":"0.0"}]
[null,"Adequado","","","","","",{"v":0,"d":"0.0"}]
[null,null,"","","","","",{"v":0,"d":"0.0"}]
[null,"Alto","","","","","",{"v":0,"d":"0.0"}]
["Cu (mg/kg)","Baixo","","","","","",{"v":0,"d":"0.0"}]
[null,"Adequado","","","","","",{"v":0,"d":"0.0"}]
[null,null,"","","","","",{"v":0,"d":"0.0"}]
[null,"Alto","","","","","",{"v":0,"d":"0.0"}]